{"text_format":"3","workbook":"xlsx","n_sheets":18,"sheets":["Übersicht","Wettkampf 1","2","3","4","5","6","7","8","9","10","11","12","Ausdruck","Ausdruck blank","Übersicht Schützen","Formelhilfe","Übersicht Gruppen"],"not_rendered":{"images":2,"macros":1,"defined_names":12},"read":"whole","date_system":"1900"}

{"sheet":"Übersicht","index":0,"n_rows":54,"n_cols":22,"rows_kept":54,"merged":[[0,10,0,11],[0,12,0,14],[0,15,0,16],[2,9,2,10],[2,17,2,18],[2,19,2,20],[3,1,3,2],[3,21,5,21],[5,1,5,2],[6,1,6,2],[7,1,7,2],[8,1,8,2],[9,1,9,2],[10,1,10,2],[14,9,14,10],[14,17,14,18],[14,19,14,20],[14,21,16,21]]}
[{"$nulls":3},"Kreisrundenwettkampf",{"$nulls":5},"Saison","2024/2025",null,"3. Kreisklasse",null,null,"Damen"]
[]
[null,null,"Wettkampftag:","18.08.","01.09.","15.09.","29.09.","13.10.","17.11.","Hinrunde",null,"12.01.","26.01.","09.02.","23.02.","09.03.","23.03.","Rückrunde",null,"Serie komplett"]
["Pos.","Verein / Gruppe",null,"Börger","Neuvrees","Börgermoor","Lorup","Ostenwalde","Spahnharrenstätte","Schnitt","Gesamt ",{"$f":"D4","v":"Börger"},"Börgermoor","Neuvrees","Lorup","Ostenwalde","Spahnharrenstätte","Schnitt","Gesamt ","Schnitt","Gesamt","Differenz"]
[]
[1,{"$f":"'Übersicht Gruppen'!B2","v":"Lorup III"},null,{"$f":"'Übersicht Gruppen'!C2","v":931.6},{"$f":"'Übersicht Gruppen'!D2","v":{"v":931.3000000000001,"d":"931.3"}},{"$f":"'Übersicht Gruppen'!E2","v":927.6},{"$f":"'Übersicht Gruppen'!F2","v":933.5},{"$f":"'Übersicht Gruppen'!G2","v":920.3},{"$f":"'Übersicht Gruppen'!H2","v":924.4},{"$f":"'Übersicht Gruppen'!I2","v":{"v":928.1166666666667,"d":"928.12"}},{"$f":"SUM(D6:I6)","v":{"v":5568.7,"d":"5,568.7"}},{"$f":"'Übersicht Gruppen'!K2","v":924.1},{"$f":"'Übersicht Gruppen'!L2","v":{"v":926,"d":"926.0"}},{"$f":"'Übersicht Gruppen'!M2","v":927.7},{"$f":"'Übersicht Gruppen'!N2","v":931.5},{"$f":"'Übersicht Gruppen'!O2","v":923.7},{"$f":"'Übersicht Gruppen'!P2","v":{"v":0,"d":"0.0"}},{"$f":"'Übersicht Gruppen'!Q2","v":{"v":926.6,"d":"926.60"}},{"$f":"SUM(L6:Q6)","v":{"v":4633,"d":"4,633.0"}},{"$f":"'Übersicht Gruppen'!S2","v":{"v":927.4272727272728,"d":"927.43"}},{"$f":"SUM(S6+K6)","v":{"v":10201.7,"d":"10,201.7"}}]
[2,{"$f":"'Übersicht Gruppen'!B3","v":"Spahnharrenstätte I"},null,{"$f":"'Übersicht Gruppen'!C3","v":{"v":919,"d":"919.0"}},{"$f":"'Übersicht Gruppen'!D3","v":{"v":932.8999999999999,"d":"932.9"}},{"$f":"'Übersicht Gruppen'!E3","v":928.2},{"$f":"'Übersicht Gruppen'!F3","v":{"v":928.9000000000001,"d":"928.9"}},{"$f":"'Übersicht Gruppen'!G3","v":917.3},{"$f":"'Übersicht Gruppen'!H3","v":928.2},{"$f":"'Übersicht Gruppen'!I3","v":925.75},{"v":5554.5,"d":"5,554.5"},{"$f":"'Übersicht Gruppen'!K3","v":927.2},{"$f":"'Übersicht Gruppen'!L3","v":919.2},{"$f":"'Übersicht Gruppen'!M3","v":928.9},{"$f":"'Übersicht Gruppen'!N3","v":{"v":922,"d":"922.0"}},{"$f":"'Übersicht Gruppen'!O3","v":924.2},{"$f":"'Übersicht Gruppen'!P3","v":{"v":0,"d":"0.0"}},{"$f":"'Übersicht Gruppen'!Q3","v":{"v":924.3,"d":"924.30"}},{"v":4621.5,"d":"4,621.5"},{"$f":"'Übersicht Gruppen'!S3","v":{"v":925.0909090909091,"d":"925.09"}},{"$f":"SUM(S7+K7)","v":{"v":10176,"d":"10,176.0"}},{"$f":"(U6-U7)*-1","v":{"v":-25.700000000000728,"d":"-25.7"}}]
[3,{"$f":"'Übersicht Gruppen'!B4","v":"Börger II"},null,{"$f":"'Übersicht Gruppen'!C4","v":912.5},{"$f":"'Übersicht Gruppen'!D4","v":{"v":915.5999999999999,"d":"915.6"}},{"$f":"'Übersicht Gruppen'!E4","v":922.7},{"$f":"'Übersicht Gruppen'!F4","v":935.3},{"$f":"'Übersicht Gruppen'!G4","v":921.1},{"$f":"'Übersicht Gruppen'!H4","v":{"v":933.0999999999999,"d":"933.1"}},{"$f":"'Übersicht Gruppen'!I4","v":{"v":923.3833333333336,"d":"923.38"}},{"v":5540.300000000001,"d":"5,540.3"},{"$f":"'Übersicht Gruppen'!K4","v":{"v":923,"d":"923.0"}},{"$f":"'Übersicht Gruppen'!L4","v":{"v":927.5999999999999,"d":"927.6"}},{"$f":"'Übersicht Gruppen'!M4","v":927.5},{"$f":"'Übersicht Gruppen'!N4","v":928.8},{"$f":"'Übersicht Gruppen'!O4","v":{"v":928.6999999999999,"d":"928.7"}},{"$f":"'Übersicht Gruppen'!P4","v":{"v":0,"d":"0.0"}},{"$f":"'Übersicht Gruppen'!Q4","v":{"v":927.1199999999999,"d":"927.12"}},{"v":4635.599999999999,"d":"4,635.6"},{"$f":"'Übersicht Gruppen'!S4","v":{"v":925.0818181818183,"d":"925.08"}},{"v":10175.900000000001,"d":"10,175.9"},{"$f":"(U7-U8)*-1","v":{"v":-0.09999999999854481,"d":"-0.1"}}]
[4,{"$f":"'Übersicht Gruppen'!B5","v":"Neuvrees II"},null,{"$f":"'Übersicht Gruppen'!C5","v":{"v":924,"d":"924.0"}},{"$f":"'Übersicht Gruppen'!D5","v":{"v":921.9000000000001,"d":"921.9"}},{"$f":"'Übersicht Gruppen'!E5","v":925.5},{"$f":"'Übersicht Gruppen'!F5","v":{"v":931.3000000000001,"d":"931.3"}},{"$f":"'Übersicht Gruppen'!G5","v":913.8},{"$f":"'Übersicht Gruppen'!H5","v":933.5},{"$f":"'Übersicht Gruppen'!I5","v":{"v":925,"d":"925.00"}},{"v":5550,"d":"5,550.0"},{"$f":"'Übersicht Gruppen'!K5","v":{"v":922.5999999999999,"d":"922.6"}},{"$f":"'Übersicht Gruppen'!L5","v":{"v":927.0999999999999,"d":"927.1"}},{"$f":"'Übersicht Gruppen'!M5","v":925.2},{"$f":"'Übersicht Gruppen'!N5","v":929.3},{"$f":"'Übersicht Gruppen'!O5","v":913.5},{"$f":"'Übersicht Gruppen'!P5","v":{"v":0,"d":"0.0"}},{"$f":"'Übersicht Gruppen'!Q5","v":923.54},{"v":4617.7,"d":"4,617.7"},{"$f":"'Übersicht Gruppen'!S5","v":{"v":924.3363636363637,"d":"924.34"}},{"v":10167.7,"d":"10,167.7"},{"v":-8.200000000000728,"d":"-8.2"}]
[5,{"$f":"'Übersicht Gruppen'!B6","v":"Börgermoor I"},null,{"$f":"'Übersicht Gruppen'!C6","v":911.8},{"$f":"'Übersicht Gruppen'!D6","v":914.6},{"$f":"'Übersicht Gruppen'!E6","v":922.2},{"$f":"'Übersicht Gruppen'!F6","v":933.2},{"$f":"'Übersicht Gruppen'!G6","v":{"v":921.9000000000001,"d":"921.9"}},{"$f":"'Übersicht Gruppen'!H6","v":{"v":925.3000000000001,"d":"925.3"}},{"$f":"'Übersicht Gruppen'!I6","v":{"v":921.5000000000001,"d":"921.50"}},{"v":5529.000000000001,"d":"5,529.0"},{"$f":"'Übersicht Gruppen'!K6","v":923.9},{"$f":"'Übersicht Gruppen'!L6","v":{"v":934.1000000000001,"d":"934.1"}},{"$f":"'Übersicht Gruppen'!M6","v":{"v":928.0000000000001,"d":"928.0"}},{"$f":"'Übersicht Gruppen'!N6","v":918.3},{"$f":"'Übersicht Gruppen'!O6","v":{"v":916.8000000000001,"d":"916.8"}},{"$f":"'Übersicht Gruppen'!P6","v":{"v":0,"d":"0.0"}},{"$f":"'Übersicht Gruppen'!Q6","v":924.22},{"v":4621.1,"d":"4,621.1"},{"$f":"'Übersicht Gruppen'!S6","v":{"v":922.7363636363636,"d":"922.74"}},{"v":10150.100000000002,"d":"10,150.1"},{"v":-17.599999999998545,"d":"-17.6"}]
[6,{"$f":"'Übersicht Gruppen'!B7","v":"Ostenwalde II"},null,{"$f":"'Übersicht Gruppen'!C7","v":911.2},{"$f":"'Übersicht Gruppen'!D7","v":{"v":913.9999999999999,"d":"914.0"}},{"$f":"'Übersicht Gruppen'!E7","v":924.3},{"$f":"'Übersicht Gruppen'!F7","v":918.2},{"$f":"'Übersicht Gruppen'!G7","v":907.8},{"$f":"'Übersicht Gruppen'!H7","v":909.3},{"$f":"'Übersicht Gruppen'!I7","v":{"v":914.1333333333333,"d":"914.13"}},{"v":5484.8,"d":"5,484.8"},{"$f":"'Übersicht Gruppen'!K7","v":912.4},{"$f":"'Übersicht Gruppen'!L7","v":908.8},{"$f":"'Übersicht Gruppen'!M7","v":912.5},{"$f":"'Übersicht Gruppen'!N7","v":912.4},{"$f":"'Übersicht Gruppen'!O7","v":{"v":917,"d":"917.0"}},{"$f":"'Übersicht Gruppen'!P7","v":{"v":0,"d":"0.0"}},{"$f":"'Übersicht Gruppen'!Q7","v":{"v":912.6200000000001,"d":"912.62"}},{"v":4563.1,"d":"4,563.1"},{"$f":"'Übersicht Gruppen'!S7","v":{"v":913.4454545454545,"d":"913.45"}},{"v":10047.900000000001,"d":"10,047.9"},{"v":-102.20000000000073,"d":"-102.2"}]
[]
[null,null,"Schnitt:",{"$f":"AVERAGE(D6:D11)","v":{"v":918.3499999999999,"d":"918.4"}},{"$f":"AVERAGE(E6:E11)","v":{"v":921.7166666666667,"d":"921.7"}},{"v":925.0833333333334,"d":"925.1"},{"v":930.0666666666666,"d":"930.1"},{"v":917.0333333333333,"d":"917.0"},{"v":925.6333333333333,"d":"925.6"},{"v":922.9805555555557,"d":"922.98"},{"$f":"SUM(K6:K11)/6","v":{"v":5537.883333333334,"d":"5,537.9"}},{"v":922.1999999999999,"d":"922.2"},{"v":923.8000000000001,"d":"923.8"},{"v":924.9666666666667,"d":"925.0"},{"v":923.7166666666667,"d":"923.7"},{"v":920.65,"d":"920.7"},{"v":0,"d":"0.0"},{"v":923.0666666666666,"d":"923.07"},{"v":4615.333333333333,"d":"4615.3"},{"v":923.0196969696971,"d":"923.02"},{"v":10153.216666666669,"d":"10,153.2"}]
[]
[{"$nulls":9},"Hinrunde",{"$nulls":7},"Rückrunde",null,"Serie komplett",null,"Differenz"]
["Pos.","Vorname Name","Verein / Gruppe",{"$nulls":6},"Schnitt","Gesamt",{"$nulls":6},"Schnitt","Gesamt","Schnitt","Gesamt"]
[1,{"$f":"'Übersicht Schützen'!A2","v":"Nadine Krömer"},{"$f":"'Übersicht Schützen'!B2","v":"Lorup III"},{"$f":"'Übersicht Schützen'!C2","v":314.2},{"$f":"'Übersicht Schützen'!D2","v":313.3},{"$f":"'Übersicht Schützen'!E2","v":313.8},{"$f":"'Übersicht Schützen'!F2","v":315.1},{"$f":"'Übersicht Schützen'!G2","v":308.1},{"$f":"'Übersicht Schützen'!H2","v":312.2},{"$f":"'Übersicht Schützen'!I2","v":{"v":312.78333333333336,"d":"312.78"}},{"$f":"SUM(D17:I17)","v":{"v":1876.7,"d":"1,876.7"}},{"$f":"'Übersicht Schützen'!L2","v":310.4},{"$f":"'Übersicht Schützen'!M2","v":312.1},{"$f":"'Übersicht Schützen'!N2","v":312.6},{"$f":"'Übersicht Schützen'!O2","v":315.7},{"$f":"'Übersicht Schützen'!P2","v":309.8},{"$f":"'Übersicht Schützen'!Q2","v":{"v":0,"d":"0.0"}},{"$f":"'Übersicht Schützen'!R2","v":312.12},{"$f":"SUM(L17:Q17)","v":{"v":1560.6,"d":"1,560.6"}},{"$f":"'Übersicht Schützen'!U2","v":{"v":312.48181818181814,"d":"312.48"}},{"$f":"SUM(K17+S17)","v":{"v":3437.3,"d":"3,437.3"}}]
[2,{"$f":"'Übersicht Schützen'!A3","v":"Anna Temmen"},{"$f":"'Übersicht Schützen'!B3","v":"Ostenwalde II"},{"$f":"'Übersicht Schützen'!C3","v":307.5},{"$f":"'Übersicht Schützen'!D3","v":311.9},{"$f":"'Übersicht Schützen'!E3","v":316.6},{"$f":"'Übersicht Schützen'!F3","v":{"v":315,"d":"315.0"}},{"$f":"'Übersicht Schützen'!G3","v":311.6},{"$f":"'Übersicht Schützen'!H3","v":311.6},{"$f":"'Übersicht Schützen'!I3","v":{"v":312.3666666666666,"d":"312.37"}},{"$f":"SUM(D18:I18)","v":{"v":1874.1999999999998,"d":"1,874.2"}},{"$f":"'Übersicht Schützen'!L3","v":309.5},{"$f":"'Übersicht Schützen'!M3","v":311.3},{"$f":"'Übersicht Schützen'!N3","v":310.8},{"$f":"'Übersicht Schützen'!O3","v":313.3},{"$f":"'Übersicht Schützen'!P3","v":312.2},{"$f":"'Übersicht Schützen'!Q3","v":{"v":0,"d":"0.0"}},{"$f":"'Übersicht Schützen'!R3","v":{"v":311.41999999999996,"d":"311.42"}},{"$f":"SUM(L18:Q18)","v":{"v":1557.1,"d":"1,557.1"}},{"$f":"'Übersicht Schützen'!U3","v":{"v":311.93636363636364,"d":"311.94"}},{"$f":"SUM(K18+S18)","v":{"v":3431.2999999999997,"d":"3,431.3"}},{"$f":"(U17-U18)*-1","v":{"v":-6.000000000000455,"d":"-6.0"}}]
[3,{"$f":"'Übersicht Schützen'!A4","v":"Margret Pohlgeers"},{"$f":"'Übersicht Schützen'!B4","v":"Börger II"},{"$f":"'Übersicht Schützen'!C4","v":310.6},{"$f":"'Übersicht Schützen'!D4","v":307.4},{"$f":"'Übersicht Schützen'!E4","v":311.3},{"$f":"'Übersicht Schützen'!F4","v":315.2},{"$f":"'Übersicht Schützen'!G4","v":311.3},{"$f":"'Übersicht Schützen'!H4","v":312.9},{"$f":"'Übersicht Schützen'!I4","v":311.45},{"$f":"SUM(D19:I19)","v":{"v":1868.6999999999998,"d":"1,868.7"}},{"$f":"'Übersicht Schützen'!L4","v":308.8},{"$f":"'Übersicht Schützen'!M4","v":312.9},{"$f":"'Übersicht Schützen'!N4","v":312.4},{"$f":"'Übersicht Schützen'!O4","v":313.7},{"$f":"'Übersicht Schützen'!P4","v":308.5},{"$f":"'Übersicht Schützen'!Q4","v":{"v":0,"d":"0.0"}},{"$f":"'Übersicht Schützen'!R4","v":311.26},{"v":1556.3,"d":"1,556.3"},{"$f":"'Übersicht Schützen'!U4","v":{"v":311.3636363636364,"d":"311.36"}},{"v":3425,"d":"3,425.0"},{"$f":"(U18-U19)*-1","v":{"v":-6.299999999999727,"d":"-6.3"}}]
[4,{"$f":"'Übersicht Schützen'!A5","v":"Monika Jansen"},{"$f":"'Übersicht Schützen'!B5","v":"Spahnharrenstätte I"},{"$f":"'Übersicht Schützen'!C5","v":312.1},{"$f":"'Übersicht Schützen'!D5","v":312.7},{"$f":"'Übersicht Schützen'!E5","v":315.1},{"$f":"'Übersicht Schützen'!F5","v":316.1},{"$f":"'Übersicht Schützen'!G5","v":{"v":303,"d":"303.0"}},{"$f":"'Übersicht Schützen'!H5","v":311.3},{"$f":"'Übersicht Schützen'!I5","v":{"v":311.71666666666664,"d":"311.72"}},{"v":1870.3,"d":"1,870.3"},{"$f":"'Übersicht Schützen'!L5","v":304.5},{"$f":"'Übersicht Schützen'!M5","v":309.6},{"$f":"'Übersicht Schützen'!N5","v":309.7},{"$f":"'Übersicht Schützen'!O5","v":308.6},{"$f":"'Übersicht Schützen'!P5","v":309.9},{"$f":"'Übersicht Schützen'!Q5","v":{"v":0,"d":"0.0"}},{"$f":"'Übersicht Schützen'!R5","v":{"v":308.46000000000004,"d":"308.46"}},{"v":1542.3000000000002,"d":"1,542.3"},{"$f":"'Übersicht Schützen'!U5","v":{"v":310.23636363636365,"d":"310.24"}},{"v":3412.6000000000004,"d":"3,412.6"},{"v":-12.399999999999636,"d":"-12.4"}]
[5,{"$f":"'Übersicht Schützen'!A6","v":"Hanna Gebken"},{"$f":"'Übersicht Schützen'!B6","v":"Lorup III"},{"$f":"'Übersicht Schützen'!C6","v":309.8},{"$f":"'Übersicht Schützen'!D6","v":311.6},{"$f":"'Übersicht Schützen'!E6","v":309.9},{"$f":"'Übersicht Schützen'!F6","v":312.2},{"$f":"'Übersicht Schützen'!G6","v":312.1},{"$f":"'Übersicht Schützen'!H6","v":306.7},{"$f":"'Übersicht Schützen'!I6","v":{"v":310.3833333333333,"d":"310.38"}},{"v":1862.3,"d":"1,862.3"},{"$f":"'Übersicht Schützen'!L6","v":309.6},{"$f":"'Übersicht Schützen'!M6","v":307.2},{"$f":"'Übersicht Schützen'!N6","v":309.4},{"$f":"'Übersicht Schützen'!O6","v":307.5},{"$f":"'Übersicht Schützen'!P6","v":305.1},{"$f":"'Übersicht Schützen'!Q6","v":{"v":0,"d":"0.0"}},{"$f":"'Übersicht Schützen'!R6","v":{"v":307.75999999999993,"d":"307.76"}},{"v":1538.7999999999997,"d":"1,538.8"},{"$f":"'Übersicht Schützen'!U6","v":{"v":309.1909090909091,"d":"309.19"}},{"v":3401.0999999999995,"d":"3,401.1"},{"v":-11.50000000000091,"d":"-11.5"}]
[6,{"$f":"'Übersicht Schützen'!A7","v":"Maria Beusing"},{"$f":"'Übersicht Schützen'!B7","v":"Spahnharrenstätte I"},{"$f":"'Übersicht Schützen'!C7","v":304.1},{"$f":"'Übersicht Schützen'!D7","v":308.3},{"$f":"'Übersicht Schützen'!E7","v":308.1},{"$f":"'Übersicht Schützen'!F7","v":310.8},{"$f":"'Übersicht Schützen'!G7","v":308.6},{"$f":"'Übersicht Schützen'!H7","v":309.6},{"$f":"'Übersicht Schützen'!I7","v":308.25},{"v":1849.5,"d":"1,849.5"},{"$f":"'Übersicht Schützen'!L7","v":314.9},{"$f":"'Übersicht Schützen'!M7","v":309.9},{"$f":"'Übersicht Schützen'!N7","v":310.8},{"$f":"'Übersicht Schützen'!O7","v":308.6},{"$f":"'Übersicht Schützen'!P7","v":{"v":307,"d":"307.0"}},{"$f":"'Übersicht Schützen'!Q7","v":{"v":0,"d":"0.0"}},{"$f":"'Übersicht Schützen'!R7","v":{"v":310.23999999999995,"d":"310.24"}},{"v":1551.1999999999998,"d":"1,551.2"},{"$f":"'Übersicht Schützen'!U7","v":{"v":309.1545454545455,"d":"309.15"}},{"v":3400.7,"d":"3,400.7"},{"v":-0.3999999999996362,"d":"-0.4"}]
[7,{"$f":"'Übersicht Schützen'!A8","v":"Claudia Rolfes"},{"$f":"'Übersicht Schützen'!B8","v":"Neuvrees II"},{"$f":"'Übersicht Schützen'!C8","v":305.2},{"$f":"'Übersicht Schützen'!D8","v":305.4},{"$f":"'Übersicht Schützen'!E8","v":306.8},{"$f":"'Übersicht Schützen'!F8","v":311.3},{"$f":"'Übersicht Schützen'!G8","v":305.4},{"$f":"'Übersicht Schützen'!H8","v":311.4},{"$f":"'Übersicht Schützen'!I8","v":{"v":307.5833333333333,"d":"307.58"}},{"v":1845.5,"d":"1,845.5"},{"$f":"'Übersicht Schützen'!L8","v":313.1},{"$f":"'Übersicht Schützen'!M8","v":309.2},{"$f":"'Übersicht Schützen'!N8","v":307.9},{"$f":"'Übersicht Schützen'!O8","v":313.3},{"$f":"'Übersicht Schützen'!P8","v":303.7},{"$f":"'Übersicht Schützen'!Q8","v":{"v":0,"d":"0.0"}},{"$f":"'Übersicht Schützen'!R8","v":309.44},{"v":1547.2,"d":"1,547.2"},{"$f":"'Übersicht Schützen'!U8","v":{"v":308.42727272727274,"d":"308.43"}},{"v":3392.7,"d":"3,392.7"},{"v":-8,"d":"-8.0"}]
[8,{"$f":"'Übersicht Schützen'!A9","v":"Silvia Thunert"},{"$f":"'Übersicht Schützen'!B9","v":"Neuvrees II"},{"$f":"'Übersicht Schützen'!C9","v":310.7},{"$f":"'Übersicht Schützen'!D9","v":311.3},{"$f":"'Übersicht Schützen'!E9","v":{"v":309,"d":"309.0"}},{"$f":"'Übersicht Schützen'!F9","v":307.4},{"$f":"'Übersicht Schützen'!G9","v":301.7},{"$f":"'Übersicht Schützen'!H9","v":{"v":312,"d":"312.0"}},{"$f":"'Übersicht Schützen'!I9","v":{"v":308.68333333333334,"d":"308.68"}},{"v":1852.1000000000001,"d":"1,852.1"},{"$f":"'Übersicht Schützen'!L9","v":307.2},{"$f":"'Übersicht Schützen'!M9","v":306.8},{"$f":"'Übersicht Schützen'!N9","v":311.3},{"$f":"'Übersicht Schützen'!O9","v":{"v":307,"d":"307.0"}},{"$f":"'Übersicht Schützen'!P9","v":304.8},{"$f":"'Übersicht Schützen'!Q9","v":{"v":0,"d":"0.0"}},{"$f":"'Übersicht Schützen'!R9","v":{"v":307.41999999999996,"d":"307.42"}},{"v":1537.1,"d":"1,537.1"},{"$f":"'Übersicht Schützen'!U9","v":{"v":308.109090909091,"d":"308.11"}},{"v":3389.2,"d":"3,389.2"},-3.5]
[9,{"$f":"'Übersicht Schützen'!A10","v":"Sarah Deyen"},{"$f":"'Übersicht Schützen'!B10","v":"Neuvrees II"},{"$f":"'Übersicht Schützen'!C10","v":308.1},{"$f":"'Übersicht Schützen'!D10","v":305.2},{"$f":"'Übersicht Schützen'!E10","v":309.7},{"$f":"'Übersicht Schützen'!F10","v":312.6},{"$f":"'Übersicht Schützen'!G10","v":301.4},{"$f":"'Übersicht Schützen'!H10","v":310.1},{"$f":"'Übersicht Schützen'!I10","v":{"v":307.84999999999997,"d":"307.85"}},{"v":1847.1,"d":"1,847.1"},{"$f":"'Übersicht Schützen'!L10","v":302.3},{"$f":"'Übersicht Schützen'!M10","v":311.1},{"$f":"'Übersicht Schützen'!N10","v":{"v":306,"d":"306.0"}},{"$f":"'Übersicht Schützen'!O10","v":{"v":309,"d":"309.0"}},{"$f":"'Übersicht Schützen'!P10","v":304.4},{"$f":"'Übersicht Schützen'!Q10","v":{"v":0,"d":"0.0"}},{"$f":"'Übersicht Schützen'!R10","v":{"v":306.56000000000006,"d":"306.56"}},{"v":1532.8000000000002,"d":"1,532.8"},{"$f":"'Übersicht Schützen'!U10","v":{"v":307.26363636363635,"d":"307.26"}},{"v":3379.9,"d":"3,379.9"},{"v":-9.299999999999727,"d":"-9.3"}]
[10,{"$f":"'Übersicht Schützen'!A11","v":"Ulla Schnieders"},{"$f":"'Übersicht Schützen'!B11","v":"Börgermoor I"},{"$f":"'Übersicht Schützen'!C11","v":306.6},{"$f":"'Übersicht Schützen'!D11","v":308.5},{"$f":"'Übersicht Schützen'!E11","v":309.8},{"$f":"'Übersicht Schützen'!F11","v":310.1},{"$f":"'Übersicht Schützen'!G11","v":308.8},{"$f":"'Übersicht Schützen'!H11","v":307.1},{"$f":"'Übersicht Schützen'!I11","v":{"v":308.48333333333335,"d":"308.48"}},{"v":1850.9,"d":"1,850.9"},{"$f":"'Übersicht Schützen'!L11","v":300.9},{"$f":"'Übersicht Schützen'!M11","v":302.9},{"$f":"'Übersicht Schützen'!N11","v":{"v":304,"d":"304.0"}},{"$f":"'Übersicht Schützen'!O11","v":308.2},{"$f":"'Übersicht Schützen'!P11","v":{"v":310,"d":"310.0"}},{"$f":"'Übersicht Schützen'!Q11","v":{"v":0,"d":"0.0"}},{"$f":"'Übersicht Schützen'!R11","v":{"v":305.2,"d":"305.20"}},{"v":1526,"d":"1,526.0"},{"$f":"'Übersicht Schützen'!U11","v":{"v":306.9909090909091,"d":"306.99"}},{"v":3376.9,"d":"3,376.9"},{"v":-3,"d":"-3.0"}]
[11,{"$f":"'Übersicht Schützen'!A12","v":"Kerstin Sträche"},{"$f":"'Übersicht Schützen'!B12","v":"Spahnharrenstätte I"},{"$f":"'Übersicht Schützen'!C12","v":302.8},{"$f":"'Übersicht Schützen'!D12","v":311.9},{"$f":"'Übersicht Schützen'!E12","v":{"v":305,"d":"305.0"}},{"$f":"'Übersicht Schützen'!F12","v":{"v":302,"d":"302.0"}},{"$f":"'Übersicht Schützen'!G12","v":305.7},{"$f":"'Übersicht Schützen'!H12","v":307.3},{"$f":"'Übersicht Schützen'!I12","v":{"v":305.78333333333336,"d":"305.78"}},{"v":1834.7,"d":"1,834.7"},{"$f":"'Übersicht Schützen'!L12","v":307.8},{"$f":"'Übersicht Schützen'!M12","v":299.7},{"$f":"'Übersicht Schützen'!N12","v":308.4},{"$f":"'Übersicht Schützen'!O12","v":304.8},{"$f":"'Übersicht Schützen'!P12","v":307.3},{"$f":"'Übersicht Schützen'!Q12","v":{"v":0,"d":"0.0"}},{"$f":"'Übersicht Schützen'!R12","v":{"v":305.6,"d":"305.60"}},{"v":1528,"d":"1,528.0"},{"$f":"'Übersicht Schützen'!U12","v":{"v":305.70000000000005,"d":"305.70"}},{"v":3362.7,"d":"3,362.7"},{"v":-14.200000000000273,"d":"-14.2"}]
[12,{"$f":"'Übersicht Schützen'!A13","v":"Marina Schrand"},{"$f":"'Übersicht Schützen'!B13","v":"Lorup III"},{"$f":"'Übersicht Schützen'!C13","v":305.9},{"$f":"'Übersicht Schützen'!D13","v":306.4},{"$f":"'Übersicht Schützen'!E13","v":303.9},{"$f":"'Übersicht Schützen'!F13","v":306.2},{"$f":"'Übersicht Schützen'!G13","v":{"v":303,"d":"303.0"}},{"$f":"'Übersicht Schützen'!H13","v":305.5},{"$f":"'Übersicht Schützen'!I13","v":305.15},{"v":1830.8999999999999,"d":"1,830.9"},{"$f":"'Übersicht Schützen'!L13","v":304.1},{"$f":"'Übersicht Schützen'!M13","v":306.7},{"$f":"'Übersicht Schützen'!N13","v":303.5},{"$f":"'Übersicht Schützen'!O13","v":308.3},{"$f":"'Übersicht Schützen'!P13","v":308.8},{"$f":"'Übersicht Schützen'!Q13","v":{"v":0,"d":"0.0"}},{"$f":"'Übersicht Schützen'!R13","v":306.28},{"v":1531.3999999999999,"d":"1,531.4"},{"$f":"'Übersicht Schützen'!U13","v":{"v":305.6636363636364,"d":"305.66"}},{"v":3362.2999999999997,"d":"3,362.3"},{"v":-0.40000000000009095,"d":"-0.4"}]
[13,{"$f":"'Übersicht Schützen'!A14","v":"Waltraud Dobelmann"},{"$f":"'Übersicht Schützen'!B14","v":"Börgermoor I"},{"$f":"'Übersicht Schützen'!C14","v":305.9},{"$f":"'Übersicht Schützen'!D14","v":303.7},{"$f":"'Übersicht Schützen'!E14","v":{"v":300,"d":"300.0"}},{"$f":"'Übersicht Schützen'!F14","v":308.5},{"$f":"'Übersicht Schützen'!G14","v":302.8},{"$f":"'Übersicht Schützen'!H14","v":302.8},{"$f":"'Übersicht Schützen'!I14","v":303.95},{"v":1823.6999999999998,"d":"1,823.7"},{"$f":"'Übersicht Schützen'!L14","v":303.6},{"$f":"'Übersicht Schützen'!M14","v":311.1},{"$f":"'Übersicht Schützen'!N14","v":304.6},{"$f":"'Übersicht Schützen'!O14","v":304.7},{"$f":"'Übersicht Schützen'!P14","v":309.2},{"$f":"'Übersicht Schützen'!Q14","v":{"v":0,"d":"0.0"}},{"$f":"'Übersicht Schützen'!R14","v":306.64},{"v":1533.2,"d":"1,533.2"},{"$f":"'Übersicht Schützen'!U14","v":{"v":305.1727272727272,"d":"305.17"}},{"v":3356.8999999999996,"d":"3,356.9"},{"v":-5.400000000000091,"d":"-5.4"}]
[14,{"$f":"'Übersicht Schützen'!A15","v":"Anni Küwen"},{"$f":"'Übersicht Schützen'!B15","v":"Börgermoor I"},{"$f":"'Übersicht Schützen'!C15","v":299.3},{"$f":"'Übersicht Schützen'!D15","v":300.1},{"$f":"'Übersicht Schützen'!E15","v":306.2},{"$f":"'Übersicht Schützen'!F15","v":312.6},{"$f":"'Übersicht Schützen'!G15","v":297.9},{"$f":"'Übersicht Schützen'!H15","v":308.9},{"$f":"'Übersicht Schützen'!I15","v":{"v":304.16666666666674,"d":"304.17"}},{"v":1825.0000000000005,"d":"1,825.0"},{"$f":"'Übersicht Schützen'!L15","v":308.6},{"$f":"'Übersicht Schützen'!M15","v":310.7},{"$f":"'Übersicht Schützen'!N15","v":311.1},{"$f":"'Übersicht Schützen'!O15","v":{"v":302,"d":"302.0"}},{"$f":"'Übersicht Schützen'!P15","v":297.6},{"$f":"'Übersicht Schützen'!Q15","v":{"v":0,"d":"0.0"}},{"$f":"'Übersicht Schützen'!R15","v":{"v":306,"d":"306.00"}},{"v":1530,"d":"1,530.0"},{"$f":"'Übersicht Schützen'!U15","v":{"v":305,"d":"305.00"}},{"v":3355.0000000000005,"d":"3,355.0"},{"v":-1.8999999999991815,"d":"-1.9"}]
[15,{"$f":"'Übersicht Schützen'!A16","v":"Monika Reimann"},{"$f":"'Übersicht Schützen'!B16","v":"Lorup III"},{"$f":"'Übersicht Schützen'!C16","v":307.6},{"$f":"'Übersicht Schützen'!D16","v":303.8},{"$f":"'Übersicht Schützen'!E16","v":299.9},{"$f":"'Übersicht Schützen'!F16","v":305.8},{"$f":"'Übersicht Schützen'!G16","v":305.2},{"$f":"'Übersicht Schützen'!H16","v":304.6},{"$f":"'Übersicht Schützen'!I16","v":{"v":304.48333333333335,"d":"304.48"}},{"v":1826.9,"d":"1,826.9"},{"$f":"'Übersicht Schützen'!L16","v":308.3},{"$f":"'Übersicht Schützen'!M16","v":301.8},{"$f":"'Übersicht Schützen'!N16","v":305.7},{"$f":"'Übersicht Schützen'!O16","v":304.1},{"$f":"'Übersicht Schützen'!P16","v":304.8},{"$f":"'Übersicht Schützen'!Q16","v":{"v":0,"d":"0.0"}},{"$f":"'Übersicht Schützen'!R16","v":304.94},{"v":1524.7,"d":"1,524.7"},{"$f":"'Übersicht Schützen'!U16","v":{"v":304.69090909090914,"d":"304.69"}},{"v":3351.6000000000004,"d":"3,351.6"},{"v":-3.400000000000091,"d":"-3.4"}]
[16,{"$f":"'Übersicht Schützen'!A17","v":"Gertrud Kuchta"},{"$f":"'Übersicht Schützen'!B17","v":"Börger II"},{"$f":"'Übersicht Schützen'!C17","v":300.7},{"$f":"'Übersicht Schützen'!D17","v":303.7},{"$f":"'Übersicht Schützen'!E17","v":305.3},{"$f":"'Übersicht Schützen'!F17","v":{"v":305,"d":"305.0"}},{"$f":"'Übersicht Schützen'!G17","v":{"v":301,"d":"301.0"}},{"$f":"'Übersicht Schützen'!H17","v":310.4},{"$f":"'Übersicht Schützen'!I17","v":{"v":304.34999999999997,"d":"304.35"}},{"v":1826.1,"d":"1,826.1"},{"$f":"'Übersicht Schützen'!L17","v":303.7},{"$f":"'Übersicht Schützen'!M17","v":305.8},{"$f":"'Übersicht Schützen'!N17","v":307.5},{"$f":"'Übersicht Schützen'!O17","v":301.6},{"$f":"'Übersicht Schützen'!P17","v":304.8},{"$f":"'Übersicht Schützen'!Q17","v":{"v":0,"d":"0.0"}},{"$f":"'Übersicht Schützen'!R17","v":{"v":304.67999999999995,"d":"304.68"}},{"v":1523.3999999999999,"d":"1,523.4"},{"$f":"'Übersicht Schützen'!U17","v":{"v":304.5,"d":"304.50"}},{"v":3349.5,"d":"3,349.5"},{"v":-2.100000000000364,"d":"-2.1"}]
[17,{"$f":"'Übersicht Schützen'!A18","v":"Carmen Benten"},{"$f":"'Übersicht Schützen'!B18","v":"Ostenwalde II"},{"$f":"'Übersicht Schützen'!C18","v":301.6},{"$f":"'Übersicht Schützen'!D18","v":308.7},{"$f":"'Übersicht Schützen'!E18","v":308.4},{"$f":"'Übersicht Schützen'!F18","v":304.5},{"$f":"'Übersicht Schützen'!G18","v":296.8},{"$f":"'Übersicht Schützen'!H18","v":297.8},{"$f":"'Übersicht Schützen'!I18","v":{"v":302.96666666666664,"d":"302.97"}},{"v":1817.7999999999997,"d":"1,817.8"},{"$f":"'Übersicht Schützen'!L18","v":306.8},{"$f":"'Übersicht Schützen'!M18","v":{"v":298,"d":"298.0"}},{"$f":"'Übersicht Schützen'!N18","v":309.8},{"$f":"'Übersicht Schützen'!O18","v":307.2},{"$f":"'Übersicht Schützen'!P18","v":{"v":308,"d":"308.0"}},{"$f":"'Übersicht Schützen'!Q18","v":{"v":0,"d":"0.0"}},{"$f":"'Übersicht Schützen'!R18","v":305.96},{"v":1529.8,"d":"1,529.8"},{"$f":"'Übersicht Schützen'!U18","v":{"v":304.3272727272727,"d":"304.33"}},{"v":3347.5999999999995,"d":"3,347.6"},{"v":-1.9000000000005457,"d":"-1.9"}]
[18,{"$f":"'Übersicht Schützen'!A19","v":"Gundula Schwarte"},{"$f":"'Übersicht Schützen'!B19","v":"Börger II"},{"$f":"'Übersicht Schützen'!C19","v":297.5},{"$f":"'Übersicht Schützen'!D19","v":298.7},{"$f":"'Übersicht Schützen'!E19","v":307.5},{"$f":"'Übersicht Schützen'!F19","v":308.9},{"$f":"'Übersicht Schützen'!G19","v":304.4},{"$f":"'Übersicht Schützen'!H19","v":301.6},{"$f":"'Übersicht Schützen'!I19","v":{"v":303.09999999999997,"d":"303.10"}},{"v":1818.6,"d":"1,818.6"},{"$f":"'Übersicht Schützen'!L19","v":300.6},{"$f":"'Übersicht Schützen'!M19","v":300.3},{"$f":"'Übersicht Schützen'!N19","v":{"v":303,"d":"303.0"}},{"$f":"'Übersicht Schützen'!O19","v":305.2},{"$f":"'Übersicht Schützen'!P19","v":307.9},{"$f":"'Übersicht Schützen'!Q19","v":{"v":0,"d":"0.0"}},{"$f":"'Übersicht Schützen'!R19","v":{"v":303.4,"d":"303.40"}},{"v":1517,"d":"1,517.0"},{"$f":"'Übersicht Schützen'!U19","v":{"v":303.23636363636365,"d":"303.24"}},{"v":3335.6,"d":"3,335.6"},{"v":-11.999999999999545,"d":"-12.0"}]
[19,{"$f":"'Übersicht Schützen'!A20","v":"Margret Pohlmann"},{"$f":"'Übersicht Schützen'!B20","v":"Neuvrees II"},{"$f":"'Übersicht Schützen'!C20","v":298.4},{"$f":"'Übersicht Schützen'!D20","v":302.3},{"$f":"'Übersicht Schützen'!E20","v":296.6},{"$f":"'Übersicht Schützen'!F20","v":302.3},{"$f":"'Übersicht Schützen'!G20","v":306.7},{"$f":"'Übersicht Schützen'!H20","v":301.1},{"$f":"'Übersicht Schützen'!I20","v":{"v":301.23333333333335,"d":"301.23"}},{"v":1807.4,"d":"1,807.4"},{"$f":"'Übersicht Schützen'!L20","v":301.2},{"$f":"'Übersicht Schützen'!M20","v":{"v":302,"d":"302.0"}},{"$f":"'Übersicht Schützen'!N20","v":300.8},{"$f":"'Übersicht Schützen'!O20","v":297.6},{"$f":"'Übersicht Schützen'!P20","v":304.3},{"$f":"'Übersicht Schützen'!Q20","v":{"v":0,"d":"0.0"}},{"$f":"'Übersicht Schützen'!R20","v":{"v":301.17999999999995,"d":"301.18"}},{"v":1505.8999999999999,"d":"1,505.9"},{"$f":"'Übersicht Schützen'!U20","v":{"v":301.20909090909095,"d":"301.21"}},{"v":3313.3,"d":"3,313.3"},{"v":-22.299999999999727,"d":"-22.3"}]
[20,{"$f":"'Übersicht Schützen'!A21","v":"Annette Schwarte"},{"$f":"'Übersicht Schützen'!B21","v":"Börger II"},{"$f":"'Übersicht Schützen'!C21","v":301.2},{"$f":"'Übersicht Schützen'!D21","v":298.2},{"$f":"'Übersicht Schützen'!E21","v":306.1},{"$f":"'Übersicht Schützen'!F21","v":304.3},{"$f":"'Übersicht Schützen'!G21","v":301.2},{"$f":"'Übersicht Schützen'!H21","v":305.3},{"$f":"'Übersicht Schützen'!I21","v":{"v":302.71666666666664,"d":"302.72"}},{"v":1816.3,"d":"1,816.3"},{"$f":"'Übersicht Schützen'!L21","v":296.1},{"$f":"'Übersicht Schützen'!M21","v":303.1},{"$f":"'Übersicht Schützen'!N21","v":{"v":299,"d":"299.0"}},{"$f":"'Übersicht Schützen'!O21","v":304.5},{"$f":"'Übersicht Schützen'!P21","v":290.6},{"$f":"'Übersicht Schützen'!Q21","v":{"v":0,"d":"0.0"}},{"$f":"'Übersicht Schützen'!R21","v":298.66},{"v":1493.3000000000002,"d":"1,493.3"},{"$f":"'Übersicht Schützen'!U21","v":{"v":300.8727272727273,"d":"300.87"}},{"v":3309.6000000000004,"d":"3,309.6"},{"v":-3.699999999999818,"d":"-3.7"}]
[21,{"$f":"'Übersicht Schützen'!A22","v":"Nina Krömer"},{"$f":"'Übersicht Schützen'!B22","v":"Lorup III"},{"$f":"'Übersicht Schützen'!C22","v":274.4},{"$f":"'Übersicht Schützen'!D22","v":292.3},{"$f":"'Übersicht Schützen'!E22","v":304.6},{"$f":"'Übersicht Schützen'!F22","v":{"v":298,"d":"298.0"}},{"$f":"'Übersicht Schützen'!G22","v":287.8},{"$f":"'Übersicht Schützen'!H22","v":305.4},{"$f":"'Übersicht Schützen'!I22","v":293.75},{"v":1762.5,"d":"1,762.5"},{"$f":"'Übersicht Schützen'!L22","v":299.7},{"$f":"'Übersicht Schützen'!M22","v":292.7},{"$f":"'Übersicht Schützen'!N22","v":{"v":296,"d":"296.0"}},{"$f":"'Übersicht Schützen'!O22","v":303.1},{"$f":"'Übersicht Schützen'!P22","v":291.6},{"$f":"'Übersicht Schützen'!Q22","v":{"v":0,"d":"0.0"}},{"$f":"'Übersicht Schützen'!R22","v":296.62},{"v":1483.1,"d":"1,483.1"},{"$f":"'Übersicht Schützen'!U22","v":{"v":295.0545454545454,"d":"295.05"}},{"v":3245.6,"d":"3,245.6"},{"v":-64.00000000000045,"d":"-64.0"}]
[22,{"$f":"'Übersicht Schützen'!A23","v":"Silvia Junge"},{"$f":"'Übersicht Schützen'!B23","v":"Neuvrees II"},{"$f":"'Übersicht Schützen'!C23","v":296.5},{"$f":"'Übersicht Schützen'!D23","v":294.8},{"$f":"'Übersicht Schützen'!E23","v":{"v":283,"d":"283.0"}},{"$f":"'Übersicht Schützen'!F23","v":280.9},{"$f":"'Übersicht Schützen'!G23","v":290.8},{"$f":"'Übersicht Schützen'!H23","v":299.5},{"$f":"'Übersicht Schützen'!I23","v":{"v":290.91666666666663,"d":"290.92"}},{"v":1745.4999999999998,"d":"1,745.5"},{"$f":"'Übersicht Schützen'!L23","v":300.3},{"$f":"'Übersicht Schützen'!M23","v":299.8},{"$f":"'Übersicht Schützen'!N23","v":247.4},{"$f":"'Übersicht Schützen'!O23","v":297.2},{"$f":"'Übersicht Schützen'!P23","v":301.9},{"$f":"'Übersicht Schützen'!Q23","v":{"v":0,"d":"0.0"}},{"$f":"'Übersicht Schützen'!R23","v":289.32},{"v":1446.6,"d":"1,446.6"},{"$f":"'Übersicht Schützen'!U23","v":{"v":290.1909090909091,"d":"290.19"}},{"v":3192.0999999999995,"d":"3,192.1"},{"v":-53.500000000000455,"d":"-53.5"}]
[23,{"$f":"'Übersicht Schützen'!A24","v":"Jasmin Kramer"},{"$f":"'Übersicht Schützen'!B24","v":"Börgermoor I"},{"$f":"'Übersicht Schützen'!C24","v":298.8},{"$f":"'Übersicht Schützen'!D24","v":302.4},{"$f":"'Übersicht Schützen'!E24","v":306.2},{"$f":"'Übersicht Schützen'!F24","v":310.5},{"$f":"'Übersicht Schützen'!G24","v":310.3},{"$f":"'Übersicht Schützen'!H24","v":309.3},{"$f":"'Übersicht Schützen'!I24","v":306.25},{"v":1837.5,"d":"1,837.5"},{"$f":"'Übersicht Schützen'!L24","v":311.7},{"$f":"'Übersicht Schützen'!M24","v":312.3},{"$f":"'Übersicht Schützen'!N24","v":312.3},{"$f":"'Übersicht Schützen'!O24","v":305.4},{"$f":"'Übersicht Schützen'!P24","v":{"v":0,"d":"0.0"}},{"$f":"'Übersicht Schützen'!Q24","v":{"v":0,"d":"0.0"}},{"$f":"'Übersicht Schützen'!R24","v":{"v":310.42499999999995,"d":"310.43"}},{"v":1241.6999999999998,"d":"1,241.7"},{"$f":"'Übersicht Schützen'!U24","v":307.92},{"v":3079.2,"d":"3,079.2"},{"v":-112.89999999999964,"d":"-112.9"}]
[24,{"$f":"'Übersicht Schützen'!A25","v":"Rita Hanekamp"},{"$f":"'Übersicht Schützen'!B25","v":"Spahnharrenstätte I"},{"$f":"'Übersicht Schützen'!C25","v":295.1},{"$f":"'Übersicht Schützen'!D25","v":300.5},{"$f":"'Übersicht Schützen'!E25","v":288.4},{"$f":"'Übersicht Schützen'!F25","v":296.9},{"$f":"'Übersicht Schützen'!G25","v":287.8},{"$f":"'Übersicht Schützen'!H25","v":{"v":287,"d":"287.0"}},{"$f":"'Übersicht Schützen'!I25","v":{"v":292.6166666666667,"d":"292.62"}},{"v":1755.7,"d":"1,755.7"},{"$f":"'Übersicht Schützen'!L25","v":{"v":0,"d":"0.0"}},{"$f":"'Übersicht Schützen'!M25","v":284.9},{"$f":"'Übersicht Schützen'!N25","v":296.3},{"$f":"'Übersicht Schützen'!O25","v":295.2},{"$f":"'Übersicht Schützen'!P25","v":291.8},{"$f":"'Übersicht Schützen'!Q25","v":{"v":0,"d":"0.0"}},{"$f":"'Übersicht Schützen'!R25","v":292.05},{"v":1168.2,"d":"1,168.2"},{"$f":"'Übersicht Schützen'!U25","v":292.39},{"v":2923.9,"d":"2,923.9"},{"v":-155.29999999999973,"d":"-155.3"}]
[25,{"$f":"'Übersicht Schützen'!A26","v":"Petra Dödtmann"},{"$f":"'Übersicht Schützen'!B26","v":"Börger II"},{"$f":"'Übersicht Schützen'!C26","v":{"v":0,"d":"0.0"}},{"$f":"'Übersicht Schützen'!D26","v":304.5},{"$f":"'Übersicht Schützen'!E26","v":{"v":0,"d":"0.0"}},{"$f":"'Übersicht Schützen'!F26","v":315.1},{"$f":"'Übersicht Schützen'!G26","v":305.4},{"$f":"'Übersicht Schützen'!H26","v":309.8},{"$f":"'Übersicht Schützen'!I26","v":{"v":308.7,"d":"308.70"}},{"v":1234.8,"d":"1,234.8"},{"$f":"'Übersicht Schützen'!L26","v":310.5},{"$f":"'Übersicht Schützen'!M26","v":308.9},{"$f":"'Übersicht Schützen'!N26","v":307.6},{"$f":"'Übersicht Schützen'!O26","v":309.9},{"$f":"'Übersicht Schützen'!P26","v":312.3},{"$f":"'Übersicht Schützen'!Q26","v":{"v":0,"d":"0.0"}},{"$f":"'Übersicht Schützen'!R26","v":{"v":309.84000000000003,"d":"309.84"}},{"v":1549.2,"d":"1,549.2"},{"$f":"'Übersicht Schützen'!U26","v":{"v":309.3333333333333,"d":"309.33"}},{"v":2784,"d":"2,784.0"},{"v":-139.9000000000001,"d":"-139.9"}]
[26,{"$f":"'Übersicht Schützen'!A27","v":"Sarah Meiners"},{"$f":"'Übersicht Schützen'!B27","v":"Ostenwalde II"},{"$f":"'Übersicht Schützen'!C27","v":292.6},{"$f":"'Übersicht Schützen'!D27","v":291.6},{"$f":"'Übersicht Schützen'!E27","v":{"v":286,"d":"286.0"}},{"$f":"'Übersicht Schützen'!F27","v":290.4},{"$f":"'Übersicht Schützen'!G27","v":286.8},{"$f":"'Übersicht Schützen'!H27","v":278.1},{"$f":"'Übersicht Schützen'!I27","v":{"v":287.5833333333333,"d":"287.58"}},{"v":1725.5,"d":"1,725.5"},{"$f":"'Übersicht Schützen'!L27","v":286.3},{"$f":"'Übersicht Schützen'!M27","v":{"v":0,"d":"0.0"}},{"$f":"'Übersicht Schützen'!N27","v":291.9},{"$f":"'Übersicht Schützen'!O27","v":291.9},{"$f":"'Übersicht Schützen'!P27","v":{"v":0,"d":"0.0"}},{"$f":"'Übersicht Schützen'!Q27","v":{"v":0,"d":"0.0"}},{"$f":"'Übersicht Schützen'!R27","v":{"v":290.03333333333336,"d":"290.03"}},870.1,{"$f":"'Übersicht Schützen'!U27","v":{"v":288.4,"d":"288.40"}},{"v":2595.6,"d":"2,595.6"},{"v":-188.4000000000001,"d":"-188.4"}]
[27,{"$f":"'Übersicht Schützen'!A28","v":"Helga Meiners"},{"$f":"'Übersicht Schützen'!B28","v":"Ostenwalde II"},{"$f":"'Übersicht Schützen'!C28","v":302.1},{"$f":"'Übersicht Schützen'!D28","v":293.4},{"$f":"'Übersicht Schützen'!E28","v":299.3},{"$f":"'Übersicht Schützen'!F28","v":298.7},{"$f":"'Übersicht Schützen'!G28","v":299.4},{"$f":"'Übersicht Schützen'!H28","v":299.9},{"$f":"'Übersicht Schützen'!I28","v":{"v":298.8,"d":"298.80"}},{"v":1792.8000000000002,"d":"1,792.8"},{"$f":"'Übersicht Schützen'!L28","v":296.1},{"$f":"'Übersicht Schützen'!M28","v":291.6},{"$f":"'Übersicht Schützen'!N28","v":{"v":0,"d":"0.0"}},{"$f":"'Übersicht Schützen'!O28","v":{"v":0,"d":"0.0"}},{"$f":"'Übersicht Schützen'!P28","v":{"v":0,"d":"0.0"}},{"$f":"'Übersicht Schützen'!Q28","v":{"v":0,"d":"0.0"}},{"$f":"'Übersicht Schützen'!R28","v":293.85},587.7,{"$f":"'Übersicht Schützen'!U28","v":{"v":297.5625,"d":"297.56"}},{"v":2380.5,"d":"2,380.5"},{"v":-215.0999999999999,"d":"-215.1"}]
[28,{"$f":"'Übersicht Schützen'!A29","v":"Sarah Breer"},{"$f":"'Übersicht Schützen'!B29","v":"Börger II"},{"$f":"'Übersicht Schützen'!C29","v":288.8},{"$f":"'Übersicht Schützen'!D29","v":283.5},{"$f":"'Übersicht Schützen'!E29","v":284.3},{"$f":"'Übersicht Schützen'!F29","v":{"v":0,"d":"0.0"}},{"$f":"'Übersicht Schützen'!G29","v":266.4},{"$f":"'Übersicht Schützen'!H29","v":{"v":271.85,"d":"271.9"}},{"$f":"'Übersicht Schützen'!I29","v":{"v":278.96999999999997,"d":"278.97"}},{"v":1394.85,"d":"1,394.9"},{"$f":"'Übersicht Schützen'!L29","v":266.2},{"$f":"'Übersicht Schützen'!M29","v":{"v":0,"d":"0.0"}},{"$f":"'Übersicht Schützen'!N29","v":{"v":0,"d":"0.0"}},{"$f":"'Übersicht Schützen'!O29","v":{"v":0,"d":"0.0"}},{"$f":"'Übersicht Schützen'!P29","v":{"v":0,"d":"0.0"}},{"$f":"'Übersicht Schützen'!Q29","v":{"v":0,"d":"0.0"}},{"$f":"'Übersicht Schützen'!R29","v":{"v":266.2,"d":"266.20"}},266.2,{"$f":"'Übersicht Schützen'!U29","v":{"v":276.84166666666664,"d":"276.84"}},{"v":1661.05,"d":"1,661.1"},{"v":-719.45,"d":"-719.5"}]
[29,{"$f":"'Übersicht Schützen'!A30","v":"Harma Steenken"},{"$f":"'Übersicht Schützen'!B30","v":"Neuvrees II"},{"$f":"'Übersicht Schützen'!C30","v":275.9},{"$f":"'Übersicht Schützen'!D30","v":297.5},{"$f":"'Übersicht Schützen'!E30","v":{"v":0,"d":"0.0"}},{"$f":"'Übersicht Schützen'!F30","v":268.4},{"$f":"'Übersicht Schützen'!G30","v":{"v":0,"d":"0.0"}},{"$f":"'Übersicht Schützen'!H30","v":{"v":0,"d":"0.0"}},{"$f":"'Übersicht Schützen'!I30","v":{"v":280.59999999999997,"d":"280.60"}},841.8,{"$f":"'Übersicht Schützen'!L30","v":261.1},{"$f":"'Übersicht Schützen'!M30","v":{"v":0,"d":"0.0"}},{"$f":"'Übersicht Schützen'!N30","v":{"v":282,"d":"282.0"}},{"$f":"'Übersicht Schützen'!O30","v":{"v":0,"d":"0.0"}},{"$f":"'Übersicht Schützen'!P30","v":{"v":0,"d":"0.0"}},{"$f":"'Übersicht Schützen'!Q30","v":{"v":0,"d":"0.0"}},{"$f":"'Übersicht Schützen'!R30","v":271.55},543.1,{"$f":"'Übersicht Schützen'!U30","v":276.98},{"v":1384.9,"d":"1,384.9"},{"v":0,"d":"0.0"}]
[30,{"$f":"'Übersicht Schützen'!A31","v":"Margret Büter"},{"$f":"'Übersicht Schützen'!B31","v":"Lorup III"},{"$f":"'Übersicht Schützen'!C31","v":288.4},{"$f":"'Übersicht Schützen'!D31","v":277.1},{"$f":"'Übersicht Schützen'!E31","v":{"v":0,"d":"0.0"}},{"$f":"'Übersicht Schützen'!F31","v":{"v":0,"d":"0.0"}},{"$f":"'Übersicht Schützen'!G31","v":{"v":0,"d":"0.0"}},{"$f":"'Übersicht Schützen'!H31","v":{"v":0,"d":"0.0"}},{"$f":"'Übersicht Schützen'!I31","v":282.75},565.5,{"$f":"'Übersicht Schützen'!L31","v":{"v":0,"d":"0.0"}},{"$f":"'Übersicht Schützen'!M31","v":{"v":0,"d":"0.0"}},{"$f":"'Übersicht Schützen'!N31","v":{"v":0,"d":"0.0"}},{"$f":"'Übersicht Schützen'!O31","v":{"v":0,"d":"0.0"}},{"$f":"'Übersicht Schützen'!P31","v":{"v":0,"d":"0.0"}},{"$f":"'Übersicht Schützen'!Q31","v":{"v":0,"d":"0.0"}},{"$f":"'Übersicht Schützen'!R31","v":{"v":0,"d":"0.00"}},{"v":0,"d":"0.0"},{"$f":"'Übersicht Schützen'!U31","v":282.75},565.5,{"v":-819.4000000000001,"d":"-819.4"}]
[31,{"$f":"'Übersicht Schützen'!A32","v":"Evelyn Feder"},{"$f":"'Übersicht Schützen'!B32","v":"Ostenwalde II"},{"$f":"'Übersicht Schützen'!C32","v":{"v":0,"d":"0.0"}},{"$f":"'Übersicht Schützen'!D32","v":{"v":0,"d":"0.0"}},{"$f":"'Übersicht Schützen'!E32","v":{"v":0,"d":"0.0"}},{"$f":"'Übersicht Schützen'!F32","v":{"v":0,"d":"0.0"}},{"$f":"'Übersicht Schützen'!G32","v":{"v":0,"d":"0.0"}},{"$f":"'Übersicht Schützen'!H32","v":{"v":0,"d":"0.0"}},{"$f":"'Übersicht Schützen'!I32","v":{"v":0,"d":"0.00"}},{"v":0,"d":"0.0"},{"$f":"'Übersicht Schützen'!L32","v":{"v":0,"d":"0.0"}},{"$f":"'Übersicht Schützen'!M32","v":299.5},{"$f":"'Übersicht Schützen'!N32","v":{"v":0,"d":"0.0"}},{"$f":"'Übersicht Schützen'!O32","v":{"v":0,"d":"0.0"}},{"$f":"'Übersicht Schützen'!P32","v":{"v":0,"d":"0.0"}},{"$f":"'Übersicht Schützen'!Q32","v":{"v":0,"d":"0.0"}},{"$f":"'Übersicht Schützen'!R32","v":{"v":299.5,"d":"299.50"}},299.5,{"$f":"'Übersicht Schützen'!U32","v":{"v":299.5,"d":"299.50"}},299.5,{"$f":"(U46-U47)*-1","v":{"v":-266,"d":"-266.0"}}]
[32,{"$f":"'Übersicht Schützen'!A33","v":"Anna -Maria Wimberg"},{"$f":"'Übersicht Schützen'!B33","v":"Ostenwalde II"},{"$f":"'Übersicht Schützen'!C33","v":{"v":0,"d":"0.0"}},{"$f":"'Übersicht Schützen'!D33","v":{"v":0,"d":"0.0"}},{"$f":"'Übersicht Schützen'!E33","v":{"v":0,"d":"0.0"}},{"$f":"'Übersicht Schützen'!F33","v":{"v":0,"d":"0.0"}},{"$f":"'Übersicht Schützen'!G33","v":{"v":0,"d":"0.0"}},{"$f":"'Übersicht Schützen'!H33","v":{"v":0,"d":"0.0"}},{"$f":"'Übersicht Schützen'!I33","v":{"v":0,"d":"0.00"}},{"v":0,"d":"0.0"},{"$f":"'Übersicht Schützen'!L33","v":{"v":0,"d":"0.0"}},{"$f":"'Übersicht Schützen'!M33","v":{"v":0,"d":"0.0"}},{"$f":"'Übersicht Schützen'!N33","v":{"v":0,"d":"0.0"}},{"$f":"'Übersicht Schützen'!O33","v":{"v":0,"d":"0.0"}},{"$f":"'Übersicht Schützen'!P33","v":296.8},{"$f":"'Übersicht Schützen'!Q33","v":{"v":0,"d":"0.0"}},{"$f":"'Übersicht Schützen'!R33","v":{"v":296.8,"d":"296.80"}},296.8,{"$f":"'Übersicht Schützen'!U33","v":{"v":296.8,"d":"296.80"}},296.8,{"v":-2.6999999999999886,"d":"-2.7"}]
[33,{"$f":"'Übersicht Schützen'!A34","v":"Schütze 35"},{"$f":"'Übersicht Schützen'!B34","v":"Spahnharrenstätte I"},{"$f":"'Übersicht Schützen'!C34","v":{"v":0,"d":"0.0"}},{"$f":"'Übersicht Schützen'!D34","v":278.6},{"$f":"'Übersicht Schützen'!E34","v":{"v":0,"d":"0.0"}},{"$f":"'Übersicht Schützen'!F34","v":{"v":0,"d":"0.0"}},{"$f":"'Übersicht Schützen'!G34","v":{"v":0,"d":"0.0"}},{"$f":"'Übersicht Schützen'!H34","v":{"v":0,"d":"0.0"}},{"$f":"'Übersicht Schützen'!I34","v":{"v":278.6,"d":"278.60"}},278.6,{"$f":"'Übersicht Schützen'!L34","v":{"v":0,"d":"0.0"}},{"$f":"'Übersicht Schützen'!M34","v":{"v":0,"d":"0.0"}},{"$f":"'Übersicht Schützen'!N34","v":{"v":0,"d":"0.0"}},{"$f":"'Übersicht Schützen'!O34","v":{"v":0,"d":"0.0"}},{"$f":"'Übersicht Schützen'!P34","v":{"v":0,"d":"0.0"}},{"$f":"'Übersicht Schützen'!Q34","v":{"v":0,"d":"0.0"}},{"$f":"'Übersicht Schützen'!R34","v":{"v":0,"d":"0.00"}},{"v":0,"d":"0.0"},{"$f":"'Übersicht Schützen'!U34","v":{"v":278.6,"d":"278.60"}},278.6,{"v":-18.19999999999999,"d":"-18.2"}]
[34,{"$f":"'Übersicht Schützen'!A35","v":"Schütze 17"},{"$f":"'Übersicht Schützen'!B35","v":"Börgermoor I"},{"$f":"'Übersicht Schützen'!C35","v":{"v":0,"d":"0.0"}},{"$f":"'Übersicht Schützen'!D35","v":{"v":0,"d":"0.0"}},{"$f":"'Übersicht Schützen'!E35","v":{"v":0,"d":"0.0"}},{"$f":"'Übersicht Schützen'!F35","v":{"v":0,"d":"0.0"}},{"$f":"'Übersicht Schützen'!G35","v":{"v":0,"d":"0.0"}},{"$f":"'Übersicht Schützen'!H35","v":{"v":0,"d":"0.0"}},{"$f":"'Übersicht Schützen'!I35","v":{"v":0,"d":"0.00"}},{"v":0,"d":"0.0"},{"$f":"'Übersicht Schützen'!L35","v":{"v":0,"d":"0.0"}},{"$f":"'Übersicht Schützen'!M35","v":{"v":0,"d":"0.0"}},{"$f":"'Übersicht Schützen'!N35","v":{"v":0,"d":"0.0"}},{"$f":"'Übersicht Schützen'!O35","v":{"v":0,"d":"0.0"}},{"$f":"'Übersicht Schützen'!P35","v":{"v":0,"d":"0.0"}},{"$f":"'Übersicht Schützen'!Q35","v":{"v":0,"d":"0.0"}},{"$f":"'Übersicht Schützen'!R35","v":{"v":0,"d":"0.00"}},{"v":0,"d":"0.0"},{"$f":"'Übersicht Schützen'!U35","v":{"v":0,"d":"0.00"}},{"v":0,"d":"0.0"},-278.6]
[35,{"$f":"'Übersicht Schützen'!A36","v":"Schütze 18"},{"$f":"'Übersicht Schützen'!B36","v":"Börgermoor I"},{"$f":"'Übersicht Schützen'!C36","v":{"v":0,"d":"0.0"}},{"$f":"'Übersicht Schützen'!D36","v":{"v":0,"d":"0.0"}},{"$f":"'Übersicht Schützen'!E36","v":{"v":0,"d":"0.0"}},{"$f":"'Übersicht Schützen'!F36","v":{"v":0,"d":"0.0"}},{"$f":"'Übersicht Schützen'!G36","v":{"v":0,"d":"0.0"}},{"$f":"'Übersicht Schützen'!H36","v":{"v":0,"d":"0.0"}},{"$f":"'Übersicht Schützen'!I36","v":{"v":0,"d":"0.00"}},{"v":0,"d":"0.0"},{"$f":"'Übersicht Schützen'!L36","v":{"v":0,"d":"0.0"}},{"$f":"'Übersicht Schützen'!M36","v":{"v":0,"d":"0.0"}},{"$f":"'Übersicht Schützen'!N36","v":{"v":0,"d":"0.0"}},{"$f":"'Übersicht Schützen'!O36","v":{"v":0,"d":"0.0"}},{"$f":"'Übersicht Schützen'!P36","v":{"v":0,"d":"0.0"}},{"$f":"'Übersicht Schützen'!Q36","v":{"v":0,"d":"0.0"}},{"$f":"'Übersicht Schützen'!R36","v":{"v":0,"d":"0.00"}},{"v":0,"d":"0.0"},{"$f":"'Übersicht Schützen'!U36","v":{"v":0,"d":"0.00"}},{"v":0,"d":"0.0"},{"$f":"(U50-U51)*-1","v":{"v":0,"d":"0.0"}}]
[36,{"$f":"'Übersicht Schützen'!A37","v":"Schütze 36"},{"$f":"'Übersicht Schützen'!B37","v":"Spahnharrenstätte I"},{"$f":"'Übersicht Schützen'!C37","v":{"v":0,"d":"0.0"}},{"$f":"'Übersicht Schützen'!D37","v":{"v":0,"d":"0.0"}},{"$f":"'Übersicht Schützen'!E37","v":{"v":0,"d":"0.0"}},{"$f":"'Übersicht Schützen'!F37","v":{"v":0,"d":"0.0"}},{"$f":"'Übersicht Schützen'!G37","v":{"v":0,"d":"0.0"}},{"$f":"'Übersicht Schützen'!H37","v":{"v":0,"d":"0.0"}},{"$f":"'Übersicht Schützen'!I37","v":{"v":0,"d":"0.00"}},{"v":0,"d":"0.0"},{"$f":"'Übersicht Schützen'!L37","v":{"v":0,"d":"0.0"}},{"$f":"'Übersicht Schützen'!M37","v":{"v":0,"d":"0.0"}},{"$f":"'Übersicht Schützen'!N37","v":{"v":0,"d":"0.0"}},{"$f":"'Übersicht Schützen'!O37","v":{"v":0,"d":"0.0"}},{"$f":"'Übersicht Schützen'!P37","v":{"v":0,"d":"0.0"}},{"$f":"'Übersicht Schützen'!Q37","v":{"v":0,"d":"0.0"}},{"$f":"'Übersicht Schützen'!R37","v":{"v":0,"d":"0.00"}},{"v":0,"d":"0.0"},{"$f":"'Übersicht Schützen'!U37","v":{"v":0,"d":"0.00"}},{"v":0,"d":"0.0"},{"v":0,"d":"0.0"}]
[]
[null,null,"Schnitt:",{"$f":"IF(Formelhilfe!B45 > 0, SUM(D17:D52)/Formelhilfe!B45, 0)","v":{"v":300.7724137931035,"d":"300.8"}},{"$f":"IF(Formelhilfe!C45 > 0, SUM(E17:E52)/Formelhilfe!C45, 0)","v":{"v":301.5903225806452,"d":"301.6"}},{"$f":"IF(Formelhilfe!D45 > 0, SUM(F17:F52)/Formelhilfe!D45, 0)","v":{"v":303.73333333333335,"d":"303.7"}},{"$f":"IF(Formelhilfe!E45 > 0, SUM(G17:G52)/Formelhilfe!E45, 0)","v":{"v":305.1714285714285,"d":"305.2"}},{"$f":"IF(Formelhilfe!F45 > 0, SUM(H17:H52)/Formelhilfe!F45, 0)","v":{"v":301.12142857142857,"d":"301.1"}},{"$f":"IF(Formelhilfe!G45 > 0, SUM(I17:I52)/Formelhilfe!G45, 0)","v":{"v":303.9660714285715,"d":"304.0"}},{"$f":"IF(SUM(J17:J52)<>0,AVERAGEIF(J17:J52,\"<>0\"),0)","v":{"v":301.19311827956994,"d":"301.19"}},{"$f":"IF(SUM(K17:K52)<>0,AVERAGEIF(K17:K52,\"<>0\"),0)","v":{"v":1669.66935483871,"d":"1669.67"}},{"$f":"IF(Formelhilfe!I45 > 0, SUM(L17:L52)/Formelhilfe!I45, 0)","v":{"v":301.92500000000007,"d":"301.9"}},{"$f":"IF(Formelhilfe!J45 > 0, SUM(M17:M52)/Formelhilfe!J45, 0)","v":{"v":304.5148148148149,"d":"304.5"}},{"$f":"IF(Formelhilfe!K45 > 0, SUM(N17:N52)/Formelhilfe!K45, 0)","v":{"v":303.02962962962965,"d":"303.0"}},{"$f":"IF(Formelhilfe!L45 > 0, SUM(O17:O52)/Formelhilfe!L45, 0)","v":{"v":305.6769230769231,"d":"305.7"}},{"$f":"IF(Formelhilfe!M45 > 0, SUM(P17:P52)/Formelhilfe!M45, 0)","v":{"v":304.52400000000006,"d":"304.5"}},{"$f":"IF(Formelhilfe!N45 > 0, SUM(Q17:Q52)/Formelhilfe!N45, 0)","v":{"v":0,"d":"0.0"}},{"$f":"IF(SUM(R17:R52)<>0,AVERAGEIF(R17:R52,\"<>0\"),0)","v":{"v":301.59381720430105,"d":"301.59"}},{"$f":"IF(SUM(S17:S52)<>0,AVERAGEIF(S17:S52,\"<>0\"),0)","v":{"v":1303.8161290322578,"d":"1303.82"}},{"v":300.8439462809917,"d":"300.84"},{"$f":"(K54+S54)","v":{"v":2973.485483870968,"d":"2,973.49 "}}]

{"sheet":"Wettkampf 1","index":1,"n_rows":47,"n_cols":29,"rows_kept":47,"merged":[[0,24,0,25],[1,24,1,25],[4,24,4,25],[5,24,5,25],[6,24,6,25],[8,22,8,25]]}
[null,"Verein / Gruppe",null,"Ergebnisse",{"$nulls":19},"Austragungsort:",{"$f":"Übersicht!D4","v":"Börger"}]
[1,"Börger II",null,{"$f":"G46","v":912.5},{"$f":"IF(H46>4,\"Es sind zu viele Schützen in Wertung!\",\" \")","v":" "},{"$nulls":18},"Wettkampftag:",{"$f":"Übersicht!D3","v":"18.08."}]
[2,"Neuvrees II",null,{"$f":"I46","v":{"v":924,"d":"924.0"}},{"$f":"IF(J46>4,\"Es sind zu viele Schützen in Wertung!\",\" \")","v":" "}]
[3,"Börgermoor I",null,{"$f":"K46","v":911.8},{"$f":"IF(L46>4,\"Es sind zu viele Schützen in Wertung!\",\" \")","v":" "},{"$nulls":20},"Ansprechpartner für Rückfragen:"]
[4,"Lorup III",null,{"$f":"M46","v":931.6},{"$f":"IF(N46>4,\"Es sind zu viele Schützen in Wertung!\",\" \")","v":" "},{"$nulls":18},"Name:","Margret Pohlgeers"]
[5,"Ostenwalde II",null,{"$f":"O46","v":911.2},{"$f":"IF(P46>4,\"Es sind zu viele Schützen in Wertung!\",\" \")","v":" "},{"$nulls":18},"Tel:","059538976"]
[6,"Spahnharrenstätte I",null,{"$f":"Q46","v":{"v":919,"d":"919.0"}},{"$f":"IF(R46>4,\"Es sind zu viele Schützen in Wertung!\",\" \")","v":" "},{"$nulls":18},"Standaufsicht:","Johann Pohlgeers"]
[]
[null,"Einzelergebnisse:","Verein/Gruppe (per Dropdown-Feld einzutragen)","Ergebnisse","AW? Dann x eintippen",null,"Verein 1",null,"Verein 2",null,"Verein 3",null,"Verein 4",null,"Verein 5",null,"Verein 6",{"$nulls":3},"Geburtsdatum",null,"Proberechnung bei Streifen:"]
[1,"Gertrud Kuchta","Börger II",300.7,null,{"$f":"IF(E10=\"x\",\"0\",D10)","v":300.7},{"$f":"IF(C10=$B$2,F10,0)","v":300.7},{"$f":"(IF(AND($E10=\"\",$C10=$B$2),1,0))","v":1},{"$f":"IF($C10=$B$3,F10,0)","v":0},{"$f":"(IF(AND($E10=\"\",$C10=$B$3),1,0))","v":0},{"$f":"IF($C10=$B$4,F10,0)","v":0},{"$f":"(IF(AND($E10=\"\",$C10=$B$4),1,0))","v":0},{"$f":"IF($C10=$B$5,F10,0)","v":0},{"$f":"(IF(AND($E10=\"\",$C10=$B$5),1,0))","v":0},{"$f":"IF($C10=$B$6,F10,0)","v":0},{"$f":"(IF(AND($E10=\"\",$C10=$B$6),1,0))","v":0},{"$f":"IF($C10=$B$7,F10,0)","v":0},{"$f":"(IF(AND($E10=\"\",$C10=$B$7),1,0))","v":0},{"$nulls":7},{"$f":"W10+X10+Y10","v":{"v":0,"d":"0.0"}},{"$f":"IF(Z10=D10,1,0)","v":0},{"$f":"IF(Z10=0,0,1)","v":0},{"$f":"IF(AA10+AB10=2,\"Korrekt\",\"\")","v":""}]
[2,"Sarah Breer","Börger II",288.8,"x",{"$f":"IF(E11=\"x\",\"0\",D11)","v":"0"},{"$f":"IF(C11=$B$2,F11,0)","v":"0"},{"$f":"(IF(AND($E11=\"\",$C11=$B$2),1,0))","v":0},{"$f":"IF($C11=$B$3,F11,0)","v":0},{"$f":"(IF(AND($E11=\"\",$C11=$B$3),1,0))","v":0},{"$f":"IF($C11=$B$4,F11,0)","v":0},{"$f":"(IF(AND($E11=\"\",$C11=$B$4),1,0))","v":0},{"$f":"IF($C11=$B$5,F11,0)","v":0},{"$f":"(IF(AND($E11=\"\",$C11=$B$5),1,0))","v":0},{"$f":"IF($C11=$B$6,F11,0)","v":0},{"$f":"(IF(AND($E11=\"\",$C11=$B$6),1,0))","v":0},{"$f":"IF($C11=$B$7,F11,0)","v":0},{"$f":"(IF(AND($E11=\"\",$C11=$B$7),1,0))","v":0},{"$nulls":7},{"$f":"W11+X11+Y11","v":{"v":0,"d":"0.0"}},{"$f":"IF(Z11=D11,1,0)","v":0},{"$f":"IF(Z11=0,0,1)","v":0},{"$f":"IF(AA11+AB11=2,\"Korrekt\",\"\")","v":""}]
[3,"Margret Pohlgeers","Börger II",310.6,null,310.6,310.6,1,0,0,0,0,0,0,0,0,0,0,{"$nulls":7},{"v":0,"d":"0.0"},0,0,""]
[4,"Gundula Schwarte","Börger II",297.5,null,297.5,297.5,1,0,0,0,0,0,0,0,0,0,0,{"$nulls":7},{"v":0,"d":"0.0"},0,0,""]
[5,"Annette Schwarte","Börger II",301.2,null,301.2,301.2,1,0,0,0,0,0,0,0,0,0,0,{"$nulls":7},{"v":0,"d":"0.0"},0,0,""]
[6,"Petra Dödtmann","Börger II",null,"x","0","0",0,0,0,0,0,0,0,0,0,0,0,{"$nulls":7},{"v":0,"d":"0.0"},1,0,""]
[7,"Sarah Deyen","Neuvrees II",308.1,null,308.1,0,0,308.1,1,0,0,0,0,0,0,0,0,{"$nulls":7},{"v":0,"d":"0.0"},0,0,""]
[8,"Silvia Thunert","Neuvrees II",310.7,null,310.7,0,0,310.7,1,0,0,0,0,0,0,0,0,{"$nulls":7},{"v":0,"d":"0.0"},0,0,""]
[9,"Margret Pohlmann","Neuvrees II",298.4,null,298.4,0,0,298.4,1,0,0,0,0,0,0,0,0,{"$nulls":7},{"v":0,"d":"0.0"},0,0,""]
[10,"Harma Steenken","Neuvrees II",275.9,"x","0",0,0,"0",0,0,0,0,0,0,0,0,0,{"$nulls":7},{"v":0,"d":"0.0"},0,0,""]
[11,"Claudia Rolfes","Neuvrees II",305.2,null,305.2,0,0,305.2,1,0,0,0,0,0,0,0,0,{"$nulls":7},{"v":0,"d":"0.0"},0,0,""]
[12,"Silvia Junge","Neuvrees II",296.5,"x","0",0,0,"0",0,0,0,0,0,0,0,0,0,{"$nulls":7},{"v":0,"d":"0.0"},0,0,""]
[13,"Ulla Schnieders","Börgermoor I",306.6,null,306.6,0,0,0,0,306.6,1,0,0,0,0,0,0,{"$nulls":7},{"v":0,"d":"0.0"},0,0,""]
[14,"Jasmin Kramer","Börgermoor I",298.8,null,298.8,0,0,0,0,298.8,1,0,0,0,0,0,0,{"$nulls":7},{"v":0,"d":"0.0"},0,0,""]
[15,"Anni Küwen","Börgermoor I",299.3,null,299.3,0,0,0,0,299.3,1,0,0,0,0,0,0,{"$nulls":7},{"v":0,"d":"0.0"},0,0,""]
[16,"Waltraud Dobelmann","Börgermoor I",305.9,null,305.9,0,0,0,0,305.9,1,0,0,0,0,0,0,{"$nulls":7},{"v":0,"d":"0.0"},0,0,""]
[17,"Schütze 17","Börgermoor I",null,"x","0",0,0,0,0,"0",0,0,0,0,0,0,0,{"$nulls":7},{"v":0,"d":"0.0"},1,0,""]
[18,"Schütze 18","Börgermoor I",null,"x","0",0,0,0,0,"0",0,0,0,0,0,0,0,{"$nulls":7},{"v":0,"d":"0.0"},1,0,""]
[19,"Hanna Gebken","Lorup III",309.8,null,309.8,0,0,0,0,0,0,309.8,1,0,0,0,0,{"$nulls":7},{"v":0,"d":"0.0"},0,0,""]
[20,"Monika Reimann","Lorup III",307.6,null,307.6,0,0,0,0,0,0,307.6,1,0,0,0,0,{"$nulls":7},{"v":0,"d":"0.0"},0,0,""]
[21,"Marina Schrand","Lorup III",305.9,null,305.9,0,0,0,0,0,0,305.9,1,0,0,0,0,{"$nulls":7},{"v":0,"d":"0.0"},0,0,""]
[22,"Nadine Krömer","Lorup III",314.2,null,314.2,0,0,0,0,0,0,314.2,1,0,0,0,0,{"$nulls":7},{"v":0,"d":"0.0"},0,0,""]
[23,"Nina Krömer","Lorup III",274.4,"x","0",0,0,0,0,0,0,"0",0,0,0,0,0,{"$nulls":7},{"v":0,"d":"0.0"},0,0,""]
[24,"Margret Büter","Lorup III",288.4,"x","0",0,0,0,0,0,0,"0",0,0,0,0,0,{"$nulls":7},{"v":0,"d":"0.0"},0,0,""]
[25,"Sarah Meiners","Ostenwalde II",292.6,null,292.6,0,0,0,0,0,0,0,0,292.6,1,0,0,{"$nulls":7},{"v":0,"d":"0.0"},0,0,""]
[26,"Anna Temmen","Ostenwalde II",307.5,null,307.5,0,0,0,0,0,0,0,0,307.5,1,0,0,{"$nulls":7},{"v":0,"d":"0.0"},0,0,""]
[27,"Helga Meiners","Ostenwalde II",302.1,null,302.1,0,0,0,0,0,0,0,0,302.1,1,0,0,{"$nulls":7},{"v":0,"d":"0.0"},0,0,""]
[28,"Carmen Benten","Ostenwalde II",301.6,null,301.6,0,0,0,0,0,0,0,0,301.6,1,0,0,{"$nulls":7},{"v":0,"d":"0.0"},0,0,""]
[29,"Anna -Maria Wimberg","Ostenwalde II",{"v":0,"d":"0.0"},"x","0",0,0,0,0,0,0,0,0,"0",0,0,0,{"$nulls":7},{"v":0,"d":"0.0"},1,0,""]
[30,"Evelyn Feder","Ostenwalde II",{"v":0,"d":"0.0"},"x","0",0,0,0,0,0,0,0,0,"0",0,0,0,{"$nulls":7},{"v":0,"d":"0.0"},1,0,""]
[31,"Monika Jansen","Spahnharrenstätte I",312.1,null,312.1,0,0,0,0,0,0,0,0,0,0,312.1,1,{"$nulls":7},{"$f":"W40+X40+Y40","v":{"v":0,"d":"0.0"}},{"$f":"IF(Z40=D40,1,0)","v":0},{"$f":"IF(Z40=0,0,1)","v":0},{"$f":"IF(AA40+AB40=2,\"Korrekt\",\"\")","v":""}]
[32,"Kerstin Sträche","Spahnharrenstätte I",302.8,null,302.8,0,0,0,0,0,0,0,0,0,0,302.8,1,{"$nulls":7},{"v":0,"d":"0.0"},0,0,""]
[33,"Rita Hanekamp","Spahnharrenstätte I",295.1,null,295.1,0,0,0,0,0,0,0,0,0,0,295.1,1,{"$nulls":7},{"v":0,"d":"0.0"},0,0,""]
[34,"Maria Beusing","Spahnharrenstätte I",304.1,null,304.1,0,0,0,0,0,0,0,0,0,0,304.1,1,{"$nulls":7},{"v":0,"d":"0.0"},0,0,""]
[35,"Schütze 35","Spahnharrenstätte I",null,"x","0",0,0,0,0,0,0,0,0,0,0,"0",0,{"$nulls":7},{"v":0,"d":"0.0"},1,0,""]
[36,"Schütze 36","Spahnharrenstätte I",null,"x","0",0,0,0,0,0,0,0,0,0,0,"0",0,{"$nulls":7},{"$f":"W45+X45+Y45","v":{"v":0,"d":"0.0"}},{"$f":"IF(Z45=D45,1,0)","v":1},{"$f":"IF(Z45=0,0,1)","v":0},{"$f":"IF(AA45+AB45=2,\"Korrekt\",\"\")","v":""}]
[{"$nulls":6},{"$f":"LARGE(G10:G45,1)+LARGE(G10:G45,2)+LARGE(G10:G45,3)","v":912.5},{"$f":"SUM(H10:H45)","v":4},{"$f":"LARGE(I10:I45,1)+LARGE(I10:I45,2)+LARGE(I10:I45,3)","v":924},{"$f":"SUM(J10:J45)","v":4},{"$f":"LARGE(K10:K45,1)+LARGE(K10:K45,2)+LARGE(K10:K45,3)","v":911.8},{"$f":"SUM(L10:L45)","v":4},{"$f":"LARGE(M10:M45,1)+LARGE(M10:M45,2)+LARGE(M10:M45,3)","v":931.6},{"$f":"SUM(N10:N45)","v":4},{"$f":"LARGE(O10:O45,1)+LARGE(O10:O45,2)+LARGE(O10:O45,3)","v":911.2},{"$f":"SUM(P10:P45)","v":4},{"$f":"LARGE(Q10:Q45,1)+LARGE(Q10:Q45,2)+LARGE(Q10:Q45,3)","v":919},{"$f":"SUM(R10:S45)","v":4}]
[null,null,"per Email an: sk-huemmling@gmx.de"]

{"sheet":"2","index":2,"n_rows":47,"n_cols":27,"rows_kept":47,"merged":[[0,22,0,23],[1,22,1,23],[4,22,4,23],[5,22,5,23],[6,22,6,23],[8,20,8,23]]}
[null,"Verein / Gruppe",null,"Ergebnisse",{"$nulls":17},"Austragungsort:",{"$f":"Übersicht!E4","v":"Neuvrees"}]
[1,{"$f":"'Wettkampf 1'!B2","v":"Börger II"},null,{"$f":"G46","v":{"v":915.5999999999999,"d":"915.6"}},{"$f":"IF(H46>4,\"Es sind zu viele Schützen in Wertung!\",\" \")","v":" "},{"$nulls":16},"Wettkampftag:",{"$f":"Übersicht!E3","v":"01.09."}]
[2,{"$f":"'Wettkampf 1'!B3","v":"Neuvrees II"},null,{"$f":"I46","v":{"v":921.9000000000001,"d":"921.9"}},{"$f":"IF(J46>4,\"Es sind zu viele Schützen in Wertung!\",\" \")","v":" "}]
[3,{"$f":"'Wettkampf 1'!B4","v":"Börgermoor I"},null,{"$f":"K46","v":914.6},{"$f":"IF(L46>4,\"Es sind zu viele Schützen in Wertung!\",\" \")","v":" "},{"$nulls":18},"Ansprechpartner für Rückfragen:"]
[4,{"$f":"'Wettkampf 1'!B5","v":"Lorup III"},null,{"$f":"M46","v":{"v":931.3000000000001,"d":"931.3"}},{"$f":"IF(N46>4,\"Es sind zu viele Schützen in Wertung!\",\" \")","v":" "},{"$nulls":16},"Name:","Silvia Thunert"]
[5,{"$f":"'Wettkampf 1'!B6","v":"Ostenwalde II"},null,{"$f":"O46","v":{"v":913.9999999999999,"d":"914.0"}},{"$f":"IF(P46>4,\"Es sind zu viele Schützen in Wertung!\",\" \")","v":" "},{"$nulls":16},"Tel:","04493-998686"]
[6,{"$f":"'Wettkampf 1'!B7","v":"Spahnharrenstätte I"},null,{"$f":"Q46","v":{"v":932.8999999999999,"d":"932.9"}},{"$f":"IF(R46>4,\"Es sind zu viele Schützen in Wertung!\",\" \")","v":" "},{"$nulls":16},"Standaufsicht:","Silvia Thunert"]
[]
[null,"Einzelergebnisse:","Verein / Gruppe","Ergebnisse (mindestens 0 eintragen)","AW? Dann x eintippen",null,"Verein 1",null,"Verein 2",null,"Verein 3",null,"Verein 4",null,"Verein 5",null,"Verein 6",{"$nulls":3},"Proberechnung bei Streifen:"]
[1,{"$f":"'Wettkampf 1'!B10","v":"Gertrud Kuchta"},{"$f":"'Wettkampf 1'!C10","v":"Börger II"},303.7,null,{"$f":"IF(E10=\"x\",\"0\",D10)","v":303.7},{"$f":"IF(C10=$B$2,F10,0)","v":303.7},{"$f":"(IF(AND($E10=\"\",$C10=$B$2),1,0))","v":1},{"$f":"IF($C10=$B$3,F10,0)","v":0},{"$f":"(IF(AND($E10=\"\",$C10=$B$3),1,0))","v":0},{"$f":"IF($C10=$B$4,F10,0)","v":0},{"$f":"(IF(AND($E10=\"\",$C10=$B$4),1,0))","v":0},{"$f":"IF($C10=$B$5,F10,0)","v":0},{"$f":"(IF(AND($E10=\"\",$C10=$B$5),1,0))","v":0},{"$f":"IF($C10=$B$6,F10,0)","v":0},{"$f":"(IF(AND($E10=\"\",$C10=$B$6),1,0))","v":0},{"$f":"IF($C10=$B$7,F10,0)","v":0},{"$f":"(IF(AND($E10=\"\",$C10=$B$7),1,0))","v":0},{"$nulls":5},{"$f":"U10+V10+W10","v":{"v":0,"d":"0.0"}},{"$f":"IF(X10=D10,1,0)","v":0},{"$f":"IF(X10=0,0,1)","v":0},{"$f":"IF(Y10+Z10=2,\"Korrekt\",\"\")","v":""}]
[2,{"$f":"'Wettkampf 1'!B11","v":"Sarah Breer"},{"$f":"'Wettkampf 1'!C11","v":"Börger II"},283.5,"x",{"$f":"IF(E11=\"x\",\"0\",D11)","v":"0"},{"$f":"IF(C11=$B$2,F11,0)","v":"0"},{"$f":"(IF(AND($E11=\"\",$C11=$B$2),1,0))","v":0},{"$f":"IF($C11=$B$3,F11,0)","v":0},{"$f":"(IF(AND($E11=\"\",$C11=$B$3),1,0))","v":0},{"$f":"IF($C11=$B$4,F11,0)","v":0},{"$f":"(IF(AND($E11=\"\",$C11=$B$4),1,0))","v":0},{"$f":"IF($C11=$B$5,F11,0)","v":0},{"$f":"(IF(AND($E11=\"\",$C11=$B$5),1,0))","v":0},{"$f":"IF($C11=$B$6,F11,0)","v":0},{"$f":"(IF(AND($E11=\"\",$C11=$B$6),1,0))","v":0},{"$f":"IF($C11=$B$7,F11,0)","v":0},{"$f":"(IF(AND($E11=\"\",$C11=$B$7),1,0))","v":0},{"$nulls":5},{"$f":"U11+V11+W11","v":{"v":0,"d":"0.0"}},{"$f":"IF(X11=D11,1,0)","v":0},{"$f":"IF(X11=0,0,1)","v":0},{"$f":"IF(Y11+Z11=2,\"Korrekt\",\"\")","v":""}]
[3,{"$f":"'Wettkampf 1'!B12","v":"Margret Pohlgeers"},{"$f":"'Wettkampf 1'!C12","v":"Börger II"},307.4,null,307.4,307.4,1,0,0,0,0,0,0,0,0,0,0,{"$nulls":5},{"v":0,"d":"0.0"},0,0,""]
[4,{"$f":"'Wettkampf 1'!B13","v":"Gundula Schwarte"},{"$f":"'Wettkampf 1'!C13","v":"Börger II"},298.7,"x","0","0",0,0,0,0,0,0,0,0,0,0,0,{"$nulls":5},{"v":0,"d":"0.0"},0,0,""]
[5,{"$f":"'Wettkampf 1'!B14","v":"Annette Schwarte"},{"$f":"'Wettkampf 1'!C14","v":"Börger II"},298.2,null,298.2,298.2,1,0,0,0,0,0,0,0,0,0,0,{"$nulls":5},{"v":0,"d":"0.0"},0,0,""]
[6,{"$f":"'Wettkampf 1'!B15","v":"Petra Dödtmann"},{"$f":"'Wettkampf 1'!C15","v":"Börger II"},304.5,null,304.5,304.5,1,0,0,0,0,0,0,0,0,0,0,{"$nulls":5},{"v":0,"d":"0.0"},0,0,""]
[7,{"$f":"'Wettkampf 1'!B16","v":"Sarah Deyen"},{"$f":"'Wettkampf 1'!C16","v":"Neuvrees II"},305.2,null,305.2,0,0,305.2,1,0,0,0,0,0,0,0,0,{"$nulls":5},{"v":0,"d":"0.0"},0,0,""]
[8,{"$f":"'Wettkampf 1'!B17","v":"Silvia Thunert"},{"$f":"'Wettkampf 1'!C17","v":"Neuvrees II"},311.3,null,311.3,0,0,311.3,1,0,0,0,0,0,0,0,0,{"$nulls":5},{"v":0,"d":"0.0"},0,0,""]
[9,{"$f":"'Wettkampf 1'!B18","v":"Margret Pohlmann"},{"$f":"'Wettkampf 1'!C18","v":"Neuvrees II"},302.3,null,302.3,0,0,302.3,1,0,0,0,0,0,0,0,0,{"$nulls":5},{"v":0,"d":"0.0"},0,0,""]
[10,{"$f":"'Wettkampf 1'!B19","v":"Harma Steenken"},{"$f":"'Wettkampf 1'!C19","v":"Neuvrees II"},297.5,"x","0",0,0,"0",0,0,0,0,0,0,0,0,0,{"$nulls":5},{"v":0,"d":"0.0"},0,0,""]
[11,{"$f":"'Wettkampf 1'!B20","v":"Claudia Rolfes"},{"$f":"'Wettkampf 1'!C20","v":"Neuvrees II"},305.4,null,305.4,0,0,305.4,1,0,0,0,0,0,0,0,0,{"$nulls":5},{"v":0,"d":"0.0"},0,0,""]
[12,{"$f":"'Wettkampf 1'!B21","v":"Silvia Junge"},{"$f":"'Wettkampf 1'!C21","v":"Neuvrees II"},294.8,"x","0",0,0,"0",0,0,0,0,0,0,0,0,0,{"$nulls":5},{"v":0,"d":"0.0"},0,0,""]
[13,{"$f":"'Wettkampf 1'!B22","v":"Ulla Schnieders"},{"$f":"'Wettkampf 1'!C22","v":"Börgermoor I"},308.5,null,308.5,0,0,0,0,308.5,1,0,0,0,0,0,0,{"$nulls":5},{"v":0,"d":"0.0"},0,0,""]
[14,{"$f":"'Wettkampf 1'!B23","v":"Jasmin Kramer"},{"$f":"'Wettkampf 1'!C23","v":"Börgermoor I"},302.4,null,302.4,0,0,0,0,302.4,1,0,0,0,0,0,0,{"$nulls":5},{"v":0,"d":"0.0"},0,0,""]
[15,{"$f":"'Wettkampf 1'!B24","v":"Anni Küwen"},{"$f":"'Wettkampf 1'!C24","v":"Börgermoor I"},300.1,null,300.1,0,0,0,0,300.1,1,0,0,0,0,0,0,{"$nulls":5},{"v":0,"d":"0.0"},0,0,""]
[16,{"$f":"'Wettkampf 1'!B25","v":"Waltraud Dobelmann"},{"$f":"'Wettkampf 1'!C25","v":"Börgermoor I"},303.7,null,303.7,0,0,0,0,303.7,1,0,0,0,0,0,0,{"$nulls":5},{"v":0,"d":"0.0"},0,0,""]
[17,{"$f":"'Wettkampf 1'!B26","v":"Schütze 17"},{"$f":"'Wettkampf 1'!C26","v":"Börgermoor I"},{"v":0,"d":"0.0"},"x","0",0,0,0,0,"0",0,0,0,0,0,0,0,{"$nulls":5},{"v":0,"d":"0.0"},1,0,""]
[18,{"$f":"'Wettkampf 1'!B27","v":"Schütze 18"},{"$f":"'Wettkampf 1'!C27","v":"Börgermoor I"},{"v":0,"d":"0.0"},"x","0",0,0,0,0,"0",0,0,0,0,0,0,0,{"$nulls":5},{"v":0,"d":"0.0"},1,0,""]
[19,{"$f":"'Wettkampf 1'!B28","v":"Hanna Gebken"},{"$f":"'Wettkampf 1'!C28","v":"Lorup III"},311.6,null,311.6,0,0,0,0,0,0,311.6,1,0,0,0,0,{"$nulls":5},{"v":0,"d":"0.0"},0,0,""]
[20,{"$f":"'Wettkampf 1'!B29","v":"Monika Reimann"},{"$f":"'Wettkampf 1'!C29","v":"Lorup III"},303.8,null,303.8,0,0,0,0,0,0,303.8,1,0,0,0,0,{"$nulls":5},{"v":0,"d":"0.0"},0,0,""]
[21,{"$f":"'Wettkampf 1'!B30","v":"Marina Schrand"},{"$f":"'Wettkampf 1'!C30","v":"Lorup III"},306.4,null,306.4,0,0,0,0,0,0,306.4,1,0,0,0,0,{"$nulls":5},{"v":0,"d":"0.0"},0,0,""]
[22,{"$f":"'Wettkampf 1'!B31","v":"Nadine Krömer"},{"$f":"'Wettkampf 1'!C31","v":"Lorup III"},313.3,null,313.3,0,0,0,0,0,0,313.3,1,0,0,0,0,{"$nulls":5},{"v":0,"d":"0.0"},0,0,""]
[23,{"$f":"'Wettkampf 1'!B32","v":"Nina Krömer"},{"$f":"'Wettkampf 1'!C32","v":"Lorup III"},292.3,"x","0",0,0,0,0,0,0,"0",0,0,0,0,0,{"$nulls":5},{"v":0,"d":"0.0"},0,0,""]
[24,{"$f":"'Wettkampf 1'!B33","v":"Margret Büter"},{"$f":"'Wettkampf 1'!C33","v":"Lorup III"},277.1,"x","0",0,0,0,0,0,0,"0",0,0,0,0,0,{"$nulls":5},{"v":0,"d":"0.0"},0,0,""]
[25,{"$f":"'Wettkampf 1'!B34","v":"Sarah Meiners"},{"$f":"'Wettkampf 1'!C34","v":"Ostenwalde II"},291.6,null,291.6,0,0,0,0,0,0,0,0,291.6,1,0,0,{"$nulls":5},{"v":0,"d":"0.0"},0,0,""]
[26,{"$f":"'Wettkampf 1'!B35","v":"Anna Temmen"},{"$f":"'Wettkampf 1'!C35","v":"Ostenwalde II"},311.9,null,311.9,0,0,0,0,0,0,0,0,311.9,1,0,0,{"$nulls":5},{"v":0,"d":"0.0"},0,0,""]
[27,{"$f":"'Wettkampf 1'!B36","v":"Helga Meiners"},{"$f":"'Wettkampf 1'!C36","v":"Ostenwalde II"},293.4,null,293.4,0,0,0,0,0,0,0,0,293.4,1,0,0,{"$nulls":5},{"v":0,"d":"0.0"},0,0,""]
[28,{"$f":"'Wettkampf 1'!B37","v":"Carmen Benten"},{"$f":"'Wettkampf 1'!C37","v":"Ostenwalde II"},308.7,null,308.7,0,0,0,0,0,0,0,0,308.7,1,0,0,{"$nulls":5},{"v":0,"d":"0.0"},0,0,""]
[29,{"$f":"'Wettkampf 1'!B38","v":"Anna -Maria Wimberg"},{"$f":"'Wettkampf 1'!C38","v":"Ostenwalde II"},{"v":0,"d":"0.0"},"x","0",0,0,0,0,0,0,0,0,"0",0,0,0,{"$nulls":5},{"v":0,"d":"0.0"},1,0,""]
[30,{"$f":"'Wettkampf 1'!B39","v":"Evelyn Feder"},{"$f":"'Wettkampf 1'!C39","v":"Ostenwalde II"},{"v":0,"d":"0.0"},"x","0",0,0,0,0,0,0,0,0,"0",0,0,0,{"$nulls":5},{"v":0,"d":"0.0"},1,0,""]
[31,{"$f":"'Wettkampf 1'!B40","v":"Monika Jansen"},{"$f":"'Wettkampf 1'!C40","v":"Spahnharrenstätte I"},312.7,null,312.7,0,0,0,0,0,0,0,0,0,0,312.7,1,{"$nulls":5},{"$f":"U40+V40+W40","v":{"v":0,"d":"0.0"}},{"$f":"IF(X40=D40,1,0)","v":0},{"$f":"IF(X40=0,0,1)","v":0},{"$f":"IF(Y40+Z40=2,\"Korrekt\",\"\")","v":""}]
[32,{"$f":"'Wettkampf 1'!B41","v":"Kerstin Sträche"},{"$f":"'Wettkampf 1'!C41","v":"Spahnharrenstätte I"},311.9,null,311.9,0,0,0,0,0,0,0,0,0,0,311.9,1,{"$nulls":5},{"v":0,"d":"0.0"},0,0,""]
[33,{"$f":"'Wettkampf 1'!B42","v":"Rita Hanekamp"},{"$f":"'Wettkampf 1'!C42","v":"Spahnharrenstätte I"},300.5,null,300.5,0,0,0,0,0,0,0,0,0,0,300.5,1,{"$nulls":5},{"v":0,"d":"0.0"},0,0,""]
[34,{"$f":"'Wettkampf 1'!B43","v":"Maria Beusing"},{"$f":"'Wettkampf 1'!C43","v":"Spahnharrenstätte I"},308.3,null,308.3,0,0,0,0,0,0,0,0,0,0,308.3,1,{"$nulls":5},{"v":0,"d":"0.0"},0,0,""]
[35,{"$f":"'Wettkampf 1'!B44","v":"Schütze 35"},{"$f":"'Wettkampf 1'!C44","v":"Spahnharrenstätte I"},278.6,"x","0",0,0,0,0,0,0,0,0,0,0,"0",0,{"$nulls":5},{"v":0,"d":"0.0"},0,0,""]
[36,{"$f":"'Wettkampf 1'!B45","v":"Schütze 36"},{"$f":"'Wettkampf 1'!C45","v":"Spahnharrenstätte I"},{"v":0,"d":"0.0"},"x","0",0,0,0,0,0,0,0,0,0,0,"0",0,{"$nulls":5},{"$f":"U45+V45+W45","v":{"v":0,"d":"0.0"}},{"$f":"IF(X45=D45,1,0)","v":1},{"$f":"IF(X45=0,0,1)","v":0},{"$f":"IF(Y45+Z45=2,\"Korrekt\",\"\")","v":""}]
[{"$nulls":6},{"$f":"LARGE(G10:G45,1)+LARGE(G10:G45,2)+LARGE(G10:G45,3)","v":915.5999999999999},{"$f":"SUM(H10:H45)","v":4},{"$f":"LARGE(I10:I45,1)+LARGE(I10:I45,2)+LARGE(I10:I45,3)","v":921.9000000000001},{"$f":"SUM(J10:J45)","v":4},{"$f":"LARGE(K10:K45,1)+LARGE(K10:K45,2)+LARGE(K10:K45,3)","v":914.6},{"$f":"SUM(L10:L45)","v":4},{"$f":"LARGE(M10:M45,1)+LARGE(M10:M45,2)+LARGE(M10:M45,3)","v":931.3000000000001},{"$f":"SUM(N10:N45)","v":4},{"$f":"LARGE(O10:O45,1)+LARGE(O10:O45,2)+LARGE(O10:O45,3)","v":913.9999999999999},{"$f":"SUM(P10:P45)","v":4},{"$f":"LARGE(Q10:Q45,1)+LARGE(Q10:Q45,2)+LARGE(Q10:Q45,3)","v":932.8999999999999},{"$f":"SUM(R10:S45)","v":4}]
[null,null,"per Email an: sk-huemmling@gmx.de"]

{"sheet":"3","index":3,"n_rows":47,"n_cols":27,"rows_kept":47,"merged":[[0,22,0,23],[1,22,1,23],[4,22,4,23],[5,22,5,23],[6,22,6,23],[8,20,8,23]]}
[null,"Verein / Gruppe",null,"Ergebnisse",{"$nulls":17},"Austragungsort:",{"$f":"Übersicht!F4","v":"Börgermoor"}]
[1,{"$f":"'Wettkampf 1'!B2","v":"Börger II"},null,{"$f":"G46","v":922.7},{"$f":"IF(H46>4,\"Es sind zu viele Schützen in Wertung!\",\" \")","v":" "},{"$nulls":16},"Wettkampftag:",{"$f":"Übersicht!F3","v":"15.09."}]
[2,{"$f":"'Wettkampf 1'!B3","v":"Neuvrees II"},null,{"$f":"I46","v":925.5},{"$f":"IF(J46>4,\"Es sind zu viele Schützen in Wertung!\",\" \")","v":" "}]
[3,{"$f":"'Wettkampf 1'!B4","v":"Börgermoor I"},null,{"$f":"K46","v":922.2},{"$f":"IF(L46>4,\"Es sind zu viele Schützen in Wertung!\",\" \")","v":" "},{"$nulls":18},"Ansprechpartner für Rückfragen:"]
[4,{"$f":"'Wettkampf 1'!B5","v":"Lorup III"},null,{"$f":"M46","v":927.6},{"$f":"IF(N46>4,\"Es sind zu viele Schützen in Wertung!\",\" \")","v":" "},{"$nulls":16},"Name:","Ulla Schnieders"]
[5,{"$f":"'Wettkampf 1'!B6","v":"Ostenwalde II"},null,{"$f":"O46","v":924.3},{"$f":"IF(P46>4,\"Es sind zu viele Schützen in Wertung!\",\" \")","v":" "},{"$nulls":16},"Tel:","0172/4339021"]
[6,{"$f":"'Wettkampf 1'!B7","v":"Spahnharrenstätte I"},null,{"$f":"Q46","v":928.2},{"$f":"IF(R46>4,\"Es sind zu viele Schützen in Wertung!\",\" \")","v":" "},{"$nulls":16},"Standaufsicht:","Ulla Schnieders"]
[]
[null,"Einzelergebnisse:","Verein / Gruppe","Ergebnisse (mindestens 0 eintragen)","AW? Dann x eintippen",null,"Verein 1",null,"Verein 2",null,"Verein 3",null,"Verein 4",null,"Verein 5",null,"Verein 6",{"$nulls":3},"Proberechnung bei Streifen:"]
[1,{"$f":"'Wettkampf 1'!B10","v":"Gertrud Kuchta"},{"$f":"'Wettkampf 1'!C10","v":"Börger II"},305.3,null,{"$f":"IF(E10=\"x\",\"0\",D10)","v":305.3},{"$f":"IF(C10=$B$2,F10,0)","v":305.3},{"$f":"(IF(AND($E10=\"\",$C10=$B$2),1,0))","v":1},{"$f":"IF($C10=$B$3,F10,0)","v":0},{"$f":"(IF(AND($E10=\"\",$C10=$B$3),1,0))","v":0},{"$f":"IF($C10=$B$4,F10,0)","v":0},{"$f":"(IF(AND($E10=\"\",$C10=$B$4),1,0))","v":0},{"$f":"IF($C10=$B$5,F10,0)","v":0},{"$f":"(IF(AND($E10=\"\",$C10=$B$5),1,0))","v":0},{"$f":"IF($C10=$B$6,F10,0)","v":0},{"$f":"(IF(AND($E10=\"\",$C10=$B$6),1,0))","v":0},{"$f":"IF($C10=$B$7,F10,0)","v":0},{"$f":"(IF(AND($E10=\"\",$C10=$B$7),1,0))","v":0},{"$nulls":5},{"$f":"U10+V10+W10","v":{"v":0,"d":"0.0"}},{"$f":"IF(X10=D10,1,0)","v":0},{"$f":"IF(X10=0,0,1)","v":0},{"$f":"IF(Y10+Z10=2,\"Korrekt\",\"\")","v":""}]
[2,{"$f":"'Wettkampf 1'!B11","v":"Sarah Breer"},{"$f":"'Wettkampf 1'!C11","v":"Börger II"},284.3,"x",{"$f":"IF(E11=\"x\",\"0\",D11)","v":"0"},{"$f":"IF(C11=$B$2,F11,0)","v":"0"},{"$f":"(IF(AND($E11=\"\",$C11=$B$2),1,0))","v":0},{"$f":"IF($C11=$B$3,F11,0)","v":0},{"$f":"(IF(AND($E11=\"\",$C11=$B$3),1,0))","v":0},{"$f":"IF($C11=$B$4,F11,0)","v":0},{"$f":"(IF(AND($E11=\"\",$C11=$B$4),1,0))","v":0},{"$f":"IF($C11=$B$5,F11,0)","v":0},{"$f":"(IF(AND($E11=\"\",$C11=$B$5),1,0))","v":0},{"$f":"IF($C11=$B$6,F11,0)","v":0},{"$f":"(IF(AND($E11=\"\",$C11=$B$6),1,0))","v":0},{"$f":"IF($C11=$B$7,F11,0)","v":0},{"$f":"(IF(AND($E11=\"\",$C11=$B$7),1,0))","v":0},{"$nulls":5},{"$f":"U11+V11+W11","v":{"v":0,"d":"0.0"}},{"$f":"IF(X11=D11,1,0)","v":0},{"$f":"IF(X11=0,0,1)","v":0},{"$f":"IF(Y11+Z11=2,\"Korrekt\",\"\")","v":""}]
[3,{"$f":"'Wettkampf 1'!B12","v":"Margret Pohlgeers"},{"$f":"'Wettkampf 1'!C12","v":"Börger II"},311.3,null,311.3,311.3,1,0,0,0,0,0,0,0,0,0,0,{"$nulls":5},{"v":0,"d":"0.0"},0,0,""]
[4,{"$f":"'Wettkampf 1'!B13","v":"Gundula Schwarte"},{"$f":"'Wettkampf 1'!C13","v":"Börger II"},307.5,"x","0","0",0,0,0,0,0,0,0,0,0,0,0,{"$nulls":5},{"v":0,"d":"0.0"},0,0,""]
[5,{"$f":"'Wettkampf 1'!B14","v":"Annette Schwarte"},{"$f":"'Wettkampf 1'!C14","v":"Börger II"},306.1,null,306.1,306.1,1,0,0,0,0,0,0,0,0,0,0,{"$nulls":5},{"v":0,"d":"0.0"},0,0,""]
[6,{"$f":"'Wettkampf 1'!B15","v":"Petra Dödtmann"},{"$f":"'Wettkampf 1'!C15","v":"Börger II"},{"v":0,"d":"0.0"},"x","0","0",0,0,0,0,0,0,0,0,0,0,0,{"$nulls":5},{"v":0,"d":"0.0"},1,0,""]
[7,{"$f":"'Wettkampf 1'!B16","v":"Sarah Deyen"},{"$f":"'Wettkampf 1'!C16","v":"Neuvrees II"},309.7,null,309.7,0,0,309.7,1,0,0,0,0,0,0,0,0,{"$nulls":5},{"v":0,"d":"0.0"},0,0,""]
[8,{"$f":"'Wettkampf 1'!B17","v":"Silvia Thunert"},{"$f":"'Wettkampf 1'!C17","v":"Neuvrees II"},{"v":309,"d":"309.0"},null,{"v":309,"d":"309.0"},0,0,309,1,0,0,0,0,0,0,0,0,{"$nulls":5},{"v":0,"d":"0.0"},0,0,""]
[9,{"$f":"'Wettkampf 1'!B18","v":"Margret Pohlmann"},{"$f":"'Wettkampf 1'!C18","v":"Neuvrees II"},296.6,null,296.6,0,0,296.6,1,0,0,0,0,0,0,0,0,{"$nulls":5},{"v":0,"d":"0.0"},0,0,""]
[10,{"$f":"'Wettkampf 1'!B19","v":"Harma Steenken"},{"$f":"'Wettkampf 1'!C19","v":"Neuvrees II"},{"v":0,"d":"0.0"},"x","0",0,0,"0",0,0,0,0,0,0,0,0,0,{"$nulls":5},{"v":0,"d":"0.0"},1,0,""]
[11,{"$f":"'Wettkampf 1'!B20","v":"Claudia Rolfes"},{"$f":"'Wettkampf 1'!C20","v":"Neuvrees II"},306.8,null,306.8,0,0,306.8,1,0,0,0,0,0,0,0,0,{"$nulls":5},{"v":0,"d":"0.0"},0,0,""]
[12,{"$f":"'Wettkampf 1'!B21","v":"Silvia Junge"},{"$f":"'Wettkampf 1'!C21","v":"Neuvrees II"},{"v":283,"d":"283.0"},"x","0",0,0,"0",0,0,0,0,0,0,0,0,0,{"$nulls":5},{"v":0,"d":"0.0"},0,0,""]
[13,{"$f":"'Wettkampf 1'!B22","v":"Ulla Schnieders"},{"$f":"'Wettkampf 1'!C22","v":"Börgermoor I"},309.8,null,309.8,0,0,0,0,309.8,1,0,0,0,0,0,0,{"$nulls":5},{"v":0,"d":"0.0"},0,0,""]
[14,{"$f":"'Wettkampf 1'!B23","v":"Jasmin Kramer"},{"$f":"'Wettkampf 1'!C23","v":"Börgermoor I"},306.2,null,306.2,0,0,0,0,306.2,1,0,0,0,0,0,0,{"$nulls":5},{"v":0,"d":"0.0"},0,0,""]
[15,{"$f":"'Wettkampf 1'!B24","v":"Anni Küwen"},{"$f":"'Wettkampf 1'!C24","v":"Börgermoor I"},306.2,null,306.2,0,0,0,0,306.2,1,0,0,0,0,0,0,{"$nulls":5},{"v":0,"d":"0.0"},0,0,""]
[16,{"$f":"'Wettkampf 1'!B25","v":"Waltraud Dobelmann"},{"$f":"'Wettkampf 1'!C25","v":"Börgermoor I"},{"v":300,"d":"300.0"},null,{"v":300,"d":"300.0"},0,0,0,0,300,1,0,0,0,0,0,0,{"$nulls":5},{"v":0,"d":"0.0"},0,0,""]
[17,{"$f":"'Wettkampf 1'!B26","v":"Schütze 17"},{"$f":"'Wettkampf 1'!C26","v":"Börgermoor I"},{"v":0,"d":"0.0"},"x","0",0,0,0,0,"0",0,0,0,0,0,0,0,{"$nulls":5},{"v":0,"d":"0.0"},1,0,""]
[18,{"$f":"'Wettkampf 1'!B27","v":"Schütze 18"},{"$f":"'Wettkampf 1'!C27","v":"Börgermoor I"},{"v":0,"d":"0.0"},"x","0",0,0,0,0,"0",0,0,0,0,0,0,0,{"$nulls":5},{"v":0,"d":"0.0"},1,0,""]
[19,{"$f":"'Wettkampf 1'!B28","v":"Hanna Gebken"},{"$f":"'Wettkampf 1'!C28","v":"Lorup III"},309.9,null,309.9,0,0,0,0,0,0,309.9,1,0,0,0,0,{"$nulls":5},{"v":0,"d":"0.0"},0,0,""]
[20,{"$f":"'Wettkampf 1'!B29","v":"Monika Reimann"},{"$f":"'Wettkampf 1'!C29","v":"Lorup III"},299.9,null,299.9,0,0,0,0,0,0,299.9,1,0,0,0,0,{"$nulls":5},{"v":0,"d":"0.0"},0,0,""]
[21,{"$f":"'Wettkampf 1'!B30","v":"Marina Schrand"},{"$f":"'Wettkampf 1'!C30","v":"Lorup III"},303.9,null,303.9,0,0,0,0,0,0,303.9,1,0,0,0,0,{"$nulls":5},{"v":0,"d":"0.0"},0,0,""]
[22,{"$f":"'Wettkampf 1'!B31","v":"Nadine Krömer"},{"$f":"'Wettkampf 1'!C31","v":"Lorup III"},313.8,null,313.8,0,0,0,0,0,0,313.8,1,0,0,0,0,{"$nulls":5},{"v":0,"d":"0.0"},0,0,""]
[23,{"$f":"'Wettkampf 1'!B32","v":"Nina Krömer"},{"$f":"'Wettkampf 1'!C32","v":"Lorup III"},304.6,"x","0",0,0,0,0,0,0,"0",0,0,0,0,0,{"$nulls":5},{"v":0,"d":"0.0"},0,0,""]
[24,{"$f":"'Wettkampf 1'!B33","v":"Margret Büter"},{"$f":"'Wettkampf 1'!C33","v":"Lorup III"},{"v":0,"d":"0.0"},"x","0",0,0,0,0,0,0,"0",0,0,0,0,0,{"$nulls":5},{"v":0,"d":"0.0"},1,0,""]
[25,{"$f":"'Wettkampf 1'!B34","v":"Sarah Meiners"},{"$f":"'Wettkampf 1'!C34","v":"Ostenwalde II"},{"v":286,"d":"286.0"},null,{"v":286,"d":"286.0"},0,0,0,0,0,0,0,0,286,1,0,0,{"$nulls":5},{"v":0,"d":"0.0"},0,0,""]
[26,{"$f":"'Wettkampf 1'!B35","v":"Anna Temmen"},{"$f":"'Wettkampf 1'!C35","v":"Ostenwalde II"},316.6,null,316.6,0,0,0,0,0,0,0,0,316.6,1,0,0,{"$nulls":5},{"v":0,"d":"0.0"},0,0,""]
[27,{"$f":"'Wettkampf 1'!B36","v":"Helga Meiners"},{"$f":"'Wettkampf 1'!C36","v":"Ostenwalde II"},299.3,null,299.3,0,0,0,0,0,0,0,0,299.3,1,0,0,{"$nulls":5},{"v":0,"d":"0.0"},0,0,""]
[28,{"$f":"'Wettkampf 1'!B37","v":"Carmen Benten"},{"$f":"'Wettkampf 1'!C37","v":"Ostenwalde II"},308.4,null,308.4,0,0,0,0,0,0,0,0,308.4,1,0,0,{"$nulls":5},{"v":0,"d":"0.0"},0,0,""]
[29,{"$f":"'Wettkampf 1'!B38","v":"Anna -Maria Wimberg"},{"$f":"'Wettkampf 1'!C38","v":"Ostenwalde II"},{"v":0,"d":"0.0"},"x","0",0,0,0,0,0,0,0,0,"0",0,0,0,{"$nulls":5},{"v":0,"d":"0.0"},1,0,""]
[30,{"$f":"'Wettkampf 1'!B39","v":"Evelyn Feder"},{"$f":"'Wettkampf 1'!C39","v":"Ostenwalde II"},{"v":0,"d":"0.0"},"x","0",0,0,0,0,0,0,0,0,"0",0,0,0,{"$nulls":5},{"v":0,"d":"0.0"},1,0,""]
[31,{"$f":"'Wettkampf 1'!B40","v":"Monika Jansen"},{"$f":"'Wettkampf 1'!C40","v":"Spahnharrenstätte I"},315.1,null,315.1,0,0,0,0,0,0,0,0,0,0,315.1,1,{"$nulls":5},{"v":0,"d":"0.0"},0,0,""]
[32,{"$f":"'Wettkampf 1'!B41","v":"Kerstin Sträche"},{"$f":"'Wettkampf 1'!C41","v":"Spahnharrenstätte I"},{"v":305,"d":"305.0"},null,{"v":305,"d":"305.0"},0,0,0,0,0,0,0,0,0,0,305,1,{"$nulls":5},{"v":0,"d":"0.0"},0,0,""]
[33,{"$f":"'Wettkampf 1'!B42","v":"Rita Hanekamp"},{"$f":"'Wettkampf 1'!C42","v":"Spahnharrenstätte I"},288.4,null,288.4,0,0,0,0,0,0,0,0,0,0,288.4,1,{"$nulls":5},{"v":0,"d":"0.0"},0,0,""]
[34,{"$f":"'Wettkampf 1'!B43","v":"Maria Beusing"},{"$f":"'Wettkampf 1'!C43","v":"Spahnharrenstätte I"},308.1,null,308.1,0,0,0,0,0,0,0,0,0,0,308.1,1,{"$nulls":5},{"v":0,"d":"0.0"},0,0,""]
[35,{"$f":"'Wettkampf 1'!B44","v":"Schütze 35"},{"$f":"'Wettkampf 1'!C44","v":"Spahnharrenstätte I"},{"v":0,"d":"0.0"},"x","0",0,0,0,0,0,0,0,0,0,0,"0",0,{"$nulls":5},{"v":0,"d":"0.0"},1,0,""]
[36,{"$f":"'Wettkampf 1'!B45","v":"Schütze 36"},{"$f":"'Wettkampf 1'!C45","v":"Spahnharrenstätte I"},{"v":0,"d":"0.0"},"x","0",0,0,0,0,0,0,0,0,0,0,"0",0,{"$nulls":5},{"v":0,"d":"0.0"},1,0,""]
[{"$nulls":6},{"$f":"LARGE(G10:G45,1)+LARGE(G10:G45,2)+LARGE(G10:G45,3)","v":922.7},{"$f":"SUM(H10:H45)","v":3},{"$f":"LARGE(I10:I45,1)+LARGE(I10:I45,2)+LARGE(I10:I45,3)","v":925.5},{"$f":"SUM(J10:J45)","v":4},{"$f":"LARGE(K10:K45,1)+LARGE(K10:K45,2)+LARGE(K10:K45,3)","v":922.2},{"$f":"SUM(L10:L45)","v":4},{"$f":"LARGE(M10:M45,1)+LARGE(M10:M45,2)+LARGE(M10:M45,3)","v":927.6},{"$f":"SUM(N10:N45)","v":4},{"$f":"LARGE(O10:O45,1)+LARGE(O10:O45,2)+LARGE(O10:O45,3)","v":924.3},{"$f":"SUM(P10:P45)","v":4},{"$f":"LARGE(Q10:Q45,1)+LARGE(Q10:Q45,2)+LARGE(Q10:Q45,3)","v":928.2},{"$f":"SUM(R10:S45)","v":4}]
[null,null,"per Email an: sk-huemmling@gmx.de"]

{"sheet":"4","index":4,"n_rows":47,"n_cols":27,"rows_kept":47,"merged":[[0,22,0,23],[1,22,1,23],[4,22,4,23],[5,22,5,23],[6,22,6,23],[8,20,8,23]]}
[null,"Verein / Gruppe",null,"Ergebnisse",{"$nulls":17},"Austragungsort:",{"$f":"Übersicht!G4","v":"Lorup"}]
[1,{"$f":"'Wettkampf 1'!B2","v":"Börger II"},null,{"$f":"G46","v":935.3},{"$f":"IF(H46>4,\"Es sind zu viele Schützen in Wertung!\",\" \")","v":" "},{"$nulls":16},"Wettkampftag:",{"$f":"Übersicht!G3","v":"29.09."}]
[2,{"$f":"'Wettkampf 1'!B3","v":"Neuvrees II"},null,{"$f":"I46","v":{"v":931.3000000000001,"d":"931.3"}},{"$f":"IF(J46>4,\"Es sind zu viele Schützen in Wertung!\",\" \")","v":" "}]
[3,{"$f":"'Wettkampf 1'!B4","v":"Börgermoor I"},null,{"$f":"K46","v":933.2},{"$f":"IF(L46>4,\"Es sind zu viele Schützen in Wertung!\",\" \")","v":" "},{"$nulls":18},"Ansprechpartner für Rückfragen:"]
[4,{"$f":"'Wettkampf 1'!B5","v":"Lorup III"},null,{"$f":"M46","v":933.5},{"$f":"IF(N46>4,\"Es sind zu viele Schützen in Wertung!\",\" \")","v":" "},{"$nulls":16},"Name:","Marina Schrand"]
[5,{"$f":"'Wettkampf 1'!B6","v":"Ostenwalde II"},null,{"$f":"O46","v":918.2},{"$f":"IF(P46>4,\"Es sind zu viele Schützen in Wertung!\",\" \")","v":" "},{"$nulls":16},"Tel:"]
[6,{"$f":"'Wettkampf 1'!B7","v":"Spahnharrenstätte I"},null,{"$f":"Q46","v":{"v":928.9000000000001,"d":"928.9"}},{"$f":"IF(R46>4,\"Es sind zu viele Schützen in Wertung!\",\" \")","v":" "},{"$nulls":16},"Standaufsicht:","Hanna Gebken"]
[]
[null,"Einzelergebnisse:","Verein / Gruppe","Ergebnisse (mindestens 0 eintragen)","AW? Dann x eintippen",null,"Verein 1",null,"Verein 2",null,"Verein 3",null,"Verein 4",null,"Verein 5",null,"Verein 6",{"$nulls":3},"Proberechnung bei Streifen:"]
[1,{"$f":"'Wettkampf 1'!B10","v":"Gertrud Kuchta"},{"$f":"'Wettkampf 1'!C10","v":"Börger II"},{"v":305,"d":"305.0"},null,{"$f":"IF(E10=\"x\",\"0\",D10)","v":{"v":305,"d":"305.0"}},{"$f":"IF(C10=$B$2,F10,0)","v":305},{"$f":"(IF(AND($E10=\"\",$C10=$B$2),1,0))","v":1},{"$f":"IF($C10=$B$3,F10,0)","v":0},{"$f":"(IF(AND($E10=\"\",$C10=$B$3),1,0))","v":0},{"$f":"IF($C10=$B$4,F10,0)","v":0},{"$f":"(IF(AND($E10=\"\",$C10=$B$4),1,0))","v":0},{"$f":"IF($C10=$B$5,F10,0)","v":0},{"$f":"(IF(AND($E10=\"\",$C10=$B$5),1,0))","v":0},{"$f":"IF($C10=$B$6,F10,0)","v":0},{"$f":"(IF(AND($E10=\"\",$C10=$B$6),1,0))","v":0},{"$f":"IF($C10=$B$7,F10,0)","v":0},{"$f":"(IF(AND($E10=\"\",$C10=$B$7),1,0))","v":0},{"$nulls":5},{"$f":"U10+V10+W10","v":{"v":0,"d":"0.0"}},{"$f":"IF(X10=D10,1,0)","v":0},{"$f":"IF(X10=0,0,1)","v":0},{"$f":"IF(Y10+Z10=2,\"Korrekt\",\"\")","v":""}]
[2,{"$f":"'Wettkampf 1'!B11","v":"Sarah Breer"},{"$f":"'Wettkampf 1'!C11","v":"Börger II"},null,"x",{"$f":"IF(E11=\"x\",\"0\",D11)","v":"0"},{"$f":"IF(C11=$B$2,F11,0)","v":"0"},{"$f":"(IF(AND($E11=\"\",$C11=$B$2),1,0))","v":0},{"$f":"IF($C11=$B$3,F11,0)","v":0},{"$f":"(IF(AND($E11=\"\",$C11=$B$3),1,0))","v":0},{"$f":"IF($C11=$B$4,F11,0)","v":0},{"$f":"(IF(AND($E11=\"\",$C11=$B$4),1,0))","v":0},{"$f":"IF($C11=$B$5,F11,0)","v":0},{"$f":"(IF(AND($E11=\"\",$C11=$B$5),1,0))","v":0},{"$f":"IF($C11=$B$6,F11,0)","v":0},{"$f":"(IF(AND($E11=\"\",$C11=$B$6),1,0))","v":0},{"$f":"IF($C11=$B$7,F11,0)","v":0},{"$f":"(IF(AND($E11=\"\",$C11=$B$7),1,0))","v":0},{"$nulls":5},{"$f":"U11+V11+W11","v":{"v":0,"d":"0.0"}},{"$f":"IF(X11=D11,1,0)","v":1},{"$f":"IF(X11=0,0,1)","v":0},{"$f":"IF(Y11+Z11=2,\"Korrekt\",\"\")","v":""}]
[3,{"$f":"'Wettkampf 1'!B12","v":"Margret Pohlgeers"},{"$f":"'Wettkampf 1'!C12","v":"Börger II"},315.2,null,315.2,315.2,1,0,0,0,0,0,0,0,0,0,0,{"$nulls":5},{"v":0,"d":"0.0"},0,0,""]
[4,{"$f":"'Wettkampf 1'!B13","v":"Gundula Schwarte"},{"$f":"'Wettkampf 1'!C13","v":"Börger II"},308.9,"x","0","0",0,0,0,0,0,0,0,0,0,0,0,{"$nulls":5},{"v":0,"d":"0.0"},0,0,""]
[5,{"$f":"'Wettkampf 1'!B14","v":"Annette Schwarte"},{"$f":"'Wettkampf 1'!C14","v":"Börger II"},304.3,null,304.3,304.3,1,0,0,0,0,0,0,0,0,0,0,{"$nulls":5},{"v":0,"d":"0.0"},0,0,""]
[6,{"$f":"'Wettkampf 1'!B15","v":"Petra Dödtmann"},{"$f":"'Wettkampf 1'!C15","v":"Börger II"},315.1,null,315.1,315.1,1,0,0,0,0,0,0,0,0,0,0,{"$nulls":5},{"v":0,"d":"0.0"},0,0,""]
[7,{"$f":"'Wettkampf 1'!B16","v":"Sarah Deyen"},{"$f":"'Wettkampf 1'!C16","v":"Neuvrees II"},312.6,null,312.6,0,0,312.6,1,0,0,0,0,0,0,0,0,{"$nulls":5},{"v":0,"d":"0.0"},0,0,""]
[8,{"$f":"'Wettkampf 1'!B17","v":"Silvia Thunert"},{"$f":"'Wettkampf 1'!C17","v":"Neuvrees II"},307.4,null,307.4,0,0,307.4,1,0,0,0,0,0,0,0,0,{"$nulls":5},{"v":0,"d":"0.0"},0,0,""]
[9,{"$f":"'Wettkampf 1'!B18","v":"Margret Pohlmann"},{"$f":"'Wettkampf 1'!C18","v":"Neuvrees II"},302.3,null,302.3,0,0,302.3,1,0,0,0,0,0,0,0,0,{"$nulls":5},{"v":0,"d":"0.0"},0,0,""]
[10,{"$f":"'Wettkampf 1'!B19","v":"Harma Steenken"},{"$f":"'Wettkampf 1'!C19","v":"Neuvrees II"},268.4,"x","0",0,0,"0",0,0,0,0,0,0,0,0,0,{"$nulls":5},{"v":0,"d":"0.0"},0,0,""]
[11,{"$f":"'Wettkampf 1'!B20","v":"Claudia Rolfes"},{"$f":"'Wettkampf 1'!C20","v":"Neuvrees II"},311.3,null,311.3,0,0,311.3,1,0,0,0,0,0,0,0,0,{"$nulls":5},{"v":0,"d":"0.0"},0,0,""]
[12,{"$f":"'Wettkampf 1'!B21","v":"Silvia Junge"},{"$f":"'Wettkampf 1'!C21","v":"Neuvrees II"},280.9,"x","0",0,0,"0",0,0,0,0,0,0,0,0,0,{"$nulls":5},{"v":0,"d":"0.0"},0,0,""]
[13,{"$f":"'Wettkampf 1'!B22","v":"Ulla Schnieders"},{"$f":"'Wettkampf 1'!C22","v":"Börgermoor I"},310.1,null,310.1,0,0,0,0,310.1,1,0,0,0,0,0,0,{"$nulls":5},{"v":0,"d":"0.0"},0,0,""]
[14,{"$f":"'Wettkampf 1'!B23","v":"Jasmin Kramer"},{"$f":"'Wettkampf 1'!C23","v":"Börgermoor I"},310.5,null,310.5,0,0,0,0,310.5,1,0,0,0,0,0,0,{"$nulls":5},{"v":0,"d":"0.0"},0,0,""]
[15,{"$f":"'Wettkampf 1'!B24","v":"Anni Küwen"},{"$f":"'Wettkampf 1'!C24","v":"Börgermoor I"},312.6,null,312.6,0,0,0,0,312.6,1,0,0,0,0,0,0,{"$nulls":5},{"v":0,"d":"0.0"},0,0,""]
[16,{"$f":"'Wettkampf 1'!B25","v":"Waltraud Dobelmann"},{"$f":"'Wettkampf 1'!C25","v":"Börgermoor I"},308.5,null,308.5,0,0,0,0,308.5,1,0,0,0,0,0,0,{"$nulls":5},{"v":0,"d":"0.0"},0,0,""]
[17,{"$f":"'Wettkampf 1'!B26","v":"Schütze 17"},{"$f":"'Wettkampf 1'!C26","v":"Börgermoor I"},null,"x","0",0,0,0,0,"0",0,0,0,0,0,0,0,{"$nulls":5},{"v":0,"d":"0.0"},1,0,""]
[18,{"$f":"'Wettkampf 1'!B27","v":"Schütze 18"},{"$f":"'Wettkampf 1'!C27","v":"Börgermoor I"},null,"x","0",0,0,0,0,"0",0,0,0,0,0,0,0,{"$nulls":5},{"v":0,"d":"0.0"},1,0,""]
[19,{"$f":"'Wettkampf 1'!B28","v":"Hanna Gebken"},{"$f":"'Wettkampf 1'!C28","v":"Lorup III"},312.2,null,312.2,0,0,0,0,0,0,312.2,1,0,0,0,0,{"$nulls":5},{"v":0,"d":"0.0"},0,0,""]
[20,{"$f":"'Wettkampf 1'!B29","v":"Monika Reimann"},{"$f":"'Wettkampf 1'!C29","v":"Lorup III"},305.8,"x","0",0,0,0,0,0,0,"0",0,0,0,0,0,{"$nulls":5},{"v":0,"d":"0.0"},0,0,""]
[21,{"$f":"'Wettkampf 1'!B30","v":"Marina Schrand"},{"$f":"'Wettkampf 1'!C30","v":"Lorup III"},306.2,null,306.2,0,0,0,0,0,0,306.2,1,0,0,0,0,{"$nulls":5},{"v":0,"d":"0.0"},0,0,""]
[22,{"$f":"'Wettkampf 1'!B31","v":"Nadine Krömer"},{"$f":"'Wettkampf 1'!C31","v":"Lorup III"},315.1,null,315.1,0,0,0,0,0,0,315.1,1,0,0,0,0,{"$nulls":5},{"v":0,"d":"0.0"},0,0,""]
[23,{"$f":"'Wettkampf 1'!B32","v":"Nina Krömer"},{"$f":"'Wettkampf 1'!C32","v":"Lorup III"},{"v":298,"d":"298.0"},null,{"v":298,"d":"298.0"},0,0,0,0,0,0,298,1,0,0,0,0,{"$nulls":5},{"v":0,"d":"0.0"},0,0,""]
[24,{"$f":"'Wettkampf 1'!B33","v":"Margret Büter"},{"$f":"'Wettkampf 1'!C33","v":"Lorup III"},null,"x","0",0,0,0,0,0,0,"0",0,0,0,0,0,{"$nulls":5},{"v":0,"d":"0.0"},1,0,""]
[25,{"$f":"'Wettkampf 1'!B34","v":"Sarah Meiners"},{"$f":"'Wettkampf 1'!C34","v":"Ostenwalde II"},290.4,null,290.4,0,0,0,0,0,0,0,0,290.4,1,0,0,{"$nulls":5},{"v":0,"d":"0.0"},0,0,""]
[26,{"$f":"'Wettkampf 1'!B35","v":"Anna Temmen"},{"$f":"'Wettkampf 1'!C35","v":"Ostenwalde II"},{"v":315,"d":"315.0"},null,{"v":315,"d":"315.0"},0,0,0,0,0,0,0,0,315,1,0,0,{"$nulls":5},{"v":0,"d":"0.0"},0,0,""]
[27,{"$f":"'Wettkampf 1'!B36","v":"Helga Meiners"},{"$f":"'Wettkampf 1'!C36","v":"Ostenwalde II"},298.7,null,298.7,0,0,0,0,0,0,0,0,298.7,1,0,0,{"$nulls":5},{"v":0,"d":"0.0"},0,0,""]
[28,{"$f":"'Wettkampf 1'!B37","v":"Carmen Benten"},{"$f":"'Wettkampf 1'!C37","v":"Ostenwalde II"},304.5,null,304.5,0,0,0,0,0,0,0,0,304.5,1,0,0,{"$nulls":5},{"v":0,"d":"0.0"},0,0,""]
[29,{"$f":"'Wettkampf 1'!B38","v":"Anna -Maria Wimberg"},{"$f":"'Wettkampf 1'!C38","v":"Ostenwalde II"},null,"x","0",0,0,0,0,0,0,0,0,"0",0,0,0,{"$nulls":5},{"v":0,"d":"0.0"},1,0,""]
[30,{"$f":"'Wettkampf 1'!B39","v":"Evelyn Feder"},{"$f":"'Wettkampf 1'!C39","v":"Ostenwalde II"},null,"x","0",0,0,0,0,0,0,0,0,"0",0,0,0,{"$nulls":5},{"v":0,"d":"0.0"},1,0,""]
[31,{"$f":"'Wettkampf 1'!B40","v":"Monika Jansen"},{"$f":"'Wettkampf 1'!C40","v":"Spahnharrenstätte I"},316.1,null,316.1,0,0,0,0,0,0,0,0,0,0,316.1,1,{"$nulls":5},{"v":0,"d":"0.0"},0,0,""]
[32,{"$f":"'Wettkampf 1'!B41","v":"Kerstin Sträche"},{"$f":"'Wettkampf 1'!C41","v":"Spahnharrenstätte I"},{"v":302,"d":"302.0"},null,{"v":302,"d":"302.0"},0,0,0,0,0,0,0,0,0,0,302,1,{"$nulls":5},{"v":0,"d":"0.0"},0,0,""]
[33,{"$f":"'Wettkampf 1'!B42","v":"Rita Hanekamp"},{"$f":"'Wettkampf 1'!C42","v":"Spahnharrenstätte I"},296.9,null,296.9,0,0,0,0,0,0,0,0,0,0,296.9,1,{"$nulls":5},{"v":0,"d":"0.0"},0,0,""]
[34,{"$f":"'Wettkampf 1'!B43","v":"Maria Beusing"},{"$f":"'Wettkampf 1'!C43","v":"Spahnharrenstätte I"},310.8,null,310.8,0,0,0,0,0,0,0,0,0,0,310.8,1,{"$nulls":5},{"v":0,"d":"0.0"},0,0,""]
[35,{"$f":"'Wettkampf 1'!B44","v":"Schütze 35"},{"$f":"'Wettkampf 1'!C44","v":"Spahnharrenstätte I"},null,"x","0",0,0,0,0,0,0,0,0,0,0,"0",0,{"$nulls":5},{"v":0,"d":"0.0"},1,0,""]
[36,{"$f":"'Wettkampf 1'!B45","v":"Schütze 36"},{"$f":"'Wettkampf 1'!C45","v":"Spahnharrenstätte I"},null,"x","0",0,0,0,0,0,0,0,0,0,0,"0",0,{"$nulls":5},{"v":0,"d":"0.0"},1,0,""]
[{"$nulls":6},{"$f":"LARGE(G10:G45,1)+LARGE(G10:G45,2)+LARGE(G10:G45,3)","v":935.3},{"$f":"SUM(H10:H45)","v":4},{"$f":"LARGE(I10:I45,1)+LARGE(I10:I45,2)+LARGE(I10:I45,3)","v":931.3000000000001},{"$f":"SUM(J10:J45)","v":4},{"$f":"LARGE(K10:K45,1)+LARGE(K10:K45,2)+LARGE(K10:K45,3)","v":933.2},{"$f":"SUM(L10:L45)","v":4},{"$f":"LARGE(M10:M45,1)+LARGE(M10:M45,2)+LARGE(M10:M45,3)","v":933.5},{"$f":"SUM(N10:N45)","v":4},{"$f":"LARGE(O10:O45,1)+LARGE(O10:O45,2)+LARGE(O10:O45,3)","v":918.2},{"$f":"SUM(P10:P45)","v":4},{"$f":"LARGE(Q10:Q45,1)+LARGE(Q10:Q45,2)+LARGE(Q10:Q45,3)","v":928.9000000000001},{"$f":"SUM(R10:S45)","v":4}]
[null,null,"per Email an: sk-huemmling@gmx.de"]

{"sheet":"5","index":5,"n_rows":47,"n_cols":27,"rows_kept":47,"merged":[[0,22,0,23],[1,22,1,23],[4,22,4,23],[5,22,5,23],[6,22,6,23],[8,20,8,23]]}
[null,"Verein / Gruppe",null,"Ergebnisse",{"$nulls":17},"Austragungsort:",{"$f":"Übersicht!H4","v":"Ostenwalde"}]
[1,{"$f":"'Wettkampf 1'!B2","v":"Börger II"},null,{"$f":"G46","v":921.1},{"$f":"IF(H46>4,\"Es sind zu viele Schützen in Wertung!\",\" \")","v":" "},{"$nulls":16},"Wettkampftag:",{"$f":"Übersicht!H3","v":"13.10."}]
[2,{"$f":"'Wettkampf 1'!B3","v":"Neuvrees II"},null,{"$f":"I46","v":913.8},{"$f":"IF(J46>4,\"Es sind zu viele Schützen in Wertung!\",\" \")","v":" "}]
[3,{"$f":"'Wettkampf 1'!B4","v":"Börgermoor I"},null,{"$f":"K46","v":{"v":921.9000000000001,"d":"921.9"}},{"$f":"IF(L46>4,\"Es sind zu viele Schützen in Wertung!\",\" \")","v":" "},{"$nulls":18},"Ansprechpartner für Rückfragen:"]
[4,{"$f":"'Wettkampf 1'!B5","v":"Lorup III"},null,{"$f":"M46","v":920.3},{"$f":"IF(N46>4,\"Es sind zu viele Schützen in Wertung!\",\" \")","v":" "},{"$nulls":16},"Name:","Philipp Schmidt"]
[5,{"$f":"'Wettkampf 1'!B6","v":"Ostenwalde II"},null,{"$f":"O46","v":907.8},{"$f":"IF(P46>4,\"Es sind zu viele Schützen in Wertung!\",\" \")","v":" "},{"$nulls":16},"Tel:"]
[6,{"$f":"'Wettkampf 1'!B7","v":"Spahnharrenstätte I"},null,{"$f":"Q46","v":917.3},{"$f":"IF(R46>4,\"Es sind zu viele Schützen in Wertung!\",\" \")","v":" "},{"$nulls":16},"Standaufsicht:","Philipp Schmidt"]
[]
[null,"Einzelergebnisse:","Verein / Gruppe","Ergebnisse (mindestens 0 eintragen)","AW? Dann x eintippen",null,"Verein 1",null,"Verein 2",null,"Verein 3",null,"Verein 4",null,"Verein 5",null,"Verein 6",{"$nulls":3},"Proberechnung bei Streifen:"]
[1,{"$f":"'Wettkampf 1'!B10","v":"Gertrud Kuchta"},{"$f":"'Wettkampf 1'!C10","v":"Börger II"},{"v":301,"d":"301.0"},"x",{"$f":"IF(E10=\"x\",\"0\",D10)","v":"0"},{"$f":"IF(C10=$B$2,F10,0)","v":"0"},{"$f":"(IF(AND($E10=\"\",$C10=$B$2),1,0))","v":0},{"$f":"IF($C10=$B$3,F10,0)","v":0},{"$f":"(IF(AND($E10=\"\",$C10=$B$3),1,0))","v":0},{"$f":"IF($C10=$B$4,F10,0)","v":0},{"$f":"(IF(AND($E10=\"\",$C10=$B$4),1,0))","v":0},{"$f":"IF($C10=$B$5,F10,0)","v":0},{"$f":"(IF(AND($E10=\"\",$C10=$B$5),1,0))","v":0},{"$f":"IF($C10=$B$6,F10,0)","v":0},{"$f":"(IF(AND($E10=\"\",$C10=$B$6),1,0))","v":0},{"$f":"IF($C10=$B$7,F10,0)","v":0},{"$f":"(IF(AND($E10=\"\",$C10=$B$7),1,0))","v":0},{"$nulls":5},{"$f":"U10+V10+W10","v":{"v":0,"d":"0.0"}},{"$f":"IF(X10=D10,1,0)","v":0},{"$f":"IF(X10=0,0,1)","v":0},{"$f":"IF(Y10+Z10=2,\"Korrekt\",\"\")","v":""}]
[2,{"$f":"'Wettkampf 1'!B11","v":"Sarah Breer"},{"$f":"'Wettkampf 1'!C11","v":"Börger II"},266.4,"x",{"$f":"IF(E11=\"x\",\"0\",D11)","v":"0"},{"$f":"IF(C11=$B$2,F11,0)","v":"0"},{"$f":"(IF(AND($E11=\"\",$C11=$B$2),1,0))","v":0},{"$f":"IF($C11=$B$3,F11,0)","v":0},{"$f":"(IF(AND($E11=\"\",$C11=$B$3),1,0))","v":0},{"$f":"IF($C11=$B$4,F11,0)","v":0},{"$f":"(IF(AND($E11=\"\",$C11=$B$4),1,0))","v":0},{"$f":"IF($C11=$B$5,F11,0)","v":0},{"$f":"(IF(AND($E11=\"\",$C11=$B$5),1,0))","v":0},{"$f":"IF($C11=$B$6,F11,0)","v":0},{"$f":"(IF(AND($E11=\"\",$C11=$B$6),1,0))","v":0},{"$f":"IF($C11=$B$7,F11,0)","v":0},{"$f":"(IF(AND($E11=\"\",$C11=$B$7),1,0))","v":0},{"$nulls":5},{"$f":"U11+V11+W11","v":{"v":0,"d":"0.0"}},{"$f":"IF(X11=D11,1,0)","v":0},{"$f":"IF(X11=0,0,1)","v":0},{"$f":"IF(Y11+Z11=2,\"Korrekt\",\"\")","v":""}]
[3,{"$f":"'Wettkampf 1'!B12","v":"Margret Pohlgeers"},{"$f":"'Wettkampf 1'!C12","v":"Börger II"},311.3,null,311.3,311.3,1,0,0,0,0,0,0,0,0,0,0,{"$nulls":5},{"v":0,"d":"0.0"},0,0,""]
[4,{"$f":"'Wettkampf 1'!B13","v":"Gundula Schwarte"},{"$f":"'Wettkampf 1'!C13","v":"Börger II"},304.4,null,304.4,304.4,1,0,0,0,0,0,0,0,0,0,0,{"$nulls":5},{"v":0,"d":"0.0"},0,0,""]
[5,{"$f":"'Wettkampf 1'!B14","v":"Annette Schwarte"},{"$f":"'Wettkampf 1'!C14","v":"Börger II"},301.2,null,301.2,301.2,1,0,0,0,0,0,0,0,0,0,0,{"$nulls":5},{"v":0,"d":"0.0"},0,0,""]
[6,{"$f":"'Wettkampf 1'!B15","v":"Petra Dödtmann"},{"$f":"'Wettkampf 1'!C15","v":"Börger II"},305.4,null,305.4,305.4,1,0,0,0,0,0,0,0,0,0,0,{"$nulls":5},{"v":0,"d":"0.0"},0,0,""]
[7,{"$f":"'Wettkampf 1'!B16","v":"Sarah Deyen"},{"$f":"'Wettkampf 1'!C16","v":"Neuvrees II"},301.4,null,301.4,0,0,301.4,1,0,0,0,0,0,0,0,0,{"$nulls":5},{"v":0,"d":"0.0"},0,0,""]
[8,{"$f":"'Wettkampf 1'!B17","v":"Silvia Thunert"},{"$f":"'Wettkampf 1'!C17","v":"Neuvrees II"},301.7,null,301.7,0,0,301.7,1,0,0,0,0,0,0,0,0,{"$nulls":5},{"v":0,"d":"0.0"},0,0,""]
[9,{"$f":"'Wettkampf 1'!B18","v":"Margret Pohlmann"},{"$f":"'Wettkampf 1'!C18","v":"Neuvrees II"},306.7,null,306.7,0,0,306.7,1,0,0,0,0,0,0,0,0,{"$nulls":5},{"v":0,"d":"0.0"},0,0,""]
[10,{"$f":"'Wettkampf 1'!B19","v":"Harma Steenken"},{"$f":"'Wettkampf 1'!C19","v":"Neuvrees II"},null,"x","0",0,0,"0",0,0,0,0,0,0,0,0,0,{"$nulls":5},{"v":0,"d":"0.0"},1,0,""]
[11,{"$f":"'Wettkampf 1'!B20","v":"Claudia Rolfes"},{"$f":"'Wettkampf 1'!C20","v":"Neuvrees II"},305.4,null,305.4,0,0,305.4,1,0,0,0,0,0,0,0,0,{"$nulls":5},{"v":0,"d":"0.0"},0,0,""]
[12,{"$f":"'Wettkampf 1'!B21","v":"Silvia Junge"},{"$f":"'Wettkampf 1'!C21","v":"Neuvrees II"},290.8,"x","0",0,0,"0",0,0,0,0,0,0,0,0,0,{"$nulls":5},{"v":0,"d":"0.0"},0,0,""]
[13,{"$f":"'Wettkampf 1'!B22","v":"Ulla Schnieders"},{"$f":"'Wettkampf 1'!C22","v":"Börgermoor I"},308.8,null,308.8,0,0,0,0,308.8,1,0,0,0,0,0,0,{"$nulls":5},{"v":0,"d":"0.0"},0,0,""]
[14,{"$f":"'Wettkampf 1'!B23","v":"Jasmin Kramer"},{"$f":"'Wettkampf 1'!C23","v":"Börgermoor I"},310.3,null,310.3,0,0,0,0,310.3,1,0,0,0,0,0,0,{"$nulls":5},{"v":0,"d":"0.0"},0,0,""]
[15,{"$f":"'Wettkampf 1'!B24","v":"Anni Küwen"},{"$f":"'Wettkampf 1'!C24","v":"Börgermoor I"},297.9,null,297.9,0,0,0,0,297.9,1,0,0,0,0,0,0,{"$nulls":5},{"v":0,"d":"0.0"},0,0,""]
[16,{"$f":"'Wettkampf 1'!B25","v":"Waltraud Dobelmann"},{"$f":"'Wettkampf 1'!C25","v":"Börgermoor I"},302.8,null,302.8,0,0,0,0,302.8,1,0,0,0,0,0,0,{"$nulls":5},{"v":0,"d":"0.0"},0,0,""]
[17,{"$f":"'Wettkampf 1'!B26","v":"Schütze 17"},{"$f":"'Wettkampf 1'!C26","v":"Börgermoor I"},null,"x","0",0,0,0,0,"0",0,0,0,0,0,0,0,{"$nulls":5},{"v":0,"d":"0.0"},1,0,""]
[18,{"$f":"'Wettkampf 1'!B27","v":"Schütze 18"},{"$f":"'Wettkampf 1'!C27","v":"Börgermoor I"},null,"x","0",0,0,0,0,"0",0,0,0,0,0,0,0,{"$nulls":5},{"v":0,"d":"0.0"},1,0,""]
[19,{"$f":"'Wettkampf 1'!B28","v":"Hanna Gebken"},{"$f":"'Wettkampf 1'!C28","v":"Lorup III"},312.1,null,312.1,0,0,0,0,0,0,312.1,1,0,0,0,0,{"$nulls":5},{"v":0,"d":"0.0"},0,0,""]
[20,{"$f":"'Wettkampf 1'!B29","v":"Monika Reimann"},{"$f":"'Wettkampf 1'!C29","v":"Lorup III"},305.2,null,305.2,0,0,0,0,0,0,305.2,1,0,0,0,0,{"$nulls":5},{"v":0,"d":"0.0"},0,0,""]
[21,{"$f":"'Wettkampf 1'!B30","v":"Marina Schrand"},{"$f":"'Wettkampf 1'!C30","v":"Lorup III"},{"v":303,"d":"303.0"},null,{"v":303,"d":"303.0"},0,0,0,0,0,0,303,1,0,0,0,0,{"$nulls":5},{"v":0,"d":"0.0"},0,0,""]
[22,{"$f":"'Wettkampf 1'!B31","v":"Nadine Krömer"},{"$f":"'Wettkampf 1'!C31","v":"Lorup III"},308.1,"x","0",0,0,0,0,0,0,"0",0,0,0,0,0,{"$nulls":5},{"v":0,"d":"0.0"},0,0,""]
[23,{"$f":"'Wettkampf 1'!B32","v":"Nina Krömer"},{"$f":"'Wettkampf 1'!C32","v":"Lorup III"},287.8,null,287.8,0,0,0,0,0,0,287.8,1,0,0,0,0,{"$nulls":5},{"v":0,"d":"0.0"},0,0,""]
[24,{"$f":"'Wettkampf 1'!B33","v":"Margret Büter"},{"$f":"'Wettkampf 1'!C33","v":"Lorup III"},null,"x","0",0,0,0,0,0,0,"0",0,0,0,0,0,{"$nulls":5},{"v":0,"d":"0.0"},1,0,""]
[25,{"$f":"'Wettkampf 1'!B34","v":"Sarah Meiners"},{"$f":"'Wettkampf 1'!C34","v":"Ostenwalde II"},286.8,null,286.8,0,0,0,0,0,0,0,0,286.8,1,0,0,{"$nulls":5},{"v":0,"d":"0.0"},0,0,""]
[26,{"$f":"'Wettkampf 1'!B35","v":"Anna Temmen"},{"$f":"'Wettkampf 1'!C35","v":"Ostenwalde II"},311.6,null,311.6,0,0,0,0,0,0,0,0,311.6,1,0,0,{"$nulls":5},{"v":0,"d":"0.0"},0,0,""]
[27,{"$f":"'Wettkampf 1'!B36","v":"Helga Meiners"},{"$f":"'Wettkampf 1'!C36","v":"Ostenwalde II"},299.4,null,299.4,0,0,0,0,0,0,0,0,299.4,1,0,0,{"$nulls":5},{"v":0,"d":"0.0"},0,0,""]
[28,{"$f":"'Wettkampf 1'!B37","v":"Carmen Benten"},{"$f":"'Wettkampf 1'!C37","v":"Ostenwalde II"},296.8,null,296.8,0,0,0,0,0,0,0,0,296.8,1,0,0,{"$nulls":5},{"v":0,"d":"0.0"},0,0,""]
[29,{"$f":"'Wettkampf 1'!B38","v":"Anna -Maria Wimberg"},{"$f":"'Wettkampf 1'!C38","v":"Ostenwalde II"},null,"x","0",0,0,0,0,0,0,0,0,"0",0,0,0,{"$nulls":5},{"v":0,"d":"0.0"},1,0,""]
[30,{"$f":"'Wettkampf 1'!B39","v":"Evelyn Feder"},{"$f":"'Wettkampf 1'!C39","v":"Ostenwalde II"},null,"x","0",0,0,0,0,0,0,0,0,"0",0,0,0,{"$nulls":5},{"v":0,"d":"0.0"},1,0,""]
[31,{"$f":"'Wettkampf 1'!B40","v":"Monika Jansen"},{"$f":"'Wettkampf 1'!C40","v":"Spahnharrenstätte I"},{"v":303,"d":"303.0"},null,{"v":303,"d":"303.0"},0,0,0,0,0,0,0,0,0,0,303,1,{"$nulls":5},{"v":0,"d":"0.0"},0,0,""]
[32,{"$f":"'Wettkampf 1'!B41","v":"Kerstin Sträche"},{"$f":"'Wettkampf 1'!C41","v":"Spahnharrenstätte I"},305.7,null,305.7,0,0,0,0,0,0,0,0,0,0,305.7,1,{"$nulls":5},{"v":0,"d":"0.0"},0,0,""]
[33,{"$f":"'Wettkampf 1'!B42","v":"Rita Hanekamp"},{"$f":"'Wettkampf 1'!C42","v":"Spahnharrenstätte I"},287.8,null,287.8,0,0,0,0,0,0,0,0,0,0,287.8,1,{"$nulls":5},{"v":0,"d":"0.0"},0,0,""]
[34,{"$f":"'Wettkampf 1'!B43","v":"Maria Beusing"},{"$f":"'Wettkampf 1'!C43","v":"Spahnharrenstätte I"},308.6,null,308.6,0,0,0,0,0,0,0,0,0,0,308.6,1,{"$nulls":5},{"v":0,"d":"0.0"},0,0,""]
[35,{"$f":"'Wettkampf 1'!B44","v":"Schütze 35"},{"$f":"'Wettkampf 1'!C44","v":"Spahnharrenstätte I"},null,"x","0",0,0,0,0,0,0,0,0,0,0,"0",0,{"$nulls":5},{"v":0,"d":"0.0"},1,0,""]
[36,{"$f":"'Wettkampf 1'!B45","v":"Schütze 36"},{"$f":"'Wettkampf 1'!C45","v":"Spahnharrenstätte I"},null,"x","0",0,0,0,0,0,0,0,0,0,0,"0",0,{"$nulls":5},{"v":0,"d":"0.0"},1,0,""]
[{"$nulls":6},{"$f":"LARGE(G10:G45,1)+LARGE(G10:G45,2)+LARGE(G10:G45,3)","v":921.1},{"$f":"SUM(H10:H45)","v":4},{"$f":"LARGE(I10:I45,1)+LARGE(I10:I45,2)+LARGE(I10:I45,3)","v":913.8},{"$f":"SUM(J10:J45)","v":4},{"$f":"LARGE(K10:K45,1)+LARGE(K10:K45,2)+LARGE(K10:K45,3)","v":921.9000000000001},{"$f":"SUM(L10:L45)","v":4},{"$f":"LARGE(M10:M45,1)+LARGE(M10:M45,2)+LARGE(M10:M45,3)","v":920.3},{"$f":"SUM(N10:N45)","v":4},{"$f":"LARGE(O10:O45,1)+LARGE(O10:O45,2)+LARGE(O10:O45,3)","v":907.8},{"$f":"SUM(P10:P45)","v":4},{"$f":"LARGE(Q10:Q45,1)+LARGE(Q10:Q45,2)+LARGE(Q10:Q45,3)","v":917.3},{"$f":"SUM(R10:S45)","v":4}]
[null,null,"per Email an: sk-huemmling@gmx.de"]

{"sheet":"6","index":6,"n_rows":47,"n_cols":27,"rows_kept":47,"merged":[[0,22,0,23],[1,22,1,23],[4,22,4,23],[5,22,5,23],[6,22,6,23],[8,20,8,23]]}
[null,"Verein / Gruppe",null,"Ergebnisse",{"$nulls":17},"Austragungsort:",{"$f":"Übersicht!I4","v":"Spahnharrenstätte"}]
[1,{"$f":"'Wettkampf 1'!B2","v":"Börger II"},null,{"$f":"G46","v":{"v":933.0999999999999,"d":"933.1"}},{"$f":"IF(H46>4,\"Es sind zu viele Schützen in Wertung!\",\" \")","v":" "},{"$nulls":16},"Wettkampftag:",{"$f":"Übersicht!I3","v":"17.11."}]
[2,{"$f":"'Wettkampf 1'!B3","v":"Neuvrees II"},null,{"$f":"I46","v":933.5},{"$f":"IF(J46>4,\"Es sind zu viele Schützen in Wertung!\",\" \")","v":" "}]
[3,{"$f":"'Wettkampf 1'!B4","v":"Börgermoor I"},null,{"$f":"K46","v":{"v":925.3000000000001,"d":"925.3"}},{"$f":"IF(L46>4,\"Es sind zu viele Schützen in Wertung!\",\" \")","v":" "},{"$nulls":18},"Ansprechpartner für Rückfragen:"]
[4,{"$f":"'Wettkampf 1'!B5","v":"Lorup III"},null,{"$f":"M46","v":924.4},{"$f":"IF(N46>4,\"Es sind zu viele Schützen in Wertung!\",\" \")","v":" "},{"$nulls":16},"Name:","Kerstin Sträche"]
[5,{"$f":"'Wettkampf 1'!B6","v":"Ostenwalde II"},null,{"$f":"O46","v":909.3},{"$f":"IF(P46>4,\"Es sind zu viele Schützen in Wertung!\",\" \")","v":" "},{"$nulls":16},"Tel:"]
[6,{"$f":"'Wettkampf 1'!B7","v":"Spahnharrenstätte I"},null,{"$f":"Q46","v":928.2},{"$f":"IF(R46>4,\"Es sind zu viele Schützen in Wertung!\",\" \")","v":" "},{"$nulls":16},"Standaufsicht:","Monika Jansen"]
[]
[null,"Einzelergebnisse:","Verein / Gruppe","Ergebnisse (mindestens 0 eintragen)","AW? Dann x eintippen",null,"Verein 1",null,"Verein 2",null,"Verein 3",null,"Verein 4",null,"Verein 5",null,"Verein 6",{"$nulls":3},"Proberechnung bei Streifen:"]
[1,{"$f":"'Wettkampf 1'!B10","v":"Gertrud Kuchta"},{"$f":"'Wettkampf 1'!C10","v":"Börger II"},310.4,null,{"$f":"IF(E10=\"x\",\"0\",D10)","v":310.4},{"$f":"IF(C10=$B$2,F10,0)","v":310.4},{"$f":"(IF(AND($E10=\"\",$C10=$B$2),1,0))","v":1},{"$f":"IF($C10=$B$3,F10,0)","v":0},{"$f":"(IF(AND($E10=\"\",$C10=$B$3),1,0))","v":0},{"$f":"IF($C10=$B$4,F10,0)","v":0},{"$f":"(IF(AND($E10=\"\",$C10=$B$4),1,0))","v":0},{"$f":"IF($C10=$B$5,F10,0)","v":0},{"$f":"(IF(AND($E10=\"\",$C10=$B$5),1,0))","v":0},{"$f":"IF($C10=$B$6,F10,0)","v":0},{"$f":"(IF(AND($E10=\"\",$C10=$B$6),1,0))","v":0},{"$f":"IF($C10=$B$7,F10,0)","v":0},{"$f":"(IF(AND($E10=\"\",$C10=$B$7),1,0))","v":0},null,null,104.3,103.7,102.4,{"$f":"U10+V10+W10","v":310.4},{"$f":"IF(X10=D10,1,0)","v":1},{"$f":"IF(X10=0,0,1)","v":1},{"$f":"IF(Y10+Z10=2,\"Korrekt\",\"\")","v":"Korrekt"}]
[2,{"$f":"'Wettkampf 1'!B11","v":"Sarah Breer"},{"$f":"'Wettkampf 1'!C11","v":"Börger II"},{"v":271.85,"d":"271.9"},"x",{"$f":"IF(E11=\"x\",\"0\",D11)","v":"0"},{"$f":"IF(C11=$B$2,F11,0)","v":"0"},{"$f":"(IF(AND($E11=\"\",$C11=$B$2),1,0))","v":0},{"$f":"IF($C11=$B$3,F11,0)","v":0},{"$f":"(IF(AND($E11=\"\",$C11=$B$3),1,0))","v":0},{"$f":"IF($C11=$B$4,F11,0)","v":0},{"$f":"(IF(AND($E11=\"\",$C11=$B$4),1,0))","v":0},{"$f":"IF($C11=$B$5,F11,0)","v":0},{"$f":"(IF(AND($E11=\"\",$C11=$B$5),1,0))","v":0},{"$f":"IF($C11=$B$6,F11,0)","v":0},{"$f":"(IF(AND($E11=\"\",$C11=$B$6),1,0))","v":0},{"$f":"IF($C11=$B$7,F11,0)","v":0},{"$f":"(IF(AND($E11=\"\",$C11=$B$7),1,0))","v":0},null,null,{"v":92,"d":"92.0"},90.3,89.5,{"$f":"U11+V11+W11","v":271.8},{"$f":"IF(X11=D11,1,0)","v":0},{"$f":"IF(X11=0,0,1)","v":1},{"$f":"IF(Y11+Z11=2,\"Korrekt\",\"\")","v":""}]
[3,{"$f":"'Wettkampf 1'!B12","v":"Margret Pohlgeers"},{"$f":"'Wettkampf 1'!C12","v":"Börger II"},312.9,null,312.9,312.9,1,0,0,0,0,0,0,0,0,0,0,null,null,105.5,103.7,103.7,312.9,1,1,"Korrekt"]
[4,{"$f":"'Wettkampf 1'!B13","v":"Gundula Schwarte"},{"$f":"'Wettkampf 1'!C13","v":"Börger II"},301.6,"x","0","0",0,0,0,0,0,0,0,0,0,0,0,null,null,96.9,102.3,102.4,301.6,1,1,"Korrekt"]
[5,{"$f":"'Wettkampf 1'!B14","v":"Annette Schwarte"},{"$f":"'Wettkampf 1'!C14","v":"Börger II"},305.3,null,305.3,305.3,1,0,0,0,0,0,0,0,0,0,0,null,null,101.6,102.2,101.5,305.3,1,1,"Korrekt"]
[6,{"$f":"'Wettkampf 1'!B15","v":"Petra Dödtmann"},{"$f":"'Wettkampf 1'!C15","v":"Börger II"},309.8,null,309.8,309.8,1,0,0,0,0,0,0,0,0,0,0,null,null,103.7,103.6,102.5,309.8,1,1,"Korrekt"]
[7,{"$f":"'Wettkampf 1'!B16","v":"Sarah Deyen"},{"$f":"'Wettkampf 1'!C16","v":"Neuvrees II"},310.1,null,310.1,0,0,310.1,1,0,0,0,0,0,0,0,0,null,null,103.2,103.5,103.4,310.1,1,1,"Korrekt"]
[8,{"$f":"'Wettkampf 1'!B17","v":"Silvia Thunert"},{"$f":"'Wettkampf 1'!C17","v":"Neuvrees II"},{"v":312,"d":"312.0"},null,{"v":312,"d":"312.0"},0,0,312,1,0,0,0,0,0,0,0,0,null,null,104.2,103.6,104.2,{"v":312,"d":"312.0"},1,1,"Korrekt"]
[9,{"$f":"'Wettkampf 1'!B18","v":"Margret Pohlmann"},{"$f":"'Wettkampf 1'!C18","v":"Neuvrees II"},301.1,null,301.1,0,0,301.1,1,0,0,0,0,0,0,0,0,null,null,102.5,97.6,{"v":101,"d":"101.0"},301.1,1,1,"Korrekt"]
[10,{"$f":"'Wettkampf 1'!B19","v":"Harma Steenken"},{"$f":"'Wettkampf 1'!C19","v":"Neuvrees II"},null,"x","0",0,0,"0",0,0,0,0,0,0,0,0,0,{"$nulls":5},{"v":0,"d":"0.0"},1,0,""]
[11,{"$f":"'Wettkampf 1'!B20","v":"Claudia Rolfes"},{"$f":"'Wettkampf 1'!C20","v":"Neuvrees II"},311.4,null,311.4,0,0,311.4,1,0,0,0,0,0,0,0,0,null,null,103.8,103.6,{"v":104,"d":"104.0"},311.4,1,1,"Korrekt"]
[12,{"$f":"'Wettkampf 1'!B21","v":"Silvia Junge"},{"$f":"'Wettkampf 1'!C21","v":"Neuvrees II"},299.5,"x","0",0,0,"0",0,0,0,0,0,0,0,0,0,null,null,96.9,100.1,102.5,299.5,1,1,"Korrekt"]
[13,{"$f":"'Wettkampf 1'!B22","v":"Ulla Schnieders"},{"$f":"'Wettkampf 1'!C22","v":"Börgermoor I"},307.1,null,307.1,0,0,0,0,307.1,1,0,0,0,0,0,0,null,null,100.4,104.3,102.4,307.1,1,1,"Korrekt"]
[14,{"$f":"'Wettkampf 1'!B23","v":"Jasmin Kramer"},{"$f":"'Wettkampf 1'!C23","v":"Börgermoor I"},309.3,null,309.3,0,0,0,0,309.3,1,0,0,0,0,0,0,null,null,105.4,103.7,100.2,309.3,1,1,"Korrekt"]
[15,{"$f":"'Wettkampf 1'!B24","v":"Anni Küwen"},{"$f":"'Wettkampf 1'!C24","v":"Börgermoor I"},308.9,null,308.9,0,0,0,0,308.9,1,0,0,0,0,0,0,null,null,102.5,103.8,102.6,308.9,1,1,"Korrekt"]
[16,{"$f":"'Wettkampf 1'!B25","v":"Waltraud Dobelmann"},{"$f":"'Wettkampf 1'!C25","v":"Börgermoor I"},302.8,null,302.8,0,0,0,0,302.8,1,0,0,0,0,0,0,null,null,101.1,102.8,98.9,{"v":302.79999999999995,"d":"302.8"},1,1,"Korrekt"]
[17,{"$f":"'Wettkampf 1'!B26","v":"Schütze 17"},{"$f":"'Wettkampf 1'!C26","v":"Börgermoor I"},null,"x","0",0,0,0,0,"0",0,0,0,0,0,0,0,{"$nulls":5},{"v":0,"d":"0.0"},1,0,""]
[18,{"$f":"'Wettkampf 1'!B27","v":"Schütze 18"},{"$f":"'Wettkampf 1'!C27","v":"Börgermoor I"},null,"x","0",0,0,0,0,"0",0,0,0,0,0,0,0,{"$nulls":5},{"v":0,"d":"0.0"},1,0,""]
[19,{"$f":"'Wettkampf 1'!B28","v":"Hanna Gebken"},{"$f":"'Wettkampf 1'!C28","v":"Lorup III"},306.7,null,306.7,0,0,0,0,0,0,306.7,1,0,0,0,0,null,null,101.5,101.9,103.3,306.7,1,1,"Korrekt"]
[20,{"$f":"'Wettkampf 1'!B29","v":"Monika Reimann"},{"$f":"'Wettkampf 1'!C29","v":"Lorup III"},304.6,null,304.6,0,0,0,0,0,0,304.6,1,0,0,0,0,null,null,101.7,101.2,101.7,304.6,1,1,"Korrekt"]
[21,{"$f":"'Wettkampf 1'!B30","v":"Marina Schrand"},{"$f":"'Wettkampf 1'!C30","v":"Lorup III"},305.5,null,305.5,0,0,0,0,0,0,305.5,1,0,0,0,0,null,null,102.5,102.2,100.8,305.5,1,1,"Korrekt"]
[22,{"$f":"'Wettkampf 1'!B31","v":"Nadine Krömer"},{"$f":"'Wettkampf 1'!C31","v":"Lorup III"},312.2,null,312.2,0,0,0,0,0,0,312.2,1,0,0,0,0,null,null,104.3,103.8,104.1,312.2,1,1,"Korrekt"]
[23,{"$f":"'Wettkampf 1'!B32","v":"Nina Krömer"},{"$f":"'Wettkampf 1'!C32","v":"Lorup III"},305.4,"x","0",0,0,0,0,0,0,"0",0,0,0,0,0,null,null,{"v":102,"d":"102.0"},101.5,101.9,305.4,1,1,"Korrekt"]
[24,{"$f":"'Wettkampf 1'!B33","v":"Margret Büter"},{"$f":"'Wettkampf 1'!C33","v":"Lorup III"},null,"x","0",0,0,0,0,0,0,"0",0,0,0,0,0,{"$nulls":5},{"v":0,"d":"0.0"},1,0,""]
[25,{"$f":"'Wettkampf 1'!B34","v":"Sarah Meiners"},{"$f":"'Wettkampf 1'!C34","v":"Ostenwalde II"},278.1,null,278.1,0,0,0,0,0,0,0,0,278.1,1,0,0,null,null,83.8,97.9,96.4,278.1,1,1,"Korrekt"]
[26,{"$f":"'Wettkampf 1'!B35","v":"Anna Temmen"},{"$f":"'Wettkampf 1'!C35","v":"Ostenwalde II"},311.6,null,311.6,0,0,0,0,0,0,0,0,311.6,1,0,0,null,null,102.3,{"v":104,"d":"104.0"},105.3,311.6,1,1,"Korrekt"]
[27,{"$f":"'Wettkampf 1'!B36","v":"Helga Meiners"},{"$f":"'Wettkampf 1'!C36","v":"Ostenwalde II"},299.9,null,299.9,0,0,0,0,0,0,0,0,299.9,1,0,0,null,null,{"v":101,"d":"101.0"},96.4,102.5,299.9,1,1,"Korrekt"]
[28,{"$f":"'Wettkampf 1'!B37","v":"Carmen Benten"},{"$f":"'Wettkampf 1'!C37","v":"Ostenwalde II"},297.8,null,297.8,0,0,0,0,0,0,0,0,297.8,1,0,0,null,null,{"v":94,"d":"94.0"},101.5,102.3,297.8,1,1,"Korrekt"]
[29,{"$f":"'Wettkampf 1'!B38","v":"Anna -Maria Wimberg"},{"$f":"'Wettkampf 1'!C38","v":"Ostenwalde II"},null,"x","0",0,0,0,0,0,0,0,0,"0",0,0,0,{"$nulls":5},{"v":0,"d":"0.0"},1,0,""]
[30,{"$f":"'Wettkampf 1'!B39","v":"Evelyn Feder"},{"$f":"'Wettkampf 1'!C39","v":"Ostenwalde II"},null,"x","0",0,0,0,0,0,0,0,0,"0",0,0,0,{"$nulls":5},{"v":0,"d":"0.0"},1,0,""]
[31,{"$f":"'Wettkampf 1'!B40","v":"Monika Jansen"},{"$f":"'Wettkampf 1'!C40","v":"Spahnharrenstätte I"},311.3,null,311.3,0,0,0,0,0,0,0,0,0,0,311.3,1,null,null,104.7,103.2,103.4,311.3,1,1,"Korrekt"]
[32,{"$f":"'Wettkampf 1'!B41","v":"Kerstin Sträche"},{"$f":"'Wettkampf 1'!C41","v":"Spahnharrenstätte I"},307.3,null,307.3,0,0,0,0,0,0,0,0,0,0,307.3,1,null,null,102.2,103.1,{"v":102,"d":"102.0"},307.3,1,1,"Korrekt"]
[33,{"$f":"'Wettkampf 1'!B42","v":"Rita Hanekamp"},{"$f":"'Wettkampf 1'!C42","v":"Spahnharrenstätte I"},{"v":287,"d":"287.0"},null,{"v":287,"d":"287.0"},0,0,0,0,0,0,0,0,0,0,287,1,null,null,95.5,95.7,95.8,{"v":287,"d":"287.0"},1,1,"Korrekt"]
[34,{"$f":"'Wettkampf 1'!B43","v":"Maria Beusing"},{"$f":"'Wettkampf 1'!C43","v":"Spahnharrenstätte I"},309.6,null,309.6,0,0,0,0,0,0,0,0,0,0,309.6,1,null,null,102.1,103.9,103.6,309.6,1,1,"Korrekt"]
[35,{"$f":"'Wettkampf 1'!B44","v":"Schütze 35"},{"$f":"'Wettkampf 1'!C44","v":"Spahnharrenstätte I"},null,"x","0",0,0,0,0,0,0,0,0,0,0,"0",0,{"$nulls":5},{"v":0,"d":"0.0"},1,0,""]
[36,{"$f":"'Wettkampf 1'!B45","v":"Schütze 36"},{"$f":"'Wettkampf 1'!C45","v":"Spahnharrenstätte I"},null,"x","0",0,0,0,0,0,0,0,0,0,0,"0",0,{"$nulls":5},{"v":0,"d":"0.0"},1,0,""]
[{"$nulls":6},{"$f":"LARGE(G10:G45,1)+LARGE(G10:G45,2)+LARGE(G10:G45,3)","v":933.0999999999999},{"$f":"SUM(H10:H45)","v":4},{"$f":"LARGE(I10:I45,1)+LARGE(I10:I45,2)+LARGE(I10:I45,3)","v":933.5},{"$f":"SUM(J10:J45)","v":4},{"$f":"LARGE(K10:K45,1)+LARGE(K10:K45,2)+LARGE(K10:K45,3)","v":925.3000000000001},{"$f":"SUM(L10:L45)","v":4},{"$f":"LARGE(M10:M45,1)+LARGE(M10:M45,2)+LARGE(M10:M45,3)","v":924.4},{"$f":"SUM(N10:N45)","v":4},{"$f":"LARGE(O10:O45,1)+LARGE(O10:O45,2)+LARGE(O10:O45,3)","v":909.3},{"$f":"SUM(P10:P45)","v":4},{"$f":"LARGE(Q10:Q45,1)+LARGE(Q10:Q45,2)+LARGE(Q10:Q45,3)","v":928.2},{"$f":"SUM(R10:S45)","v":4}]
[null,null,"per Email an: sk-huemmling@gmx.de"]

{"sheet":"7","index":7,"n_rows":47,"n_cols":27,"rows_kept":47,"merged":[[0,22,0,23],[1,22,1,23],[4,22,4,23],[5,22,5,23],[6,22,6,23],[8,20,8,23]]}
[null,"Verein / Gruppe",null,"Ergebnisse",{"$nulls":17},"Austragungsort:",{"$f":"Übersicht!L4","v":"Börger"}]
[1,{"$f":"'Wettkampf 1'!B2","v":"Börger II"},null,{"$f":"G46","v":{"v":923,"d":"923.0"}},{"$f":"IF(H46>4,\"Es sind zu viele Schützen in Wertung!\",\" \")","v":" "},{"$nulls":16},"Wettkampftag:",{"$f":"Übersicht!L3","v":"12.01."}]
[2,{"$f":"'Wettkampf 1'!B3","v":"Neuvrees II"},null,{"$f":"I46","v":{"v":922.5999999999999,"d":"922.6"}},{"$f":"IF(J46>4,\"Es sind zu viele Schützen in Wertung!\",\" \")","v":" "}]
[3,{"$f":"'Wettkampf 1'!B4","v":"Börgermoor I"},null,{"$f":"K46","v":923.9},{"$f":"IF(L46>4,\"Es sind zu viele Schützen in Wertung!\",\" \")","v":" "},{"$nulls":18},"Ansprechpartner für Rückfragen:"]
[4,{"$f":"'Wettkampf 1'!B5","v":"Lorup III"},null,{"$f":"M46","v":924.1},{"$f":"IF(N46>4,\"Es sind zu viele Schützen in Wertung!\",\" \")","v":" "},{"$nulls":16},"Name:","Marina Schrand"]
[5,{"$f":"'Wettkampf 1'!B6","v":"Ostenwalde II"},null,{"$f":"O46","v":912.4},{"$f":"IF(P46>4,\"Es sind zu viele Schützen in Wertung!\",\" \")","v":" "},{"$nulls":16},"Tel:"]
[6,{"$f":"'Wettkampf 1'!B7","v":"Spahnharrenstätte I"},null,{"$f":"Q46","v":927.2},{"$f":"IF(R46>4,\"Es sind zu viele Schützen in Wertung!\",\" \")","v":" "},{"$nulls":16},"Standaufsicht:","Thomas"]
[]
[null,"Einzelergebnisse:","Verein / Gruppe","Ergebnisse (mindestens 0 eintragen)","AW? Dann x eintippen",null,"Verein 1",null,"Verein 2",null,"Verein 3",null,"Verein 4",null,"Verein 5",null,"Verein 6",{"$nulls":3},"Proberechnung bei Streifen:"]
[1,{"$f":"'Wettkampf 1'!B10","v":"Gertrud Kuchta"},{"$f":"'Wettkampf 1'!C10","v":"Börger II"},303.7,null,{"$f":"IF(E10=\"x\",\"0\",D10)","v":303.7},{"$f":"IF(C10=$B$2,F10,0)","v":303.7},{"$f":"(IF(AND($E10=\"\",$C10=$B$2),1,0))","v":1},{"$f":"IF($C10=$B$3,F10,0)","v":0},{"$f":"(IF(AND($E10=\"\",$C10=$B$3),1,0))","v":0},{"$f":"IF($C10=$B$4,F10,0)","v":0},{"$f":"(IF(AND($E10=\"\",$C10=$B$4),1,0))","v":0},{"$f":"IF($C10=$B$5,F10,0)","v":0},{"$f":"(IF(AND($E10=\"\",$C10=$B$5),1,0))","v":0},{"$f":"IF($C10=$B$6,F10,0)","v":0},{"$f":"(IF(AND($E10=\"\",$C10=$B$6),1,0))","v":0},{"$f":"IF($C10=$B$7,F10,0)","v":0},{"$f":"(IF(AND($E10=\"\",$C10=$B$7),1,0))","v":0},{"$nulls":5},{"$f":"U10+V10+W10","v":{"v":0,"d":"0.0"}},{"$f":"IF(X10=D10,1,0)","v":0},{"$f":"IF(X10=0,0,1)","v":0},{"$f":"IF(Y10+Z10=2,\"Korrekt\",\"\")","v":""}]
[2,{"$f":"'Wettkampf 1'!B11","v":"Sarah Breer"},{"$f":"'Wettkampf 1'!C11","v":"Börger II"},266.2,"x",{"$f":"IF(E11=\"x\",\"0\",D11)","v":"0"},{"$f":"IF(C11=$B$2,F11,0)","v":"0"},{"$f":"(IF(AND($E11=\"\",$C11=$B$2),1,0))","v":0},{"$f":"IF($C11=$B$3,F11,0)","v":0},{"$f":"(IF(AND($E11=\"\",$C11=$B$3),1,0))","v":0},{"$f":"IF($C11=$B$4,F11,0)","v":0},{"$f":"(IF(AND($E11=\"\",$C11=$B$4),1,0))","v":0},{"$f":"IF($C11=$B$5,F11,0)","v":0},{"$f":"(IF(AND($E11=\"\",$C11=$B$5),1,0))","v":0},{"$f":"IF($C11=$B$6,F11,0)","v":0},{"$f":"(IF(AND($E11=\"\",$C11=$B$6),1,0))","v":0},{"$f":"IF($C11=$B$7,F11,0)","v":0},{"$f":"(IF(AND($E11=\"\",$C11=$B$7),1,0))","v":0},{"$nulls":5},{"$f":"U11+V11+W11","v":{"v":0,"d":"0.0"}},{"$f":"IF(X11=D11,1,0)","v":0},{"$f":"IF(X11=0,0,1)","v":0},{"$f":"IF(Y11+Z11=2,\"Korrekt\",\"\")","v":""}]
[3,{"$f":"'Wettkampf 1'!B12","v":"Margret Pohlgeers"},{"$f":"'Wettkampf 1'!C12","v":"Börger II"},308.8,null,308.8,308.8,1,0,0,0,0,0,0,0,0,0,0,{"$nulls":5},{"v":0,"d":"0.0"},0,0,""]
[4,{"$f":"'Wettkampf 1'!B13","v":"Gundula Schwarte"},{"$f":"'Wettkampf 1'!C13","v":"Börger II"},300.6,"x","0","0",0,0,0,0,0,0,0,0,0,0,0,{"$nulls":5},{"v":0,"d":"0.0"},0,0,""]
[5,{"$f":"'Wettkampf 1'!B14","v":"Annette Schwarte"},{"$f":"'Wettkampf 1'!C14","v":"Börger II"},296.1,null,296.1,296.1,1,0,0,0,0,0,0,0,0,0,0,{"$nulls":5},{"v":0,"d":"0.0"},0,0,""]
[6,{"$f":"'Wettkampf 1'!B15","v":"Petra Dödtmann"},{"$f":"'Wettkampf 1'!C15","v":"Börger II"},310.5,null,310.5,310.5,1,0,0,0,0,0,0,0,0,0,0,{"$nulls":5},{"v":0,"d":"0.0"},0,0,""]
[7,{"$f":"'Wettkampf 1'!B16","v":"Sarah Deyen"},{"$f":"'Wettkampf 1'!C16","v":"Neuvrees II"},302.3,null,302.3,0,0,302.3,1,0,0,0,0,0,0,0,0,{"$nulls":5},{"v":0,"d":"0.0"},0,0,""]
[8,{"$f":"'Wettkampf 1'!B17","v":"Silvia Thunert"},{"$f":"'Wettkampf 1'!C17","v":"Neuvrees II"},307.2,null,307.2,0,0,307.2,1,0,0,0,0,0,0,0,0,{"$nulls":5},{"v":0,"d":"0.0"},0,0,""]
[9,{"$f":"'Wettkampf 1'!B18","v":"Margret Pohlmann"},{"$f":"'Wettkampf 1'!C18","v":"Neuvrees II"},301.2,null,301.2,0,0,301.2,1,0,0,0,0,0,0,0,0,{"$nulls":5},{"v":0,"d":"0.0"},0,0,""]
[10,{"$f":"'Wettkampf 1'!B19","v":"Harma Steenken"},{"$f":"'Wettkampf 1'!C19","v":"Neuvrees II"},261.1,"x","0",0,0,"0",0,0,0,0,0,0,0,0,0,{"$nulls":5},{"v":0,"d":"0.0"},0,0,""]
[11,{"$f":"'Wettkampf 1'!B20","v":"Claudia Rolfes"},{"$f":"'Wettkampf 1'!C20","v":"Neuvrees II"},313.1,null,313.1,0,0,313.1,1,0,0,0,0,0,0,0,0,{"$nulls":5},{"v":0,"d":"0.0"},0,0,""]
[12,{"$f":"'Wettkampf 1'!B21","v":"Silvia Junge"},{"$f":"'Wettkampf 1'!C21","v":"Neuvrees II"},300.3,"x","0",0,0,"0",0,0,0,0,0,0,0,0,0,{"$nulls":5},{"v":0,"d":"0.0"},0,0,""]
[13,{"$f":"'Wettkampf 1'!B22","v":"Ulla Schnieders"},{"$f":"'Wettkampf 1'!C22","v":"Börgermoor I"},300.9,null,300.9,0,0,0,0,300.9,1,0,0,0,0,0,0,{"$nulls":5},{"v":0,"d":"0.0"},0,0,""]
[14,{"$f":"'Wettkampf 1'!B23","v":"Jasmin Kramer"},{"$f":"'Wettkampf 1'!C23","v":"Börgermoor I"},311.7,null,311.7,0,0,0,0,311.7,1,0,0,0,0,0,0,{"$nulls":5},{"v":0,"d":"0.0"},0,0,""]
[15,{"$f":"'Wettkampf 1'!B24","v":"Anni Küwen"},{"$f":"'Wettkampf 1'!C24","v":"Börgermoor I"},308.6,null,308.6,0,0,0,0,308.6,1,0,0,0,0,0,0,{"$nulls":5},{"v":0,"d":"0.0"},0,0,""]
[16,{"$f":"'Wettkampf 1'!B25","v":"Waltraud Dobelmann"},{"$f":"'Wettkampf 1'!C25","v":"Börgermoor I"},303.6,null,303.6,0,0,0,0,303.6,1,0,0,0,0,0,0,{"$nulls":5},{"v":0,"d":"0.0"},0,0,""]
[17,{"$f":"'Wettkampf 1'!B26","v":"Schütze 17"},{"$f":"'Wettkampf 1'!C26","v":"Börgermoor I"},null,"x","0",0,0,0,0,"0",0,0,0,0,0,0,0,{"$nulls":5},{"v":0,"d":"0.0"},1,0,""]
[18,{"$f":"'Wettkampf 1'!B27","v":"Schütze 18"},{"$f":"'Wettkampf 1'!C27","v":"Börgermoor I"},null,"x","0",0,0,0,0,"0",0,0,0,0,0,0,0,{"$nulls":5},{"v":0,"d":"0.0"},1,0,""]
[19,{"$f":"'Wettkampf 1'!B28","v":"Hanna Gebken"},{"$f":"'Wettkampf 1'!C28","v":"Lorup III"},309.6,null,309.6,0,0,0,0,0,0,309.6,1,0,0,0,0,{"$nulls":5},{"v":0,"d":"0.0"},0,0,""]
[20,{"$f":"'Wettkampf 1'!B29","v":"Monika Reimann"},{"$f":"'Wettkampf 1'!C29","v":"Lorup III"},308.3,"x","0",0,0,0,0,0,0,"0",0,0,0,0,0,{"$nulls":5},{"v":0,"d":"0.0"},0,0,""]
[21,{"$f":"'Wettkampf 1'!B30","v":"Marina Schrand"},{"$f":"'Wettkampf 1'!C30","v":"Lorup III"},304.1,null,304.1,0,0,0,0,0,0,304.1,1,0,0,0,0,{"$nulls":5},{"v":0,"d":"0.0"},0,0,""]
[22,{"$f":"'Wettkampf 1'!B31","v":"Nadine Krömer"},{"$f":"'Wettkampf 1'!C31","v":"Lorup III"},310.4,null,310.4,0,0,0,0,0,0,310.4,1,0,0,0,0,{"$nulls":5},{"v":0,"d":"0.0"},0,0,""]
[23,{"$f":"'Wettkampf 1'!B32","v":"Nina Krömer"},{"$f":"'Wettkampf 1'!C32","v":"Lorup III"},299.7,null,299.7,0,0,0,0,0,0,299.7,1,0,0,0,0,{"$nulls":5},{"v":0,"d":"0.0"},0,0,""]
[24,{"$f":"'Wettkampf 1'!B33","v":"Margret Büter"},{"$f":"'Wettkampf 1'!C33","v":"Lorup III"},null,"x","0",0,0,0,0,0,0,"0",0,0,0,0,0,{"$nulls":5},{"v":0,"d":"0.0"},1,0,""]
[25,{"$f":"'Wettkampf 1'!B34","v":"Sarah Meiners"},{"$f":"'Wettkampf 1'!C34","v":"Ostenwalde II"},286.3,null,286.3,0,0,0,0,0,0,0,0,286.3,1,0,0,{"$nulls":5},{"v":0,"d":"0.0"},0,0,""]
[26,{"$f":"'Wettkampf 1'!B35","v":"Anna Temmen"},{"$f":"'Wettkampf 1'!C35","v":"Ostenwalde II"},309.5,null,309.5,0,0,0,0,0,0,0,0,309.5,1,0,0,{"$nulls":5},{"v":0,"d":"0.0"},0,0,""]
[27,{"$f":"'Wettkampf 1'!B36","v":"Helga Meiners"},{"$f":"'Wettkampf 1'!C36","v":"Ostenwalde II"},296.1,null,296.1,0,0,0,0,0,0,0,0,296.1,1,0,0,{"$nulls":5},{"v":0,"d":"0.0"},0,0,""]
[28,{"$f":"'Wettkampf 1'!B37","v":"Carmen Benten"},{"$f":"'Wettkampf 1'!C37","v":"Ostenwalde II"},306.8,null,306.8,0,0,0,0,0,0,0,0,306.8,1,0,0,{"$nulls":5},{"v":0,"d":"0.0"},0,0,""]
[29,{"$f":"'Wettkampf 1'!B38","v":"Anna -Maria Wimberg"},{"$f":"'Wettkampf 1'!C38","v":"Ostenwalde II"},null,"x","0",0,0,0,0,0,0,0,0,"0",0,0,0,{"$nulls":5},{"v":0,"d":"0.0"},1,0,""]
[30,{"$f":"'Wettkampf 1'!B39","v":"Evelyn Feder"},{"$f":"'Wettkampf 1'!C39","v":"Ostenwalde II"},null,"x","0",0,0,0,0,0,0,0,0,"0",0,0,0,{"$nulls":5},{"v":0,"d":"0.0"},1,0,""]
[31,{"$f":"'Wettkampf 1'!B40","v":"Monika Jansen"},{"$f":"'Wettkampf 1'!C40","v":"Spahnharrenstätte I"},304.5,null,304.5,0,0,0,0,0,0,0,0,0,0,304.5,1,{"$nulls":5},{"v":0,"d":"0.0"},0,0,""]
[32,{"$f":"'Wettkampf 1'!B41","v":"Kerstin Sträche"},{"$f":"'Wettkampf 1'!C41","v":"Spahnharrenstätte I"},307.8,null,307.8,0,0,0,0,0,0,0,0,0,0,307.8,1,{"$nulls":5},{"v":0,"d":"0.0"},0,0,""]
[33,{"$f":"'Wettkampf 1'!B42","v":"Rita Hanekamp"},{"$f":"'Wettkampf 1'!C42","v":"Spahnharrenstätte I"},null,null,{"v":0,"d":"0.0"},0,0,0,0,0,0,0,0,0,0,0,1,{"$nulls":5},{"v":0,"d":"0.0"},1,0,""]
[34,{"$f":"'Wettkampf 1'!B43","v":"Maria Beusing"},{"$f":"'Wettkampf 1'!C43","v":"Spahnharrenstätte I"},314.9,null,314.9,0,0,0,0,0,0,0,0,0,0,314.9,1,{"$nulls":5},{"v":0,"d":"0.0"},0,0,""]
[35,{"$f":"'Wettkampf 1'!B44","v":"Schütze 35"},{"$f":"'Wettkampf 1'!C44","v":"Spahnharrenstätte I"},null,"x","0",0,0,0,0,0,0,0,0,0,0,"0",0,{"$nulls":5},{"v":0,"d":"0.0"},1,0,""]
[36,{"$f":"'Wettkampf 1'!B45","v":"Schütze 36"},{"$f":"'Wettkampf 1'!C45","v":"Spahnharrenstätte I"},null,"x","0",0,0,0,0,0,0,0,0,0,0,"0",0,{"$nulls":5},{"v":0,"d":"0.0"},1,0,""]
[{"$nulls":6},{"$f":"LARGE(G10:G45,1)+LARGE(G10:G45,2)+LARGE(G10:G45,3)","v":923},{"$f":"SUM(H10:H45)","v":4},{"$f":"LARGE(I10:I45,1)+LARGE(I10:I45,2)+LARGE(I10:I45,3)","v":922.5999999999999},{"$f":"SUM(J10:J45)","v":4},{"$f":"LARGE(K10:K45,1)+LARGE(K10:K45,2)+LARGE(K10:K45,3)","v":923.9},{"$f":"SUM(L10:L45)","v":4},{"$f":"LARGE(M10:M45,1)+LARGE(M10:M45,2)+LARGE(M10:M45,3)","v":924.1},{"$f":"SUM(N10:N45)","v":4},{"$f":"LARGE(O10:O45,1)+LARGE(O10:O45,2)+LARGE(O10:O45,3)","v":912.4},{"$f":"SUM(P10:P45)","v":4},{"$f":"LARGE(Q10:Q45,1)+LARGE(Q10:Q45,2)+LARGE(Q10:Q45,3)","v":927.2},{"$f":"SUM(R10:S45)","v":4}]
[null,null,"per Email an: sk-huemmling@gmx.de"]

{"sheet":"8","index":8,"n_rows":47,"n_cols":27,"rows_kept":47,"merged":[[0,22,0,23],[1,22,1,23],[4,22,4,23],[5,22,5,23],[6,22,6,23],[8,20,8,23]]}
[null,"Verein / Gruppe",null,"Ergebnisse",{"$nulls":17},"Austragungsort:",{"$f":"Übersicht!M4","v":"Börgermoor"}]
[1,{"$f":"'Wettkampf 1'!B2","v":"Börger II"},null,{"$f":"G46","v":{"v":927.5999999999999,"d":"927.6"}},{"$f":"IF(H46>4,\"Es sind zu viele Schützen in Wertung!\",\" \")","v":" "},{"$nulls":16},"Wettkampftag:",{"$f":"Übersicht!M3","v":"26.01."}]
[2,{"$f":"'Wettkampf 1'!B3","v":"Neuvrees II"},null,{"$f":"I46","v":{"v":927.0999999999999,"d":"927.1"}},{"$f":"IF(J46>4,\"Es sind zu viele Schützen in Wertung!\",\" \")","v":" "}]
[3,{"$f":"'Wettkampf 1'!B4","v":"Börgermoor I"},null,{"$f":"K46","v":{"v":934.1000000000001,"d":"934.1"}},{"$f":"IF(L46>4,\"Es sind zu viele Schützen in Wertung!\",\" \")","v":" "},{"$nulls":18},"Ansprechpartner für Rückfragen:"]
[4,{"$f":"'Wettkampf 1'!B5","v":"Lorup III"},null,{"$f":"M46","v":{"v":926,"d":"926.0"}},{"$f":"IF(N46>4,\"Es sind zu viele Schützen in Wertung!\",\" \")","v":" "},{"$nulls":16},"Name:","Schnieder Ulla"]
[5,{"$f":"'Wettkampf 1'!B6","v":"Ostenwalde II"},null,{"$f":"O46","v":908.8},{"$f":"IF(P46>4,\"Es sind zu viele Schützen in Wertung!\",\" \")","v":" "},{"$nulls":16},"Tel:","01724339021"]
[6,{"$f":"'Wettkampf 1'!B7","v":"Spahnharrenstätte I"},null,{"$f":"Q46","v":919.2},{"$f":"IF(R46>4,\"Es sind zu viele Schützen in Wertung!\",\" \")","v":" "},{"$nulls":16},"Standaufsicht:","Schnieders Ulla"]
[]
[null,"Einzelergebnisse:","Verein / Gruppe","Ergebnisse (mindestens 0 eintragen)","AW? Dann x eintippen",null,"Verein 1",null,"Verein 2",null,"Verein 3",null,"Verein 4",null,"Verein 5",null,"Verein 6",{"$nulls":3},"Proberechnung bei Streifen:"]
[1,{"$f":"'Wettkampf 1'!B10","v":"Gertrud Kuchta"},{"$f":"'Wettkampf 1'!C10","v":"Börger II"},305.8,null,{"$f":"IF(E10=\"x\",\"0\",D10)","v":305.8},{"$f":"IF(C10=$B$2,F10,0)","v":305.8},{"$f":"(IF(AND($E10=\"\",$C10=$B$2),1,0))","v":1},{"$f":"IF($C10=$B$3,F10,0)","v":0},{"$f":"(IF(AND($E10=\"\",$C10=$B$3),1,0))","v":0},{"$f":"IF($C10=$B$4,F10,0)","v":0},{"$f":"(IF(AND($E10=\"\",$C10=$B$4),1,0))","v":0},{"$f":"IF($C10=$B$5,F10,0)","v":0},{"$f":"(IF(AND($E10=\"\",$C10=$B$5),1,0))","v":0},{"$f":"IF($C10=$B$6,F10,0)","v":0},{"$f":"(IF(AND($E10=\"\",$C10=$B$6),1,0))","v":0},{"$f":"IF($C10=$B$7,F10,0)","v":0},{"$f":"(IF(AND($E10=\"\",$C10=$B$7),1,0))","v":0},{"$nulls":5},{"$f":"U10+V10+W10","v":{"v":0,"d":"0.0"}},{"$f":"IF(X10=D10,1,0)","v":0},{"$f":"IF(X10=0,0,1)","v":0},{"$f":"IF(Y10+Z10=2,\"Korrekt\",\"\")","v":""}]
[2,{"$f":"'Wettkampf 1'!B11","v":"Sarah Breer"},{"$f":"'Wettkampf 1'!C11","v":"Börger II"},{"v":0,"d":"0.0"},"x",{"$f":"IF(E11=\"x\",\"0\",D11)","v":"0"},{"$f":"IF(C11=$B$2,F11,0)","v":"0"},{"$f":"(IF(AND($E11=\"\",$C11=$B$2),1,0))","v":0},{"$f":"IF($C11=$B$3,F11,0)","v":0},{"$f":"(IF(AND($E11=\"\",$C11=$B$3),1,0))","v":0},{"$f":"IF($C11=$B$4,F11,0)","v":0},{"$f":"(IF(AND($E11=\"\",$C11=$B$4),1,0))","v":0},{"$f":"IF($C11=$B$5,F11,0)","v":0},{"$f":"(IF(AND($E11=\"\",$C11=$B$5),1,0))","v":0},{"$f":"IF($C11=$B$6,F11,0)","v":0},{"$f":"(IF(AND($E11=\"\",$C11=$B$6),1,0))","v":0},{"$f":"IF($C11=$B$7,F11,0)","v":0},{"$f":"(IF(AND($E11=\"\",$C11=$B$7),1,0))","v":0},{"$nulls":5},{"$f":"U11+V11+W11","v":{"v":0,"d":"0.0"}},{"$f":"IF(X11=D11,1,0)","v":1},{"$f":"IF(X11=0,0,1)","v":0},{"$f":"IF(Y11+Z11=2,\"Korrekt\",\"\")","v":""}]
[3,{"$f":"'Wettkampf 1'!B12","v":"Margret Pohlgeers"},{"$f":"'Wettkampf 1'!C12","v":"Börger II"},312.9,null,312.9,312.9,1,0,0,0,0,0,0,0,0,0,0,{"$nulls":5},{"v":0,"d":"0.0"},0,0,""]
[4,{"$f":"'Wettkampf 1'!B13","v":"Gundula Schwarte"},{"$f":"'Wettkampf 1'!C13","v":"Börger II"},300.3,"x","0","0",0,0,0,0,0,0,0,0,0,0,0,{"$nulls":5},{"v":0,"d":"0.0"},0,0,""]
[5,{"$f":"'Wettkampf 1'!B14","v":"Annette Schwarte"},{"$f":"'Wettkampf 1'!C14","v":"Börger II"},303.1,null,303.1,303.1,1,0,0,0,0,0,0,0,0,0,0,{"$nulls":5},{"v":0,"d":"0.0"},0,0,""]
[6,{"$f":"'Wettkampf 1'!B15","v":"Petra Dödtmann"},{"$f":"'Wettkampf 1'!C15","v":"Börger II"},308.9,null,308.9,308.9,1,0,0,0,0,0,0,0,0,0,0,{"$nulls":5},{"v":0,"d":"0.0"},0,0,""]
[7,{"$f":"'Wettkampf 1'!B16","v":"Sarah Deyen"},{"$f":"'Wettkampf 1'!C16","v":"Neuvrees II"},311.1,null,311.1,0,0,311.1,1,0,0,0,0,0,0,0,0,{"$nulls":5},{"v":0,"d":"0.0"},0,0,""]
[8,{"$f":"'Wettkampf 1'!B17","v":"Silvia Thunert"},{"$f":"'Wettkampf 1'!C17","v":"Neuvrees II"},306.8,null,306.8,0,0,306.8,1,0,0,0,0,0,0,0,0,{"$nulls":5},{"v":0,"d":"0.0"},0,0,""]
[9,{"$f":"'Wettkampf 1'!B18","v":"Margret Pohlmann"},{"$f":"'Wettkampf 1'!C18","v":"Neuvrees II"},{"v":302,"d":"302.0"},null,{"v":302,"d":"302.0"},0,0,302,1,0,0,0,0,0,0,0,0,{"$nulls":5},{"v":0,"d":"0.0"},0,0,""]
[10,{"$f":"'Wettkampf 1'!B19","v":"Harma Steenken"},{"$f":"'Wettkampf 1'!C19","v":"Neuvrees II"},{"v":0,"d":"0.0"},"x","0",0,0,"0",0,0,0,0,0,0,0,0,0,{"$nulls":5},{"v":0,"d":"0.0"},1,0,""]
[11,{"$f":"'Wettkampf 1'!B20","v":"Claudia Rolfes"},{"$f":"'Wettkampf 1'!C20","v":"Neuvrees II"},309.2,null,309.2,0,0,309.2,1,0,0,0,0,0,0,0,0,{"$nulls":5},{"v":0,"d":"0.0"},0,0,""]
[12,{"$f":"'Wettkampf 1'!B21","v":"Silvia Junge"},{"$f":"'Wettkampf 1'!C21","v":"Neuvrees II"},299.8,"x","0",0,0,"0",0,0,0,0,0,0,0,0,0,{"$nulls":5},{"v":0,"d":"0.0"},0,0,""]
[13,{"$f":"'Wettkampf 1'!B22","v":"Ulla Schnieders"},{"$f":"'Wettkampf 1'!C22","v":"Börgermoor I"},302.9,null,302.9,0,0,0,0,302.9,1,0,0,0,0,0,0,{"$nulls":5},{"v":0,"d":"0.0"},0,0,""]
[14,{"$f":"'Wettkampf 1'!B23","v":"Jasmin Kramer"},{"$f":"'Wettkampf 1'!C23","v":"Börgermoor I"},312.3,null,312.3,0,0,0,0,312.3,1,0,0,0,0,0,0,{"$nulls":5},{"v":0,"d":"0.0"},0,0,""]
[15,{"$f":"'Wettkampf 1'!B24","v":"Anni Küwen"},{"$f":"'Wettkampf 1'!C24","v":"Börgermoor I"},310.7,null,310.7,0,0,0,0,310.7,1,0,0,0,0,0,0,{"$nulls":5},{"v":0,"d":"0.0"},0,0,""]
[16,{"$f":"'Wettkampf 1'!B25","v":"Waltraud Dobelmann"},{"$f":"'Wettkampf 1'!C25","v":"Börgermoor I"},311.1,null,311.1,0,0,0,0,311.1,1,0,0,0,0,0,0,{"$nulls":5},{"v":0,"d":"0.0"},0,0,""]
[17,{"$f":"'Wettkampf 1'!B26","v":"Schütze 17"},{"$f":"'Wettkampf 1'!C26","v":"Börgermoor I"},{"v":0,"d":"0.0"},"x","0",0,0,0,0,"0",0,0,0,0,0,0,0,{"$nulls":5},{"v":0,"d":"0.0"},1,0,""]
[18,{"$f":"'Wettkampf 1'!B27","v":"Schütze 18"},{"$f":"'Wettkampf 1'!C27","v":"Börgermoor I"},{"v":0,"d":"0.0"},"x","0",0,0,0,0,"0",0,0,0,0,0,0,0,{"$nulls":5},{"v":0,"d":"0.0"},1,0,""]
[19,{"$f":"'Wettkampf 1'!B28","v":"Hanna Gebken"},{"$f":"'Wettkampf 1'!C28","v":"Lorup III"},307.2,null,307.2,0,0,0,0,0,0,307.2,1,0,0,0,0,{"$nulls":5},{"v":0,"d":"0.0"},0,0,""]
[20,{"$f":"'Wettkampf 1'!B29","v":"Monika Reimann"},{"$f":"'Wettkampf 1'!C29","v":"Lorup III"},301.8,null,301.8,0,0,0,0,0,0,301.8,1,0,0,0,0,{"$nulls":5},{"v":0,"d":"0.0"},0,0,""]
[21,{"$f":"'Wettkampf 1'!B30","v":"Marina Schrand"},{"$f":"'Wettkampf 1'!C30","v":"Lorup III"},306.7,null,306.7,0,0,0,0,0,0,306.7,1,0,0,0,0,{"$nulls":5},{"v":0,"d":"0.0"},0,0,""]
[22,{"$f":"'Wettkampf 1'!B31","v":"Nadine Krömer"},{"$f":"'Wettkampf 1'!C31","v":"Lorup III"},312.1,null,312.1,0,0,0,0,0,0,312.1,1,0,0,0,0,{"$nulls":5},{"v":0,"d":"0.0"},0,0,""]
[23,{"$f":"'Wettkampf 1'!B32","v":"Nina Krömer"},{"$f":"'Wettkampf 1'!C32","v":"Lorup III"},292.7,"x","0",0,0,0,0,0,0,"0",0,0,0,0,0,{"$nulls":5},{"v":0,"d":"0.0"},0,0,""]
[24,{"$f":"'Wettkampf 1'!B33","v":"Margret Büter"},{"$f":"'Wettkampf 1'!C33","v":"Lorup III"},{"v":0,"d":"0.0"},"x","0",0,0,0,0,0,0,"0",0,0,0,0,0,{"$nulls":5},{"v":0,"d":"0.0"},1,0,""]
[25,{"$f":"'Wettkampf 1'!B34","v":"Sarah Meiners"},{"$f":"'Wettkampf 1'!C34","v":"Ostenwalde II"},{"v":0,"d":"0.0"},"x","0",0,0,0,0,0,0,0,0,"0",0,0,0,{"$nulls":5},{"v":0,"d":"0.0"},1,0,""]
[26,{"$f":"'Wettkampf 1'!B35","v":"Anna Temmen"},{"$f":"'Wettkampf 1'!C35","v":"Ostenwalde II"},311.3,null,311.3,0,0,0,0,0,0,0,0,311.3,1,0,0,{"$nulls":5},{"v":0,"d":"0.0"},0,0,""]
[27,{"$f":"'Wettkampf 1'!B36","v":"Helga Meiners"},{"$f":"'Wettkampf 1'!C36","v":"Ostenwalde II"},291.6,null,291.6,0,0,0,0,0,0,0,0,291.6,1,0,0,{"$nulls":5},{"v":0,"d":"0.0"},0,0,""]
[28,{"$f":"'Wettkampf 1'!B37","v":"Carmen Benten"},{"$f":"'Wettkampf 1'!C37","v":"Ostenwalde II"},{"v":298,"d":"298.0"},null,{"v":298,"d":"298.0"},0,0,0,0,0,0,0,0,298,1,0,0,{"$nulls":5},{"v":0,"d":"0.0"},0,0,""]
[29,{"$f":"'Wettkampf 1'!B38","v":"Anna -Maria Wimberg"},{"$f":"'Wettkampf 1'!C38","v":"Ostenwalde II"},{"v":0,"d":"0.0"},"x","0",0,0,0,0,0,0,0,0,"0",0,0,0,{"$nulls":5},{"v":0,"d":"0.0"},1,0,""]
[30,{"$f":"'Wettkampf 1'!B39","v":"Evelyn Feder"},{"$f":"'Wettkampf 1'!C39","v":"Ostenwalde II"},299.5,null,299.5,0,0,0,0,0,0,0,0,299.5,1,0,0,{"$nulls":5},{"v":0,"d":"0.0"},0,0,""]
[31,{"$f":"'Wettkampf 1'!B40","v":"Monika Jansen"},{"$f":"'Wettkampf 1'!C40","v":"Spahnharrenstätte I"},309.6,null,309.6,0,0,0,0,0,0,0,0,0,0,309.6,1,{"$nulls":5},{"v":0,"d":"0.0"},0,0,""]
[32,{"$f":"'Wettkampf 1'!B41","v":"Kerstin Sträche"},{"$f":"'Wettkampf 1'!C41","v":"Spahnharrenstätte I"},299.7,null,299.7,0,0,0,0,0,0,0,0,0,0,299.7,1,{"$nulls":5},{"v":0,"d":"0.0"},0,0,""]
[33,{"$f":"'Wettkampf 1'!B42","v":"Rita Hanekamp"},{"$f":"'Wettkampf 1'!C42","v":"Spahnharrenstätte I"},284.9,null,284.9,0,0,0,0,0,0,0,0,0,0,284.9,1,{"$nulls":5},{"v":0,"d":"0.0"},0,0,""]
[34,{"$f":"'Wettkampf 1'!B43","v":"Maria Beusing"},{"$f":"'Wettkampf 1'!C43","v":"Spahnharrenstätte I"},309.9,null,309.9,0,0,0,0,0,0,0,0,0,0,309.9,1,{"$nulls":5},{"v":0,"d":"0.0"},0,0,""]
[35,{"$f":"'Wettkampf 1'!B44","v":"Schütze 35"},{"$f":"'Wettkampf 1'!C44","v":"Spahnharrenstätte I"},{"v":0,"d":"0.0"},"x","0",0,0,0,0,0,0,0,0,0,0,"0",0,{"$nulls":5},{"v":0,"d":"0.0"},1,0,""]
[36,{"$f":"'Wettkampf 1'!B45","v":"Schütze 36"},{"$f":"'Wettkampf 1'!C45","v":"Spahnharrenstätte I"},{"v":0,"d":"0.0"},"x","0",0,0,0,0,0,0,0,0,0,0,"0",0,{"$nulls":5},{"v":0,"d":"0.0"},1,0,""]
[{"$nulls":6},{"$f":"LARGE(G10:G45,1)+LARGE(G10:G45,2)+LARGE(G10:G45,3)","v":927.5999999999999},{"$f":"SUM(H10:H45)","v":4},{"$f":"LARGE(I10:I45,1)+LARGE(I10:I45,2)+LARGE(I10:I45,3)","v":927.0999999999999},{"$f":"SUM(J10:J45)","v":4},{"$f":"LARGE(K10:K45,1)+LARGE(K10:K45,2)+LARGE(K10:K45,3)","v":934.1000000000001},{"$f":"SUM(L10:L45)","v":4},{"$f":"LARGE(M10:M45,1)+LARGE(M10:M45,2)+LARGE(M10:M45,3)","v":926},{"$f":"SUM(N10:N45)","v":4},{"$f":"LARGE(O10:O45,1)+LARGE(O10:O45,2)+LARGE(O10:O45,3)","v":908.8},{"$f":"SUM(P10:P45)","v":4},{"$f":"LARGE(Q10:Q45,1)+LARGE(Q10:Q45,2)+LARGE(Q10:Q45,3)","v":919.2},{"$f":"SUM(R10:S45)","v":4}]
[null,null,"per Email an: sk-huemmling@gmx.de"]

{"sheet":"9","index":9,"n_rows":47,"n_cols":27,"rows_kept":47,"merged":[[0,22,0,23],[1,22,1,23],[4,22,4,23],[5,22,5,23],[6,22,6,23],[8,20,8,23]]}
[null,"Verein / Gruppe",null,"Ergebnisse",{"$nulls":17},"Austragungsort:",{"$f":"Übersicht!N4","v":"Neuvrees"}]
[1,{"$f":"'Wettkampf 1'!B2","v":"Börger II"},null,{"$f":"G46","v":927.5},{"$f":"IF(H46>4,\"Es sind zu viele Schützen in Wertung!\",\" \")","v":" "},{"$nulls":16},"Wettkampftag:",{"$f":"Übersicht!N3","v":"09.02."}]
[2,{"$f":"'Wettkampf 1'!B3","v":"Neuvrees II"},null,{"$f":"I46","v":925.2},{"$f":"IF(J46>4,\"Es sind zu viele Schützen in Wertung!\",\" \")","v":" "}]
[3,{"$f":"'Wettkampf 1'!B4","v":"Börgermoor I"},null,{"$f":"K46","v":{"v":928.0000000000001,"d":"928.0"}},{"$f":"IF(L46>4,\"Es sind zu viele Schützen in Wertung!\",\" \")","v":" "},{"$nulls":18},"Ansprechpartner für Rückfragen:"]
[4,{"$f":"'Wettkampf 1'!B5","v":"Lorup III"},null,{"$f":"M46","v":927.7},{"$f":"IF(N46>4,\"Es sind zu viele Schützen in Wertung!\",\" \")","v":" "},{"$nulls":16},"Name:","Silvia Thunert"]
[5,{"$f":"'Wettkampf 1'!B6","v":"Ostenwalde II"},null,{"$f":"O46","v":912.5},{"$f":"IF(P46>4,\"Es sind zu viele Schützen in Wertung!\",\" \")","v":" "},{"$nulls":16},"Tel:","04493-998686"]
[6,{"$f":"'Wettkampf 1'!B7","v":"Spahnharrenstätte I"},null,{"$f":"Q46","v":928.9},{"$f":"IF(R46>4,\"Es sind zu viele Schützen in Wertung!\",\" \")","v":" "},{"$nulls":16},"Standaufsicht:","Wilhelm Gerdes, Lorup"]
[]
[null,"Einzelergebnisse:","Verein / Gruppe","Ergebnisse (mindestens 0 eintragen)","AW? Dann x eintippen",null,"Verein 1",null,"Verein 2",null,"Verein 3",null,"Verein 4",null,"Verein 5",null,"Verein 6",{"$nulls":3},"Proberechnung bei Streifen:"]
[1,{"$f":"'Wettkampf 1'!B10","v":"Gertrud Kuchta"},{"$f":"'Wettkampf 1'!C10","v":"Börger II"},307.5,null,{"$f":"IF(E10=\"x\",\"0\",D10)","v":307.5},{"$f":"IF(C10=$B$2,F10,0)","v":307.5},{"$f":"(IF(AND($E10=\"\",$C10=$B$2),1,0))","v":1},{"$f":"IF($C10=$B$3,F10,0)","v":0},{"$f":"(IF(AND($E10=\"\",$C10=$B$3),1,0))","v":0},{"$f":"IF($C10=$B$4,F10,0)","v":0},{"$f":"(IF(AND($E10=\"\",$C10=$B$4),1,0))","v":0},{"$f":"IF($C10=$B$5,F10,0)","v":0},{"$f":"(IF(AND($E10=\"\",$C10=$B$5),1,0))","v":0},{"$f":"IF($C10=$B$6,F10,0)","v":0},{"$f":"(IF(AND($E10=\"\",$C10=$B$6),1,0))","v":0},{"$f":"IF($C10=$B$7,F10,0)","v":0},{"$f":"(IF(AND($E10=\"\",$C10=$B$7),1,0))","v":0},null,null,101.6,102.2,103.7,{"$f":"U10+V10+W10","v":307.5},{"$f":"IF(X10=D10,1,0)","v":1},{"$f":"IF(X10=0,0,1)","v":1},{"$f":"IF(Y10+Z10=2,\"Korrekt\",\"\")","v":"Korrekt"}]
[2,{"$f":"'Wettkampf 1'!B11","v":"Sarah Breer"},{"$f":"'Wettkampf 1'!C11","v":"Börger II"},{"v":0,"d":"0.0"},"x",{"$f":"IF(E11=\"x\",\"0\",D11)","v":"0"},{"$f":"IF(C11=$B$2,F11,0)","v":"0"},{"$f":"(IF(AND($E11=\"\",$C11=$B$2),1,0))","v":0},{"$f":"IF($C11=$B$3,F11,0)","v":0},{"$f":"(IF(AND($E11=\"\",$C11=$B$3),1,0))","v":0},{"$f":"IF($C11=$B$4,F11,0)","v":0},{"$f":"(IF(AND($E11=\"\",$C11=$B$4),1,0))","v":0},{"$f":"IF($C11=$B$5,F11,0)","v":0},{"$f":"(IF(AND($E11=\"\",$C11=$B$5),1,0))","v":0},{"$f":"IF($C11=$B$6,F11,0)","v":0},{"$f":"(IF(AND($E11=\"\",$C11=$B$6),1,0))","v":0},{"$f":"IF($C11=$B$7,F11,0)","v":0},{"$f":"(IF(AND($E11=\"\",$C11=$B$7),1,0))","v":0},null,null,{"v":0,"d":"0.0"},{"v":0,"d":"0.0"},{"v":0,"d":"0.0"},{"$f":"U11+V11+W11","v":{"v":0,"d":"0.0"}},{"$f":"IF(X11=D11,1,0)","v":1},{"$f":"IF(X11=0,0,1)","v":0},{"$f":"IF(Y11+Z11=2,\"Korrekt\",\"\")","v":""}]
[3,{"$f":"'Wettkampf 1'!B12","v":"Margret Pohlgeers"},{"$f":"'Wettkampf 1'!C12","v":"Börger II"},312.4,null,312.4,312.4,1,0,0,0,0,0,0,0,0,0,0,null,null,104.3,105.3,102.8,312.4,1,1,"Korrekt"]
[4,{"$f":"'Wettkampf 1'!B13","v":"Gundula Schwarte"},{"$f":"'Wettkampf 1'!C13","v":"Börger II"},{"v":303,"d":"303.0"},"x","0","0",0,0,0,0,0,0,0,0,0,0,0,null,null,101.5,{"v":101,"d":"101.0"},100.5,{"v":303,"d":"303.0"},1,1,"Korrekt"]
[5,{"$f":"'Wettkampf 1'!B14","v":"Annette Schwarte"},{"$f":"'Wettkampf 1'!C14","v":"Börger II"},{"v":299,"d":"299.0"},null,{"v":299,"d":"299.0"},299,1,0,0,0,0,0,0,0,0,0,0,null,null,102.1,99.7,97.2,{"v":299,"d":"299.0"},1,1,"Korrekt"]
[6,{"$f":"'Wettkampf 1'!B15","v":"Petra Dödtmann"},{"$f":"'Wettkampf 1'!C15","v":"Börger II"},307.6,null,307.6,307.6,1,0,0,0,0,0,0,0,0,0,0,null,null,102.9,103.9,100.8,307.6,1,1,"Korrekt"]
[7,{"$f":"'Wettkampf 1'!B16","v":"Sarah Deyen"},{"$f":"'Wettkampf 1'!C16","v":"Neuvrees II"},{"v":306,"d":"306.0"},null,{"v":306,"d":"306.0"},0,0,306,1,0,0,0,0,0,0,0,0,null,null,101.5,101.6,102.9,{"v":306,"d":"306.0"},1,1,"Korrekt"]
[8,{"$f":"'Wettkampf 1'!B17","v":"Silvia Thunert"},{"$f":"'Wettkampf 1'!C17","v":"Neuvrees II"},311.3,null,311.3,0,0,311.3,1,0,0,0,0,0,0,0,0,null,null,103.5,{"v":104,"d":"104.0"},103.8,311.3,1,1,"Korrekt"]
[9,{"$f":"'Wettkampf 1'!B18","v":"Margret Pohlmann"},{"$f":"'Wettkampf 1'!C18","v":"Neuvrees II"},300.8,null,300.8,0,0,300.8,1,0,0,0,0,0,0,0,0,null,null,99.1,101.2,100.5,300.8,1,1,"Korrekt"]
[10,{"$f":"'Wettkampf 1'!B19","v":"Harma Steenken"},{"$f":"'Wettkampf 1'!C19","v":"Neuvrees II"},{"v":282,"d":"282.0"},"x","0",0,0,"0",0,0,0,0,0,0,0,0,0,null,null,96.4,89.2,96.4,{"v":282,"d":"282.0"},1,1,"Korrekt"]
[11,{"$f":"'Wettkampf 1'!B20","v":"Claudia Rolfes"},{"$f":"'Wettkampf 1'!C20","v":"Neuvrees II"},307.9,null,307.9,0,0,307.9,1,0,0,0,0,0,0,0,0,null,null,{"v":101,"d":"101.0"},103.6,103.3,307.9,1,1,"Korrekt"]
[12,{"$f":"'Wettkampf 1'!B21","v":"Silvia Junge"},{"$f":"'Wettkampf 1'!C21","v":"Neuvrees II"},247.4,"x","0",0,0,"0",0,0,0,0,0,0,0,0,0,null,null,{"v":66,"d":"66.0"},80.8,100.6,247.4,1,1,"Korrekt"]
[13,{"$f":"'Wettkampf 1'!B22","v":"Ulla Schnieders"},{"$f":"'Wettkampf 1'!C22","v":"Börgermoor I"},{"v":304,"d":"304.0"},null,{"v":304,"d":"304.0"},0,0,0,0,304,1,0,0,0,0,0,0,null,null,102.5,100.3,101.2,{"v":304,"d":"304.0"},1,1,"Korrekt"]
[14,{"$f":"'Wettkampf 1'!B23","v":"Jasmin Kramer"},{"$f":"'Wettkampf 1'!C23","v":"Börgermoor I"},312.3,null,312.3,0,0,0,0,312.3,1,0,0,0,0,0,0,null,null,{"v":105,"d":"105.0"},103.2,104.1,{"v":312.29999999999995,"d":"312.3"},1,1,"Korrekt"]
[15,{"$f":"'Wettkampf 1'!B24","v":"Anni Küwen"},{"$f":"'Wettkampf 1'!C24","v":"Börgermoor I"},311.1,null,311.1,0,0,0,0,311.1,1,0,0,0,0,0,0,null,null,103.5,{"v":104,"d":"104.0"},103.6,311.1,1,1,"Korrekt"]
[16,{"$f":"'Wettkampf 1'!B25","v":"Waltraud Dobelmann"},{"$f":"'Wettkampf 1'!C25","v":"Börgermoor I"},304.6,null,304.6,0,0,0,0,304.6,1,0,0,0,0,0,0,null,null,99.2,101.7,103.7,304.6,1,1,"Korrekt"]
[17,{"$f":"'Wettkampf 1'!B26","v":"Schütze 17"},{"$f":"'Wettkampf 1'!C26","v":"Börgermoor I"},{"v":0,"d":"0.0"},"x","0",0,0,0,0,"0",0,0,0,0,0,0,0,{"$nulls":5},{"v":0,"d":"0.0"},1,0,""]
[18,{"$f":"'Wettkampf 1'!B27","v":"Schütze 18"},{"$f":"'Wettkampf 1'!C27","v":"Börgermoor I"},{"v":0,"d":"0.0"},"x","0",0,0,0,0,"0",0,0,0,0,0,0,0,{"$nulls":5},{"v":0,"d":"0.0"},1,0,""]
[19,{"$f":"'Wettkampf 1'!B28","v":"Hanna Gebken"},{"$f":"'Wettkampf 1'!C28","v":"Lorup III"},309.4,null,309.4,0,0,0,0,0,0,309.4,1,0,0,0,0,null,null,102.6,103.1,103.7,309.4,1,1,"Korrekt"]
[20,{"$f":"'Wettkampf 1'!B29","v":"Monika Reimann"},{"$f":"'Wettkampf 1'!C29","v":"Lorup III"},305.7,null,305.7,0,0,0,0,0,0,305.7,1,0,0,0,0,null,null,102.7,101.1,101.9,{"v":305.70000000000005,"d":"305.7"},1,1,"Korrekt"]
[21,{"$f":"'Wettkampf 1'!B30","v":"Marina Schrand"},{"$f":"'Wettkampf 1'!C30","v":"Lorup III"},303.5,null,303.5,0,0,0,0,0,0,303.5,1,0,0,0,0,null,null,100.6,{"v":101,"d":"101.0"},101.9,303.5,1,1,"Korrekt"]
[22,{"$f":"'Wettkampf 1'!B31","v":"Nadine Krömer"},{"$f":"'Wettkampf 1'!C31","v":"Lorup III"},312.6,null,312.6,0,0,0,0,0,0,312.6,1,0,0,0,0,null,null,105.5,103.5,103.6,312.6,1,1,"Korrekt"]
[23,{"$f":"'Wettkampf 1'!B32","v":"Nina Krömer"},{"$f":"'Wettkampf 1'!C32","v":"Lorup III"},{"v":296,"d":"296.0"},"x","0",0,0,0,0,0,0,"0",0,0,0,0,0,null,null,{"v":97,"d":"97.0"},100.3,98.7,{"v":296,"d":"296.0"},1,1,"Korrekt"]
[24,{"$f":"'Wettkampf 1'!B33","v":"Margret Büter"},{"$f":"'Wettkampf 1'!C33","v":"Lorup III"},{"v":0,"d":"0.0"},"x","0",0,0,0,0,0,0,"0",0,0,0,0,0,{"$nulls":5},{"v":0,"d":"0.0"},1,0,""]
[25,{"$f":"'Wettkampf 1'!B34","v":"Sarah Meiners"},{"$f":"'Wettkampf 1'!C34","v":"Ostenwalde II"},291.9,null,291.9,0,0,0,0,0,0,0,0,291.9,1,0,0,null,null,96.9,95.5,99.5,291.9,1,1,"Korrekt"]
[26,{"$f":"'Wettkampf 1'!B35","v":"Anna Temmen"},{"$f":"'Wettkampf 1'!C35","v":"Ostenwalde II"},310.8,null,310.8,0,0,0,0,0,0,0,0,310.8,1,0,0,null,null,104.8,102.1,103.9,{"v":310.79999999999995,"d":"310.8"},1,1,"Korrekt"]
[27,{"$f":"'Wettkampf 1'!B36","v":"Helga Meiners"},{"$f":"'Wettkampf 1'!C36","v":"Ostenwalde II"},{"v":0,"d":"0.0"},"x","0",0,0,0,0,0,0,0,0,"0",0,0,0,{"$nulls":5},{"v":0,"d":"0.0"},1,0,""]
[28,{"$f":"'Wettkampf 1'!B37","v":"Carmen Benten"},{"$f":"'Wettkampf 1'!C37","v":"Ostenwalde II"},309.8,null,309.8,0,0,0,0,0,0,0,0,309.8,1,0,0,null,null,102.5,102.9,104.4,309.8,1,1,"Korrekt"]
[29,{"$f":"'Wettkampf 1'!B38","v":"Anna -Maria Wimberg"},{"$f":"'Wettkampf 1'!C38","v":"Ostenwalde II"},{"v":0,"d":"0.0"},"x","0",0,0,0,0,0,0,0,0,"0",0,0,0,{"$nulls":5},{"v":0,"d":"0.0"},1,0,""]
[30,{"$f":"'Wettkampf 1'!B39","v":"Evelyn Feder"},{"$f":"'Wettkampf 1'!C39","v":"Ostenwalde II"},{"v":0,"d":"0.0"},"x","0",0,0,0,0,0,0,0,0,"0",0,0,0,{"$nulls":5},{"v":0,"d":"0.0"},1,0,""]
[31,{"$f":"'Wettkampf 1'!B40","v":"Monika Jansen"},{"$f":"'Wettkampf 1'!C40","v":"Spahnharrenstätte I"},309.7,null,309.7,0,0,0,0,0,0,0,0,0,0,309.7,1,null,null,102.7,100.9,106.1,{"v":309.70000000000005,"d":"309.7"},1,1,"Korrekt"]
[32,{"$f":"'Wettkampf 1'!B41","v":"Kerstin Sträche"},{"$f":"'Wettkampf 1'!C41","v":"Spahnharrenstätte I"},308.4,null,308.4,0,0,0,0,0,0,0,0,0,0,308.4,1,null,null,{"v":103,"d":"103.0"},102.6,102.8,308.4,1,1,"Korrekt"]
[33,{"$f":"'Wettkampf 1'!B42","v":"Rita Hanekamp"},{"$f":"'Wettkampf 1'!C42","v":"Spahnharrenstätte I"},296.3,null,296.3,0,0,0,0,0,0,0,0,0,0,296.3,1,null,null,99.4,{"v":98,"d":"98.0"},98.9,296.3,1,1,"Korrekt"]
[34,{"$f":"'Wettkampf 1'!B43","v":"Maria Beusing"},{"$f":"'Wettkampf 1'!C43","v":"Spahnharrenstätte I"},310.8,null,310.8,0,0,0,0,0,0,0,0,0,0,310.8,1,null,null,105.9,100.7,104.2,310.8,1,1,"Korrekt"]
[35,{"$f":"'Wettkampf 1'!B44","v":"Schütze 35"},{"$f":"'Wettkampf 1'!C44","v":"Spahnharrenstätte I"},{"v":0,"d":"0.0"},"x","0",0,0,0,0,0,0,0,0,0,0,"0",0,{"$nulls":5},{"v":0,"d":"0.0"},1,0,""]
[36,{"$f":"'Wettkampf 1'!B45","v":"Schütze 36"},{"$f":"'Wettkampf 1'!C45","v":"Spahnharrenstätte I"},{"v":0,"d":"0.0"},"x","0",0,0,0,0,0,0,0,0,0,0,"0",0,{"$nulls":5},{"v":0,"d":"0.0"},1,0,""]
[{"$nulls":6},{"$f":"LARGE(G10:G45,1)+LARGE(G10:G45,2)+LARGE(G10:G45,3)","v":927.5},{"$f":"SUM(H10:H45)","v":4},{"$f":"LARGE(I10:I45,1)+LARGE(I10:I45,2)+LARGE(I10:I45,3)","v":925.2},{"$f":"SUM(J10:J45)","v":4},{"$f":"LARGE(K10:K45,1)+LARGE(K10:K45,2)+LARGE(K10:K45,3)","v":928.0000000000001},{"$f":"SUM(L10:L45)","v":4},{"$f":"LARGE(M10:M45,1)+LARGE(M10:M45,2)+LARGE(M10:M45,3)","v":927.7},{"$f":"SUM(N10:N45)","v":4},{"$f":"LARGE(O10:O45,1)+LARGE(O10:O45,2)+LARGE(O10:O45,3)","v":912.5},{"$f":"SUM(P10:P45)","v":3},{"$f":"LARGE(Q10:Q45,1)+LARGE(Q10:Q45,2)+LARGE(Q10:Q45,3)","v":928.9},{"$f":"SUM(R10:S45)","v":4}]
[null,null,"per Email an: sk-huemmling@gmx.de"]

{"sheet":"10","index":10,"n_rows":47,"n_cols":27,"rows_kept":47,"merged":[[0,22,0,23],[1,22,1,23],[4,22,4,23],[5,22,5,23],[6,22,6,23],[8,20,8,23]]}
[null,"Verein / Gruppe",null,"Ergebnisse",{"$nulls":17},"Austragungsort:",{"$f":"Übersicht!O4","v":"Lorup"}]
[1,{"$f":"'Wettkampf 1'!B2","v":"Börger II"},null,{"$f":"G46","v":928.8},{"$f":"IF(H46>4,\"Es sind zu viele Schützen in Wertung!\",\" \")","v":" "},{"$nulls":16},"Wettkampftag:",{"$f":"Übersicht!O3","v":"23.02."}]
[2,{"$f":"'Wettkampf 1'!B3","v":"Neuvrees II"},null,{"$f":"I46","v":929.3},{"$f":"IF(J46>4,\"Es sind zu viele Schützen in Wertung!\",\" \")","v":" "}]
[3,{"$f":"'Wettkampf 1'!B4","v":"Börgermoor I"},null,{"$f":"K46","v":918.3},{"$f":"IF(L46>4,\"Es sind zu viele Schützen in Wertung!\",\" \")","v":" "},{"$nulls":18},"Ansprechpartner für Rückfragen:"]
[4,{"$f":"'Wettkampf 1'!B5","v":"Lorup III"},null,{"$f":"M46","v":931.5},{"$f":"IF(N46>4,\"Es sind zu viele Schützen in Wertung!\",\" \")","v":" "},{"$nulls":16},"Name:","Margret Pohlgeers"]
[5,{"$f":"'Wettkampf 1'!B6","v":"Ostenwalde II"},null,{"$f":"O46","v":912.4},{"$f":"IF(P46>4,\"Es sind zu viele Schützen in Wertung!\",\" \")","v":" "},{"$nulls":16},"Tel:","05953/8976"]
[6,{"$f":"'Wettkampf 1'!B7","v":"Spahnharrenstätte I"},null,{"$f":"Q46","v":{"v":922,"d":"922.0"}},{"$f":"IF(R46>4,\"Es sind zu viele Schützen in Wertung!\",\" \")","v":" "},{"$nulls":16},"Standaufsicht:","Hans Pohlgeers"]
[]
[null,"Einzelergebnisse:","Verein / Gruppe","Ergebnisse (mindestens 0 eintragen)","AW? Dann x eintippen",null,"Verein 1",null,"Verein 2",null,"Verein 3",null,"Verein 4",null,"Verein 5",null,"Verein 6",{"$nulls":3},"Proberechnung bei Streifen:"]
[1,{"$f":"'Wettkampf 1'!B10","v":"Gertrud Kuchta"},{"$f":"'Wettkampf 1'!C10","v":"Börger II"},301.6,null,{"$f":"IF(E10=\"x\",\"0\",D10)","v":301.6},{"$f":"IF(C10=$B$2,F10,0)","v":301.6},{"$f":"(IF(AND($E10=\"\",$C10=$B$2),1,0))","v":1},{"$f":"IF($C10=$B$3,F10,0)","v":0},{"$f":"(IF(AND($E10=\"\",$C10=$B$3),1,0))","v":0},{"$f":"IF($C10=$B$4,F10,0)","v":0},{"$f":"(IF(AND($E10=\"\",$C10=$B$4),1,0))","v":0},{"$f":"IF($C10=$B$5,F10,0)","v":0},{"$f":"(IF(AND($E10=\"\",$C10=$B$5),1,0))","v":0},{"$f":"IF($C10=$B$6,F10,0)","v":0},{"$f":"(IF(AND($E10=\"\",$C10=$B$6),1,0))","v":0},{"$f":"IF($C10=$B$7,F10,0)","v":0},{"$f":"(IF(AND($E10=\"\",$C10=$B$7),1,0))","v":0},{"$nulls":5},{"$f":"U10+V10+W10","v":{"v":0,"d":"0.0"}},{"$f":"IF(X10=D10,1,0)","v":0},{"$f":"IF(X10=0,0,1)","v":0},{"$f":"IF(Y10+Z10=2,\"Korrekt\",\"\")","v":""}]
[2,{"$f":"'Wettkampf 1'!B11","v":"Sarah Breer"},{"$f":"'Wettkampf 1'!C11","v":"Börger II"},{"v":0,"d":"0.0"},"x",{"$f":"IF(E11=\"x\",\"0\",D11)","v":"0"},{"$f":"IF(C11=$B$2,F11,0)","v":"0"},{"$f":"(IF(AND($E11=\"\",$C11=$B$2),1,0))","v":0},{"$f":"IF($C11=$B$3,F11,0)","v":0},{"$f":"(IF(AND($E11=\"\",$C11=$B$3),1,0))","v":0},{"$f":"IF($C11=$B$4,F11,0)","v":0},{"$f":"(IF(AND($E11=\"\",$C11=$B$4),1,0))","v":0},{"$f":"IF($C11=$B$5,F11,0)","v":0},{"$f":"(IF(AND($E11=\"\",$C11=$B$5),1,0))","v":0},{"$f":"IF($C11=$B$6,F11,0)","v":0},{"$f":"(IF(AND($E11=\"\",$C11=$B$6),1,0))","v":0},{"$f":"IF($C11=$B$7,F11,0)","v":0},{"$f":"(IF(AND($E11=\"\",$C11=$B$7),1,0))","v":0},{"$nulls":5},{"$f":"U11+V11+W11","v":{"v":0,"d":"0.0"}},{"$f":"IF(X11=D11,1,0)","v":1},{"$f":"IF(X11=0,0,1)","v":0},{"$f":"IF(Y11+Z11=2,\"Korrekt\",\"\")","v":""}]
[3,{"$f":"'Wettkampf 1'!B12","v":"Margret Pohlgeers"},{"$f":"'Wettkampf 1'!C12","v":"Börger II"},313.7,null,313.7,313.7,1,0,0,0,0,0,0,0,0,0,0,{"$nulls":5},{"v":0,"d":"0.0"},0,0,""]
[4,{"$f":"'Wettkampf 1'!B13","v":"Gundula Schwarte"},{"$f":"'Wettkampf 1'!C13","v":"Börger II"},305.2,null,305.2,305.2,1,0,0,0,0,0,0,0,0,0,0,{"$nulls":5},{"v":0,"d":"0.0"},0,0,""]
[5,{"$f":"'Wettkampf 1'!B14","v":"Annette Schwarte"},{"$f":"'Wettkampf 1'!C14","v":"Börger II"},304.5,"x","0","0",0,0,0,0,0,0,0,0,0,0,0,{"$nulls":5},{"v":0,"d":"0.0"},0,0,""]
[6,{"$f":"'Wettkampf 1'!B15","v":"Petra Dödtmann"},{"$f":"'Wettkampf 1'!C15","v":"Börger II"},309.9,null,309.9,309.9,1,0,0,0,0,0,0,0,0,0,0,{"$nulls":5},{"v":0,"d":"0.0"},0,0,""]
[7,{"$f":"'Wettkampf 1'!B16","v":"Sarah Deyen"},{"$f":"'Wettkampf 1'!C16","v":"Neuvrees II"},{"v":309,"d":"309.0"},null,{"v":309,"d":"309.0"},0,0,309,1,0,0,0,0,0,0,0,0,{"$nulls":5},{"v":0,"d":"0.0"},0,0,""]
[8,{"$f":"'Wettkampf 1'!B17","v":"Silvia Thunert"},{"$f":"'Wettkampf 1'!C17","v":"Neuvrees II"},{"v":307,"d":"307.0"},null,{"v":307,"d":"307.0"},0,0,307,1,0,0,0,0,0,0,0,0,{"$nulls":5},{"v":0,"d":"0.0"},0,0,""]
[9,{"$f":"'Wettkampf 1'!B18","v":"Margret Pohlmann"},{"$f":"'Wettkampf 1'!C18","v":"Neuvrees II"},297.6,null,297.6,0,0,297.6,1,0,0,0,0,0,0,0,0,{"$nulls":5},{"v":0,"d":"0.0"},0,0,""]
[10,{"$f":"'Wettkampf 1'!B19","v":"Harma Steenken"},{"$f":"'Wettkampf 1'!C19","v":"Neuvrees II"},{"v":0,"d":"0.0"},"x","0",0,0,"0",0,0,0,0,0,0,0,0,0,{"$nulls":5},{"v":0,"d":"0.0"},1,0,""]
[11,{"$f":"'Wettkampf 1'!B20","v":"Claudia Rolfes"},{"$f":"'Wettkampf 1'!C20","v":"Neuvrees II"},313.3,null,313.3,0,0,313.3,1,0,0,0,0,0,0,0,0,{"$nulls":5},{"v":0,"d":"0.0"},0,0,""]
[12,{"$f":"'Wettkampf 1'!B21","v":"Silvia Junge"},{"$f":"'Wettkampf 1'!C21","v":"Neuvrees II"},297.2,"x","0",0,0,"0",0,0,0,0,0,0,0,0,0,{"$nulls":5},{"v":0,"d":"0.0"},0,0,""]
[13,{"$f":"'Wettkampf 1'!B22","v":"Ulla Schnieders"},{"$f":"'Wettkampf 1'!C22","v":"Börgermoor I"},308.2,null,308.2,0,0,0,0,308.2,1,0,0,0,0,0,0,{"$nulls":5},{"v":0,"d":"0.0"},0,0,""]
[14,{"$f":"'Wettkampf 1'!B23","v":"Jasmin Kramer"},{"$f":"'Wettkampf 1'!C23","v":"Börgermoor I"},305.4,null,305.4,0,0,0,0,305.4,1,0,0,0,0,0,0,{"$nulls":5},{"v":0,"d":"0.0"},0,0,""]
[15,{"$f":"'Wettkampf 1'!B24","v":"Anni Küwen"},{"$f":"'Wettkampf 1'!C24","v":"Börgermoor I"},{"v":302,"d":"302.0"},null,{"v":302,"d":"302.0"},0,0,0,0,302,1,0,0,0,0,0,0,{"$nulls":5},{"v":0,"d":"0.0"},0,0,""]
[16,{"$f":"'Wettkampf 1'!B25","v":"Waltraud Dobelmann"},{"$f":"'Wettkampf 1'!C25","v":"Börgermoor I"},304.7,null,304.7,0,0,0,0,304.7,1,0,0,0,0,0,0,{"$nulls":5},{"v":0,"d":"0.0"},0,0,""]
[17,{"$f":"'Wettkampf 1'!B26","v":"Schütze 17"},{"$f":"'Wettkampf 1'!C26","v":"Börgermoor I"},null,"x","0",0,0,0,0,"0",0,0,0,0,0,0,0,{"$nulls":5},{"v":0,"d":"0.0"},1,0,""]
[18,{"$f":"'Wettkampf 1'!B27","v":"Schütze 18"},{"$f":"'Wettkampf 1'!C27","v":"Börgermoor I"},null,"x","0",0,0,0,0,"0",0,0,0,0,0,0,0,{"$nulls":5},{"v":0,"d":"0.0"},1,0,""]
[19,{"$f":"'Wettkampf 1'!B28","v":"Hanna Gebken"},{"$f":"'Wettkampf 1'!C28","v":"Lorup III"},307.5,null,307.5,0,0,0,0,0,0,307.5,1,0,0,0,0,{"$nulls":5},{"v":0,"d":"0.0"},0,0,""]
[20,{"$f":"'Wettkampf 1'!B29","v":"Monika Reimann"},{"$f":"'Wettkampf 1'!C29","v":"Lorup III"},304.1,null,304.1,0,0,0,0,0,0,304.1,1,0,0,0,0,{"$nulls":5},{"v":0,"d":"0.0"},0,0,""]
[21,{"$f":"'Wettkampf 1'!B30","v":"Marina Schrand"},{"$f":"'Wettkampf 1'!C30","v":"Lorup III"},308.3,null,308.3,0,0,0,0,0,0,308.3,1,0,0,0,0,{"$nulls":5},{"v":0,"d":"0.0"},0,0,""]
[22,{"$f":"'Wettkampf 1'!B31","v":"Nadine Krömer"},{"$f":"'Wettkampf 1'!C31","v":"Lorup III"},315.7,null,315.7,0,0,0,0,0,0,315.7,1,0,0,0,0,{"$nulls":5},{"v":0,"d":"0.0"},0,0,""]
[23,{"$f":"'Wettkampf 1'!B32","v":"Nina Krömer"},{"$f":"'Wettkampf 1'!C32","v":"Lorup III"},303.1,"x","0",0,0,0,0,0,0,"0",0,0,0,0,0,{"$nulls":5},{"v":0,"d":"0.0"},0,0,""]
[24,{"$f":"'Wettkampf 1'!B33","v":"Margret Büter"},{"$f":"'Wettkampf 1'!C33","v":"Lorup III"},{"v":0,"d":"0.0"},"x","0",0,0,0,0,0,0,"0",0,0,0,0,0,{"$nulls":5},{"v":0,"d":"0.0"},1,0,""]
[25,{"$f":"'Wettkampf 1'!B34","v":"Sarah Meiners"},{"$f":"'Wettkampf 1'!C34","v":"Ostenwalde II"},291.9,null,291.9,0,0,0,0,0,0,0,0,291.9,1,0,0,{"$nulls":5},{"v":0,"d":"0.0"},0,0,""]
[26,{"$f":"'Wettkampf 1'!B35","v":"Anna Temmen"},{"$f":"'Wettkampf 1'!C35","v":"Ostenwalde II"},313.3,null,313.3,0,0,0,0,0,0,0,0,313.3,1,0,0,{"$nulls":5},{"v":0,"d":"0.0"},0,0,""]
[27,{"$f":"'Wettkampf 1'!B36","v":"Helga Meiners"},{"$f":"'Wettkampf 1'!C36","v":"Ostenwalde II"},{"v":0,"d":"0.0"},null,{"v":0,"d":"0.0"},0,0,0,0,0,0,0,0,0,1,0,0,{"$nulls":5},{"v":0,"d":"0.0"},1,0,""]
[28,{"$f":"'Wettkampf 1'!B37","v":"Carmen Benten"},{"$f":"'Wettkampf 1'!C37","v":"Ostenwalde II"},307.2,null,307.2,0,0,0,0,0,0,0,0,307.2,1,0,0,{"$nulls":5},{"v":0,"d":"0.0"},0,0,""]
[29,{"$f":"'Wettkampf 1'!B38","v":"Anna -Maria Wimberg"},{"$f":"'Wettkampf 1'!C38","v":"Ostenwalde II"},{"v":0,"d":"0.0"},"x","0",0,0,0,0,0,0,0,0,"0",0,0,0,{"$nulls":5},{"v":0,"d":"0.0"},1,0,""]
[30,{"$f":"'Wettkampf 1'!B39","v":"Evelyn Feder"},{"$f":"'Wettkampf 1'!C39","v":"Ostenwalde II"},{"v":0,"d":"0.0"},"x","0",0,0,0,0,0,0,0,0,"0",0,0,0,{"$nulls":5},{"v":0,"d":"0.0"},1,0,""]
[31,{"$f":"'Wettkampf 1'!B40","v":"Monika Jansen"},{"$f":"'Wettkampf 1'!C40","v":"Spahnharrenstätte I"},308.6,null,308.6,0,0,0,0,0,0,0,0,0,0,308.6,1,{"$nulls":5},{"v":0,"d":"0.0"},0,0,""]
[32,{"$f":"'Wettkampf 1'!B41","v":"Kerstin Sträche"},{"$f":"'Wettkampf 1'!C41","v":"Spahnharrenstätte I"},304.8,null,304.8,0,0,0,0,0,0,0,0,0,0,304.8,1,{"$nulls":5},{"v":0,"d":"0.0"},0,0,""]
[33,{"$f":"'Wettkampf 1'!B42","v":"Rita Hanekamp"},{"$f":"'Wettkampf 1'!C42","v":"Spahnharrenstätte I"},295.2,null,295.2,0,0,0,0,0,0,0,0,0,0,295.2,1,{"$nulls":5},{"v":0,"d":"0.0"},0,0,""]
[34,{"$f":"'Wettkampf 1'!B43","v":"Maria Beusing"},{"$f":"'Wettkampf 1'!C43","v":"Spahnharrenstätte I"},308.6,null,308.6,0,0,0,0,0,0,0,0,0,0,308.6,1,{"$nulls":5},{"v":0,"d":"0.0"},0,0,""]
[35,{"$f":"'Wettkampf 1'!B44","v":"Schütze 35"},{"$f":"'Wettkampf 1'!C44","v":"Spahnharrenstätte I"},null,"x","0",0,0,0,0,0,0,0,0,0,0,"0",0,{"$nulls":5},{"v":0,"d":"0.0"},1,0,""]
[36,{"$f":"'Wettkampf 1'!B45","v":"Schütze 36"},{"$f":"'Wettkampf 1'!C45","v":"Spahnharrenstätte I"},null,"x","0",0,0,0,0,0,0,0,0,0,0,"0",0,{"$nulls":5},{"v":0,"d":"0.0"},1,0,""]
[{"$nulls":6},{"$f":"LARGE(G10:G45,1)+LARGE(G10:G45,2)+LARGE(G10:G45,3)","v":928.8},{"$f":"SUM(H10:H45)","v":4},{"$f":"LARGE(I10:I45,1)+LARGE(I10:I45,2)+LARGE(I10:I45,3)","v":929.3},{"$f":"SUM(J10:J45)","v":4},{"$f":"LARGE(K10:K45,1)+LARGE(K10:K45,2)+LARGE(K10:K45,3)","v":918.3},{"$f":"SUM(L10:L45)","v":4},{"$f":"LARGE(M10:M45,1)+LARGE(M10:M45,2)+LARGE(M10:M45,3)","v":931.5},{"$f":"SUM(N10:N45)","v":4},{"$f":"LARGE(O10:O45,1)+LARGE(O10:O45,2)+LARGE(O10:O45,3)","v":912.4},{"$f":"SUM(P10:P45)","v":4},{"$f":"LARGE(Q10:Q45,1)+LARGE(Q10:Q45,2)+LARGE(Q10:Q45,3)","v":922},{"$f":"SUM(R10:S45)","v":4}]
[null,null,"per Email an: sk-huemmling@gmx.de"]

{"sheet":"11","index":11,"n_rows":47,"n_cols":27,"rows_kept":47,"merged":[[0,22,0,23],[1,22,1,23],[4,22,4,23],[5,22,5,23],[6,22,6,23],[8,20,8,23]]}
[null,"Verein / Gruppe",null,"Ergebnisse",{"$nulls":17},"Austragungsort:",{"$f":"Übersicht!P4","v":"Ostenwalde"}]
[1,{"$f":"'Wettkampf 1'!B2","v":"Börger II"},null,{"$f":"G46","v":{"v":928.6999999999999,"d":"928.7"}},{"$f":"IF(H46>4,\"Es sind zu viele Schützen in Wertung!\",\" \")","v":" "},{"$nulls":16},"Wettkampftag:",{"$f":"Übersicht!P3","v":"09.03."}]
[2,{"$f":"'Wettkampf 1'!B3","v":"Neuvrees II"},null,{"$f":"I46","v":913.5},{"$f":"IF(J46>4,\"Es sind zu viele Schützen in Wertung!\",\" \")","v":" "}]
[3,{"$f":"'Wettkampf 1'!B4","v":"Börgermoor I"},null,{"$f":"K46","v":{"v":916.8000000000001,"d":"916.8"}},{"$f":"IF(L46>4,\"Es sind zu viele Schützen in Wertung!\",\" \")","v":" "},{"$nulls":18},"Ansprechpartner für Rückfragen:"]
[4,{"$f":"'Wettkampf 1'!B5","v":"Lorup III"},null,{"$f":"M46","v":923.7},{"$f":"IF(N46>4,\"Es sind zu viele Schützen in Wertung!\",\" \")","v":" "},{"$nulls":16},"Name:","Carmen Benten"]
[5,{"$f":"'Wettkampf 1'!B6","v":"Ostenwalde II"},null,{"$f":"O46","v":{"v":917,"d":"917.0"}},{"$f":"IF(P46>4,\"Es sind zu viele Schützen in Wertung!\",\" \")","v":" "},{"$nulls":16},"Tel:","0176-56776324"]
[6,{"$f":"'Wettkampf 1'!B7","v":"Spahnharrenstätte I"},null,{"$f":"Q46","v":924.2},{"$f":"IF(R46>4,\"Es sind zu viele Schützen in Wertung!\",\" \")","v":" "},{"$nulls":16},"Standaufsicht:","C. Benten / M. Brinkmann"]
[]
[null,"Einzelergebnisse:","Verein / Gruppe","Ergebnisse (mindestens 0 eintragen)","AW? Dann x eintippen",null,"Verein 1",null,"Verein 2",null,"Verein 3",null,"Verein 4",null,"Verein 5",null,"Verein 6",{"$nulls":3},"Proberechnung bei Streifen:"]
[1,{"$f":"'Wettkampf 1'!B10","v":"Gertrud Kuchta"},{"$f":"'Wettkampf 1'!C10","v":"Börger II"},304.8,"x",{"$f":"IF(E10=\"x\",\"0\",D10)","v":"0"},{"$f":"IF(C10=$B$2,F10,0)","v":"0"},{"$f":"(IF(AND($E10=\"\",$C10=$B$2),1,0))","v":0},{"$f":"IF($C10=$B$3,F10,0)","v":0},{"$f":"(IF(AND($E10=\"\",$C10=$B$3),1,0))","v":0},{"$f":"IF($C10=$B$4,F10,0)","v":0},{"$f":"(IF(AND($E10=\"\",$C10=$B$4),1,0))","v":0},{"$f":"IF($C10=$B$5,F10,0)","v":0},{"$f":"(IF(AND($E10=\"\",$C10=$B$5),1,0))","v":0},{"$f":"IF($C10=$B$6,F10,0)","v":0},{"$f":"(IF(AND($E10=\"\",$C10=$B$6),1,0))","v":0},{"$f":"IF($C10=$B$7,F10,0)","v":0},{"$f":"(IF(AND($E10=\"\",$C10=$B$7),1,0))","v":0},{"$nulls":5},{"$f":"U10+V10+W10","v":{"v":0,"d":"0.0"}},{"$f":"IF(X10=D10,1,0)","v":0},{"$f":"IF(X10=0,0,1)","v":0},{"$f":"IF(Y10+Z10=2,\"Korrekt\",\"\")","v":""}]
[2,{"$f":"'Wettkampf 1'!B11","v":"Sarah Breer"},{"$f":"'Wettkampf 1'!C11","v":"Börger II"},null,"x",{"$f":"IF(E11=\"x\",\"0\",D11)","v":"0"},{"$f":"IF(C11=$B$2,F11,0)","v":"0"},{"$f":"(IF(AND($E11=\"\",$C11=$B$2),1,0))","v":0},{"$f":"IF($C11=$B$3,F11,0)","v":0},{"$f":"(IF(AND($E11=\"\",$C11=$B$3),1,0))","v":0},{"$f":"IF($C11=$B$4,F11,0)","v":0},{"$f":"(IF(AND($E11=\"\",$C11=$B$4),1,0))","v":0},{"$f":"IF($C11=$B$5,F11,0)","v":0},{"$f":"(IF(AND($E11=\"\",$C11=$B$5),1,0))","v":0},{"$f":"IF($C11=$B$6,F11,0)","v":0},{"$f":"(IF(AND($E11=\"\",$C11=$B$6),1,0))","v":0},{"$f":"IF($C11=$B$7,F11,0)","v":0},{"$f":"(IF(AND($E11=\"\",$C11=$B$7),1,0))","v":0},{"$nulls":5},{"$f":"U11+V11+W11","v":{"v":0,"d":"0.0"}},{"$f":"IF(X11=D11,1,0)","v":1},{"$f":"IF(X11=0,0,1)","v":0},{"$f":"IF(Y11+Z11=2,\"Korrekt\",\"\")","v":""}]
[3,{"$f":"'Wettkampf 1'!B12","v":"Margret Pohlgeers"},{"$f":"'Wettkampf 1'!C12","v":"Börger II"},308.5,null,308.5,308.5,1,0,0,0,0,0,0,0,0,0,0,{"$nulls":5},{"v":0,"d":"0.0"},0,0,""]
[4,{"$f":"'Wettkampf 1'!B13","v":"Gundula Schwarte"},{"$f":"'Wettkampf 1'!C13","v":"Börger II"},307.9,null,307.9,307.9,1,0,0,0,0,0,0,0,0,0,0,{"$nulls":5},{"v":0,"d":"0.0"},0,0,""]
[5,{"$f":"'Wettkampf 1'!B14","v":"Annette Schwarte"},{"$f":"'Wettkampf 1'!C14","v":"Börger II"},290.6,null,290.6,290.6,1,0,0,0,0,0,0,0,0,0,0,{"$nulls":5},{"v":0,"d":"0.0"},0,0,""]
[6,{"$f":"'Wettkampf 1'!B15","v":"Petra Dödtmann"},{"$f":"'Wettkampf 1'!C15","v":"Börger II"},312.3,null,312.3,312.3,1,0,0,0,0,0,0,0,0,0,0,{"$nulls":5},{"v":0,"d":"0.0"},0,0,""]
[7,{"$f":"'Wettkampf 1'!B16","v":"Sarah Deyen"},{"$f":"'Wettkampf 1'!C16","v":"Neuvrees II"},304.4,null,304.4,0,0,304.4,1,0,0,0,0,0,0,0,0,{"$nulls":5},{"v":0,"d":"0.0"},0,0,""]
[8,{"$f":"'Wettkampf 1'!B17","v":"Silvia Thunert"},{"$f":"'Wettkampf 1'!C17","v":"Neuvrees II"},304.8,null,304.8,0,0,304.8,1,0,0,0,0,0,0,0,0,{"$nulls":5},{"v":0,"d":"0.0"},0,0,""]
[9,{"$f":"'Wettkampf 1'!B18","v":"Margret Pohlmann"},{"$f":"'Wettkampf 1'!C18","v":"Neuvrees II"},304.3,null,304.3,0,0,304.3,1,0,0,0,0,0,0,0,0,{"$nulls":5},{"v":0,"d":"0.0"},0,0,""]
[10,{"$f":"'Wettkampf 1'!B19","v":"Harma Steenken"},{"$f":"'Wettkampf 1'!C19","v":"Neuvrees II"},null,"x","0",0,0,"0",0,0,0,0,0,0,0,0,0,{"$nulls":5},{"v":0,"d":"0.0"},1,0,""]
[11,{"$f":"'Wettkampf 1'!B20","v":"Claudia Rolfes"},{"$f":"'Wettkampf 1'!C20","v":"Neuvrees II"},303.7,null,303.7,0,0,303.7,1,0,0,0,0,0,0,0,0,{"$nulls":5},{"v":0,"d":"0.0"},0,0,""]
[12,{"$f":"'Wettkampf 1'!B21","v":"Silvia Junge"},{"$f":"'Wettkampf 1'!C21","v":"Neuvrees II"},301.9,"x","0",0,0,"0",0,0,0,0,0,0,0,0,0,{"$nulls":5},{"v":0,"d":"0.0"},0,0,""]
[13,{"$f":"'Wettkampf 1'!B22","v":"Ulla Schnieders"},{"$f":"'Wettkampf 1'!C22","v":"Börgermoor I"},{"v":310,"d":"310.0"},null,{"v":310,"d":"310.0"},0,0,0,0,310,1,0,0,0,0,0,0,{"$nulls":5},{"v":0,"d":"0.0"},0,0,""]
[14,{"$f":"'Wettkampf 1'!B23","v":"Jasmin Kramer"},{"$f":"'Wettkampf 1'!C23","v":"Börgermoor I"},null,null,{"v":0,"d":"0.0"},0,0,0,0,0,1,0,0,0,0,0,0,{"$nulls":5},{"v":0,"d":"0.0"},1,0,""]
[15,{"$f":"'Wettkampf 1'!B24","v":"Anni Küwen"},{"$f":"'Wettkampf 1'!C24","v":"Börgermoor I"},297.6,null,297.6,0,0,0,0,297.6,1,0,0,0,0,0,0,{"$nulls":5},{"v":0,"d":"0.0"},0,0,""]
[16,{"$f":"'Wettkampf 1'!B25","v":"Waltraud Dobelmann"},{"$f":"'Wettkampf 1'!C25","v":"Börgermoor I"},309.2,null,309.2,0,0,0,0,309.2,1,0,0,0,0,0,0,{"$nulls":5},{"v":0,"d":"0.0"},0,0,""]
[17,{"$f":"'Wettkampf 1'!B26","v":"Schütze 17"},{"$f":"'Wettkampf 1'!C26","v":"Börgermoor I"},null,"x","0",0,0,0,0,"0",0,0,0,0,0,0,0,{"$nulls":5},{"v":0,"d":"0.0"},1,0,""]
[18,{"$f":"'Wettkampf 1'!B27","v":"Schütze 18"},{"$f":"'Wettkampf 1'!C27","v":"Börgermoor I"},null,"x","0",0,0,0,0,"0",0,0,0,0,0,0,0,{"$nulls":5},{"v":0,"d":"0.0"},1,0,""]
[19,{"$f":"'Wettkampf 1'!B28","v":"Hanna Gebken"},{"$f":"'Wettkampf 1'!C28","v":"Lorup III"},305.1,null,305.1,0,0,0,0,0,0,305.1,1,0,0,0,0,{"$nulls":5},{"v":0,"d":"0.0"},0,0,""]
[20,{"$f":"'Wettkampf 1'!B29","v":"Monika Reimann"},{"$f":"'Wettkampf 1'!C29","v":"Lorup III"},304.8,null,304.8,0,0,0,0,0,0,304.8,1,0,0,0,0,{"$nulls":5},{"v":0,"d":"0.0"},0,0,""]
[21,{"$f":"'Wettkampf 1'!B30","v":"Marina Schrand"},{"$f":"'Wettkampf 1'!C30","v":"Lorup III"},308.8,null,308.8,0,0,0,0,0,0,308.8,1,0,0,0,0,{"$nulls":5},{"v":0,"d":"0.0"},0,0,""]
[22,{"$f":"'Wettkampf 1'!B31","v":"Nadine Krömer"},{"$f":"'Wettkampf 1'!C31","v":"Lorup III"},309.8,null,309.8,0,0,0,0,0,0,309.8,1,0,0,0,0,{"$nulls":5},{"v":0,"d":"0.0"},0,0,""]
[23,{"$f":"'Wettkampf 1'!B32","v":"Nina Krömer"},{"$f":"'Wettkampf 1'!C32","v":"Lorup III"},291.6,"x","0",0,0,0,0,0,0,"0",0,0,0,0,0,{"$nulls":5},{"v":0,"d":"0.0"},0,0,""]
[24,{"$f":"'Wettkampf 1'!B33","v":"Margret Büter"},{"$f":"'Wettkampf 1'!C33","v":"Lorup III"},null,"x","0",0,0,0,0,0,0,"0",0,0,0,0,0,{"$nulls":5},{"v":0,"d":"0.0"},1,0,""]
[25,{"$f":"'Wettkampf 1'!B34","v":"Sarah Meiners"},{"$f":"'Wettkampf 1'!C34","v":"Ostenwalde II"},null,"x","0",0,0,0,0,0,0,0,0,"0",0,0,0,{"$nulls":5},{"v":0,"d":"0.0"},1,0,""]
[26,{"$f":"'Wettkampf 1'!B35","v":"Anna Temmen"},{"$f":"'Wettkampf 1'!C35","v":"Ostenwalde II"},312.2,null,312.2,0,0,0,0,0,0,0,0,312.2,1,0,0,{"$nulls":5},{"v":0,"d":"0.0"},0,0,""]
[27,{"$f":"'Wettkampf 1'!B36","v":"Helga Meiners"},{"$f":"'Wettkampf 1'!C36","v":"Ostenwalde II"},null,"x","0",0,0,0,0,0,0,0,0,"0",0,0,0,{"$nulls":5},{"v":0,"d":"0.0"},1,0,""]
[28,{"$f":"'Wettkampf 1'!B37","v":"Carmen Benten"},{"$f":"'Wettkampf 1'!C37","v":"Ostenwalde II"},{"v":308,"d":"308.0"},null,{"v":308,"d":"308.0"},0,0,0,0,0,0,0,0,308,1,0,0,{"$nulls":5},{"v":0,"d":"0.0"},0,0,""]
[29,{"$f":"'Wettkampf 1'!B38","v":"Anna -Maria Wimberg"},{"$f":"'Wettkampf 1'!C38","v":"Ostenwalde II"},296.8,null,296.8,0,0,0,0,0,0,0,0,296.8,1,0,0,{"$nulls":5},{"v":0,"d":"0.0"},0,0,""]
[30,{"$f":"'Wettkampf 1'!B39","v":"Evelyn Feder"},{"$f":"'Wettkampf 1'!C39","v":"Ostenwalde II"},null,"x","0",0,0,0,0,0,0,0,0,"0",0,0,0,{"$nulls":5},{"v":0,"d":"0.0"},1,0,""]
[31,{"$f":"'Wettkampf 1'!B40","v":"Monika Jansen"},{"$f":"'Wettkampf 1'!C40","v":"Spahnharrenstätte I"},309.9,null,309.9,0,0,0,0,0,0,0,0,0,0,309.9,1,{"$nulls":5},{"v":0,"d":"0.0"},0,0,""]
[32,{"$f":"'Wettkampf 1'!B41","v":"Kerstin Sträche"},{"$f":"'Wettkampf 1'!C41","v":"Spahnharrenstätte I"},307.3,null,307.3,0,0,0,0,0,0,0,0,0,0,307.3,1,{"$nulls":5},{"v":0,"d":"0.0"},0,0,""]
[33,{"$f":"'Wettkampf 1'!B42","v":"Rita Hanekamp"},{"$f":"'Wettkampf 1'!C42","v":"Spahnharrenstätte I"},291.8,null,291.8,0,0,0,0,0,0,0,0,0,0,291.8,1,{"$nulls":5},{"v":0,"d":"0.0"},0,0,""]
[34,{"$f":"'Wettkampf 1'!B43","v":"Maria Beusing"},{"$f":"'Wettkampf 1'!C43","v":"Spahnharrenstätte I"},{"v":307,"d":"307.0"},null,{"v":307,"d":"307.0"},0,0,0,0,0,0,0,0,0,0,307,1,{"$nulls":5},{"v":0,"d":"0.0"},0,0,""]
[35,{"$f":"'Wettkampf 1'!B44","v":"Schütze 35"},{"$f":"'Wettkampf 1'!C44","v":"Spahnharrenstätte I"},null,"x","0",0,0,0,0,0,0,0,0,0,0,"0",0,{"$nulls":5},{"v":0,"d":"0.0"},1,0,""]
[36,{"$f":"'Wettkampf 1'!B45","v":"Schütze 36"},{"$f":"'Wettkampf 1'!C45","v":"Spahnharrenstätte I"},null,"x","0",0,0,0,0,0,0,0,0,0,0,"0",0,{"$nulls":5},{"v":0,"d":"0.0"},1,0,""]
[{"$nulls":6},{"$f":"LARGE(G10:G45,1)+LARGE(G10:G45,2)+LARGE(G10:G45,3)","v":928.6999999999999},{"$f":"SUM(H10:H45)","v":4},{"$f":"LARGE(I10:I45,1)+LARGE(I10:I45,2)+LARGE(I10:I45,3)","v":913.5},{"$f":"SUM(J10:J45)","v":4},{"$f":"LARGE(K10:K45,1)+LARGE(K10:K45,2)+LARGE(K10:K45,3)","v":916.8000000000001},{"$f":"SUM(L10:L45)","v":4},{"$f":"LARGE(M10:M45,1)+LARGE(M10:M45,2)+LARGE(M10:M45,3)","v":923.7},{"$f":"SUM(N10:N45)","v":4},{"$f":"LARGE(O10:O45,1)+LARGE(O10:O45,2)+LARGE(O10:O45,3)","v":917},{"$f":"SUM(P10:P45)","v":3},{"$f":"LARGE(Q10:Q45,1)+LARGE(Q10:Q45,2)+LARGE(Q10:Q45,3)","v":924.2},{"$f":"SUM(R10:S45)","v":4}]
[null,null,"per Email an: sk-huemmling@gmx.de"]

{"sheet":"12","index":12,"n_rows":47,"n_cols":27,"rows_kept":47,"merged":[[0,22,0,23],[1,22,1,23],[4,22,4,23],[5,22,5,23],[6,22,6,23],[8,20,8,23]]}
[null,"Verein / Gruppe",null,"Ergebnisse",{"$nulls":17},"Austragungsort:",{"$f":"Übersicht!Q4","v":"Spahnharrenstätte"}]
[1,{"$f":"'Wettkampf 1'!B2","v":"Börger II"},null,{"$f":"G46","v":{"v":0,"d":"0.0"}},{"$f":"IF(H46>4,\"Es sind zu viele Schützen in Wertung!\",\" \")","v":"Es sind zu viele Schützen in Wertung!"},{"$nulls":16},"Wettkampftag:",{"$f":"Übersicht!Q3","v":"23.03."}]
[2,{"$f":"'Wettkampf 1'!B3","v":"Neuvrees II"},null,{"$f":"I46","v":{"v":0,"d":"0.0"}},{"$f":"IF(J46>4,\"Es sind zu viele Schützen in Wertung!\",\" \")","v":"Es sind zu viele Schützen in Wertung!"}]
[3,{"$f":"'Wettkampf 1'!B4","v":"Börgermoor I"},null,{"$f":"K46","v":{"v":0,"d":"0.0"}},{"$f":"IF(L46>4,\"Es sind zu viele Schützen in Wertung!\",\" \")","v":"Es sind zu viele Schützen in Wertung!"},{"$nulls":18},"Ansprechpartner für Rückfragen:"]
[4,{"$f":"'Wettkampf 1'!B5","v":"Lorup III"},null,{"$f":"M46","v":{"v":0,"d":"0.0"}},{"$f":"IF(N46>4,\"Es sind zu viele Schützen in Wertung!\",\" \")","v":"Es sind zu viele Schützen in Wertung!"},{"$nulls":16},"Name:"]
[5,{"$f":"'Wettkampf 1'!B6","v":"Ostenwalde II"},null,{"$f":"O46","v":{"v":0,"d":"0.0"}},{"$f":"IF(P46>4,\"Es sind zu viele Schützen in Wertung!\",\" \")","v":"Es sind zu viele Schützen in Wertung!"},{"$nulls":16},"Tel:"]
[6,{"$f":"'Wettkampf 1'!B7","v":"Spahnharrenstätte I"},null,{"$f":"Q46","v":{"v":0,"d":"0.0"}},{"$f":"IF(R46>4,\"Es sind zu viele Schützen in Wertung!\",\" \")","v":"Es sind zu viele Schützen in Wertung!"},{"$nulls":16},"Standaufsicht:","eintragen"]
[]
[null,"Einzelergebnisse:","Verein / Gruppe","Ergebnisse (mindestens 0 eintragen)","AW? Dann x eintippen",null,"Verein 1",null,"Verein 2",null,"Verein 3",null,"Verein 4",null,"Verein 5",null,"Verein 6",{"$nulls":3},"Proberechnung bei Streifen:"]
[1,{"$f":"'Wettkampf 1'!B10","v":"Gertrud Kuchta"},{"$f":"'Wettkampf 1'!C10","v":"Börger II"},null,null,{"$f":"IF(E10=\"x\",\"0\",D10)","v":{"v":0,"d":"0.0"}},{"$f":"IF(C10=$B$2,F10,0)","v":0},{"$f":"(IF(AND($E10=\"\",$C10=$B$2),1,0))","v":1},{"$f":"IF($C10=$B$3,F10,0)","v":0},{"$f":"(IF(AND($E10=\"\",$C10=$B$3),1,0))","v":0},{"$f":"IF($C10=$B$4,F10,0)","v":0},{"$f":"(IF(AND($E10=\"\",$C10=$B$4),1,0))","v":0},{"$f":"IF($C10=$B$5,F10,0)","v":0},{"$f":"(IF(AND($E10=\"\",$C10=$B$5),1,0))","v":0},{"$f":"IF($C10=$B$6,F10,0)","v":0},{"$f":"(IF(AND($E10=\"\",$C10=$B$6),1,0))","v":0},{"$f":"IF($C10=$B$7,F10,0)","v":0},{"$f":"(IF(AND($E10=\"\",$C10=$B$7),1,0))","v":0},{"$nulls":5},{"$f":"U10+V10+W10","v":{"v":0,"d":"0.0"}},{"$f":"IF(X10=D10,1,0)","v":1},{"$f":"IF(X10=0,0,1)","v":0},{"$f":"IF(Y10+Z10=2,\"Korrekt\",\"\")","v":""}]
[2,{"$f":"'Wettkampf 1'!B11","v":"Sarah Breer"},{"$f":"'Wettkampf 1'!C11","v":"Börger II"},null,null,{"$f":"IF(E11=\"x\",\"0\",D11)","v":{"v":0,"d":"0.0"}},{"$f":"IF(C11=$B$2,F11,0)","v":0},{"$f":"(IF(AND($E11=\"\",$C11=$B$2),1,0))","v":1},{"$f":"IF($C11=$B$3,F11,0)","v":0},{"$f":"(IF(AND($E11=\"\",$C11=$B$3),1,0))","v":0},{"$f":"IF($C11=$B$4,F11,0)","v":0},{"$f":"(IF(AND($E11=\"\",$C11=$B$4),1,0))","v":0},{"$f":"IF($C11=$B$5,F11,0)","v":0},{"$f":"(IF(AND($E11=\"\",$C11=$B$5),1,0))","v":0},{"$f":"IF($C11=$B$6,F11,0)","v":0},{"$f":"(IF(AND($E11=\"\",$C11=$B$6),1,0))","v":0},{"$f":"IF($C11=$B$7,F11,0)","v":0},{"$f":"(IF(AND($E11=\"\",$C11=$B$7),1,0))","v":0},{"$nulls":5},{"$f":"U11+V11+W11","v":{"v":0,"d":"0.0"}},{"$f":"IF(X11=D11,1,0)","v":1},{"$f":"IF(X11=0,0,1)","v":0},{"$f":"IF(Y11+Z11=2,\"Korrekt\",\"\")","v":""}]
[3,{"$f":"'Wettkampf 1'!B12","v":"Margret Pohlgeers"},{"$f":"'Wettkampf 1'!C12","v":"Börger II"},null,null,{"v":0,"d":"0.0"},0,1,0,0,0,0,0,0,0,0,0,0,{"$nulls":5},{"v":0,"d":"0.0"},1,0,""]
[4,{"$f":"'Wettkampf 1'!B13","v":"Gundula Schwarte"},{"$f":"'Wettkampf 1'!C13","v":"Börger II"},null,null,{"v":0,"d":"0.0"},0,1,0,0,0,0,0,0,0,0,0,0,{"$nulls":5},{"v":0,"d":"0.0"},1,0,""]
[5,{"$f":"'Wettkampf 1'!B14","v":"Annette Schwarte"},{"$f":"'Wettkampf 1'!C14","v":"Börger II"},null,null,{"v":0,"d":"0.0"},0,1,0,0,0,0,0,0,0,0,0,0,{"$nulls":5},{"v":0,"d":"0.0"},1,0,""]
[6,{"$f":"'Wettkampf 1'!B15","v":"Petra Dödtmann"},{"$f":"'Wettkampf 1'!C15","v":"Börger II"},null,null,{"v":0,"d":"0.0"},0,1,0,0,0,0,0,0,0,0,0,0,{"$nulls":5},{"v":0,"d":"0.0"},1,0,""]
[7,{"$f":"'Wettkampf 1'!B16","v":"Sarah Deyen"},{"$f":"'Wettkampf 1'!C16","v":"Neuvrees II"},null,null,{"v":0,"d":"0.0"},0,0,0,1,0,0,0,0,0,0,0,0,{"$nulls":5},{"v":0,"d":"0.0"},1,0,""]
[8,{"$f":"'Wettkampf 1'!B17","v":"Silvia Thunert"},{"$f":"'Wettkampf 1'!C17","v":"Neuvrees II"},null,null,{"v":0,"d":"0.0"},0,0,0,1,0,0,0,0,0,0,0,0,{"$nulls":5},{"v":0,"d":"0.0"},1,0,""]
[9,{"$f":"'Wettkampf 1'!B18","v":"Margret Pohlmann"},{"$f":"'Wettkampf 1'!C18","v":"Neuvrees II"},null,null,{"v":0,"d":"0.0"},0,0,0,1,0,0,0,0,0,0,0,0,{"$nulls":5},{"v":0,"d":"0.0"},1,0,""]
[10,{"$f":"'Wettkampf 1'!B19","v":"Harma Steenken"},{"$f":"'Wettkampf 1'!C19","v":"Neuvrees II"},null,null,{"v":0,"d":"0.0"},0,0,0,1,0,0,0,0,0,0,0,0,{"$nulls":5},{"v":0,"d":"0.0"},1,0,""]
[11,{"$f":"'Wettkampf 1'!B20","v":"Claudia Rolfes"},{"$f":"'Wettkampf 1'!C20","v":"Neuvrees II"},null,null,{"v":0,"d":"0.0"},0,0,0,1,0,0,0,0,0,0,0,0,{"$nulls":5},{"v":0,"d":"0.0"},1,0,""]
[12,{"$f":"'Wettkampf 1'!B21","v":"Silvia Junge"},{"$f":"'Wettkampf 1'!C21","v":"Neuvrees II"},null,null,{"v":0,"d":"0.0"},0,0,0,1,0,0,0,0,0,0,0,0,{"$nulls":5},{"v":0,"d":"0.0"},1,0,""]
[13,{"$f":"'Wettkampf 1'!B22","v":"Ulla Schnieders"},{"$f":"'Wettkampf 1'!C22","v":"Börgermoor I"},null,null,{"v":0,"d":"0.0"},0,0,0,0,0,1,0,0,0,0,0,0,{"$nulls":5},{"v":0,"d":"0.0"},1,0,""]
[14,{"$f":"'Wettkampf 1'!B23","v":"Jasmin Kramer"},{"$f":"'Wettkampf 1'!C23","v":"Börgermoor I"},null,null,{"v":0,"d":"0.0"},0,0,0,0,0,1,0,0,0,0,0,0,{"$nulls":5},{"v":0,"d":"0.0"},1,0,""]
[15,{"$f":"'Wettkampf 1'!B24","v":"Anni Küwen"},{"$f":"'Wettkampf 1'!C24","v":"Börgermoor I"},null,null,{"v":0,"d":"0.0"},0,0,0,0,0,1,0,0,0,0,0,0,{"$nulls":5},{"v":0,"d":"0.0"},1,0,""]
[16,{"$f":"'Wettkampf 1'!B25","v":"Waltraud Dobelmann"},{"$f":"'Wettkampf 1'!C25","v":"Börgermoor I"},null,null,{"v":0,"d":"0.0"},0,0,0,0,0,1,0,0,0,0,0,0,{"$nulls":5},{"v":0,"d":"0.0"},1,0,""]
[17,{"$f":"'Wettkampf 1'!B26","v":"Schütze 17"},{"$f":"'Wettkampf 1'!C26","v":"Börgermoor I"},null,null,{"v":0,"d":"0.0"},0,0,0,0,0,1,0,0,0,0,0,0,{"$nulls":5},{"v":0,"d":"0.0"},1,0,""]
[18,{"$f":"'Wettkampf 1'!B27","v":"Schütze 18"},{"$f":"'Wettkampf 1'!C27","v":"Börgermoor I"},null,null,{"v":0,"d":"0.0"},0,0,0,0,0,1,0,0,0,0,0,0,{"$nulls":5},{"v":0,"d":"0.0"},1,0,""]
[19,{"$f":"'Wettkampf 1'!B28","v":"Hanna Gebken"},{"$f":"'Wettkampf 1'!C28","v":"Lorup III"},null,null,{"v":0,"d":"0.0"},0,0,0,0,0,0,0,1,0,0,0,0,{"$nulls":5},{"v":0,"d":"0.0"},1,0,""]
[20,{"$f":"'Wettkampf 1'!B29","v":"Monika Reimann"},{"$f":"'Wettkampf 1'!C29","v":"Lorup III"},null,null,{"v":0,"d":"0.0"},0,0,0,0,0,0,0,1,0,0,0,0,{"$nulls":5},{"v":0,"d":"0.0"},1,0,""]
[21,{"$f":"'Wettkampf 1'!B30","v":"Marina Schrand"},{"$f":"'Wettkampf 1'!C30","v":"Lorup III"},null,null,{"v":0,"d":"0.0"},0,0,0,0,0,0,0,1,0,0,0,0,{"$nulls":5},{"v":0,"d":"0.0"},1,0,""]
[22,{"$f":"'Wettkampf 1'!B31","v":"Nadine Krömer"},{"$f":"'Wettkampf 1'!C31","v":"Lorup III"},null,null,{"v":0,"d":"0.0"},0,0,0,0,0,0,0,1,0,0,0,0,{"$nulls":5},{"v":0,"d":"0.0"},1,0,""]
[23,{"$f":"'Wettkampf 1'!B32","v":"Nina Krömer"},{"$f":"'Wettkampf 1'!C32","v":"Lorup III"},null,null,{"v":0,"d":"0.0"},0,0,0,0,0,0,0,1,0,0,0,0,{"$nulls":5},{"v":0,"d":"0.0"},1,0,""]
[24,{"$f":"'Wettkampf 1'!B33","v":"Margret Büter"},{"$f":"'Wettkampf 1'!C33","v":"Lorup III"},null,null,{"v":0,"d":"0.0"},0,0,0,0,0,0,0,1,0,0,0,0,{"$nulls":5},{"v":0,"d":"0.0"},1,0,""]
[25,{"$f":"'Wettkampf 1'!B34","v":"Sarah Meiners"},{"$f":"'Wettkampf 1'!C34","v":"Ostenwalde II"},null,null,{"v":0,"d":"0.0"},0,0,0,0,0,0,0,0,0,1,0,0,{"$nulls":5},{"v":0,"d":"0.0"},1,0,""]
[26,{"$f":"'Wettkampf 1'!B35","v":"Anna Temmen"},{"$f":"'Wettkampf 1'!C35","v":"Ostenwalde II"},null,null,{"v":0,"d":"0.0"},0,0,0,0,0,0,0,0,0,1,0,0,{"$nulls":5},{"v":0,"d":"0.0"},1,0,""]
[27,{"$f":"'Wettkampf 1'!B36","v":"Helga Meiners"},{"$f":"'Wettkampf 1'!C36","v":"Ostenwalde II"},null,null,{"v":0,"d":"0.0"},0,0,0,0,0,0,0,0,0,1,0,0,{"$nulls":5},{"v":0,"d":"0.0"},1,0,""]
[28,{"$f":"'Wettkampf 1'!B37","v":"Carmen Benten"},{"$f":"'Wettkampf 1'!C37","v":"Ostenwalde II"},null,null,{"v":0,"d":"0.0"},0,0,0,0,0,0,0,0,0,1,0,0,{"$nulls":5},{"v":0,"d":"0.0"},1,0,""]
[29,{"$f":"'Wettkampf 1'!B38","v":"Anna -Maria Wimberg"},{"$f":"'Wettkampf 1'!C38","v":"Ostenwalde II"},null,null,{"v":0,"d":"0.0"},0,0,0,0,0,0,0,0,0,1,0,0,{"$nulls":5},{"v":0,"d":"0.0"},1,0,""]
[30,{"$f":"'Wettkampf 1'!B39","v":"Evelyn Feder"},{"$f":"'Wettkampf 1'!C39","v":"Ostenwalde II"},null,null,{"v":0,"d":"0.0"},0,0,0,0,0,0,0,0,0,1,0,0,{"$nulls":5},{"v":0,"d":"0.0"},1,0,""]
[31,{"$f":"'Wettkampf 1'!B40","v":"Monika Jansen"},{"$f":"'Wettkampf 1'!C40","v":"Spahnharrenstätte I"},null,null,{"v":0,"d":"0.0"},0,0,0,0,0,0,0,0,0,0,0,1,{"$nulls":5},{"v":0,"d":"0.0"},1,0,""]
[32,{"$f":"'Wettkampf 1'!B41","v":"Kerstin Sträche"},{"$f":"'Wettkampf 1'!C41","v":"Spahnharrenstätte I"},null,null,{"v":0,"d":"0.0"},0,0,0,0,0,0,0,0,0,0,0,1,{"$nulls":5},{"v":0,"d":"0.0"},1,0,""]
[33,{"$f":"'Wettkampf 1'!B42","v":"Rita Hanekamp"},{"$f":"'Wettkampf 1'!C42","v":"Spahnharrenstätte I"},null,null,{"v":0,"d":"0.0"},0,0,0,0,0,0,0,0,0,0,0,1,{"$nulls":5},{"v":0,"d":"0.0"},1,0,""]
[34,{"$f":"'Wettkampf 1'!B43","v":"Maria Beusing"},{"$f":"'Wettkampf 1'!C43","v":"Spahnharrenstätte I"},null,null,{"v":0,"d":"0.0"},0,0,0,0,0,0,0,0,0,0,0,1,{"$nulls":5},{"v":0,"d":"0.0"},1,0,""]
[35,{"$f":"'Wettkampf 1'!B44","v":"Schütze 35"},{"$f":"'Wettkampf 1'!C44","v":"Spahnharrenstätte I"},null,null,{"v":0,"d":"0.0"},0,0,0,0,0,0,0,0,0,0,0,1,{"$nulls":5},{"v":0,"d":"0.0"},1,0,""]
[36,{"$f":"'Wettkampf 1'!B45","v":"Schütze 36"},{"$f":"'Wettkampf 1'!C45","v":"Spahnharrenstätte I"},null,null,{"v":0,"d":"0.0"},0,0,0,0,0,0,0,0,0,0,0,1,{"$nulls":5},{"v":0,"d":"0.0"},1,0,""]
[{"$nulls":6},{"$f":"LARGE(G10:G45,1)+LARGE(G10:G45,2)+LARGE(G10:G45,3)","v":0},{"$f":"SUM(H10:H45)","v":6},{"$f":"LARGE(I10:I45,1)+LARGE(I10:I45,2)+LARGE(I10:I45,3)","v":0},{"$f":"SUM(J10:J45)","v":6},{"$f":"LARGE(K10:K45,1)+LARGE(K10:K45,2)+LARGE(K10:K45,3)","v":0},{"$f":"SUM(L10:L45)","v":6},{"$f":"LARGE(M10:M45,1)+LARGE(M10:M45,2)+LARGE(M10:M45,3)","v":0},{"$f":"SUM(N10:N45)","v":6},{"$f":"LARGE(O10:O45,1)+LARGE(O10:O45,2)+LARGE(O10:O45,3)","v":0},{"$f":"SUM(P10:P45)","v":6},{"$f":"LARGE(Q10:Q45,1)+LARGE(Q10:Q45,2)+LARGE(Q10:Q45,3)","v":0},{"$f":"SUM(R10:S45)","v":6}]
[null,null,"per Email an: sk-huemmling@gmx.de"]

{"sheet":"Ausdruck","index":13,"n_rows":48,"n_cols":29,"rows_kept":48,"merged":[[0,3,0,19],[0,24,0,25],[1,3,1,19],[1,24,1,25],[2,3,2,19],[3,3,3,19],[4,24,4,25],[5,24,5,25],[6,24,6,25],[8,22,8,25]]}
[null,"Verein / Gruppe","Ergebnisse",{"$f":"Übersicht!K1","v":"2024/2025"},{"$nulls":19},"Austragungsort:"]
[1,{"$f":"'Wettkampf 1'!B2","v":"Börger II"},null,"Klasse:",{"$nulls":19},"Wettkampftag:"]
[2,{"$f":"'Wettkampf 1'!B3","v":"Neuvrees II"},null,{"$f":"Übersicht!M1","v":"3. Kreisklasse"}]
[3,{"$f":"'Wettkampf 1'!B4","v":"Börgermoor I"},null,{"$f":"Übersicht!P1","v":"Damen"},{"$nulls":21},"Ansprechpartner für Rückfragen:"]
[4,{"$f":"'Wettkampf 1'!B5","v":"Lorup III"},{"$nulls":21},"Name:"]
[5,{"$f":"'Wettkampf 1'!B6","v":"Ostenwalde II"},{"$nulls":21},"Tel:"]
[6,{"$f":"'Wettkampf 1'!B7","v":"Spahnharrenstätte I"},{"$nulls":21},"Standaufsicht:"]
[]
[null,"Name Schütze","Verein/Gruppe","Ergebnis","AW? ",null,"Verein 1",null,"Verein 2",null,"Verein 3",null,"Verein 4",null,"Verein 5",null,"Verein 6",{"$nulls":3},"Geburts-datum",null,"Proberechnung bei Streifen:"]
[1,{"$f":"'Wettkampf 1'!B10","v":"Gertrud Kuchta"},{"$f":"'Wettkampf 1'!C10","v":"Börger II"},null,null,{"$f":"IF(E10=\"x\",\"0\",D10)","v":0},{"$f":"IF(C10=$B$2,F10,0)","v":0},{"$f":"(IF(AND($E10=\"\",$C10=$B$2),1,0))","v":1},{"$f":"IF($C10=$B$3,F10,0)","v":0},{"$f":"(IF(AND($E10=\"\",$C10=$B$3),1,0))","v":0},{"$f":"IF($C10=$B$4,F10,0)","v":0},{"$f":"(IF(AND($E10=\"\",$C10=$B$4),1,0))","v":0},{"$f":"IF($C10=$B$5,F10,0)","v":0},{"$f":"(IF(AND($E10=\"\",$C10=$B$5),1,0))","v":0},{"$f":"IF($C10=$B$6,F10,0)","v":0},{"$f":"(IF(AND($E10=\"\",$C10=$B$6),1,0))","v":0},{"$f":"IF($C10=$B$7,F10,0)","v":0},{"$f":"(IF(AND($E10=\"\",$C10=$B$7),1,0))","v":0},{"$nulls":8},{"$f":"IF(Z10=D10,1,0)","v":1},{"$f":"IF(Z10=0,0,1)","v":0},{"$f":"IF(AA10+AB10=2,\"Korrekt\",\"\")","v":""}]
[2,{"$f":"'Wettkampf 1'!B11","v":"Sarah Breer"},{"$f":"'Wettkampf 1'!C11","v":"Börger II"},null,null,{"$f":"IF(E11=\"x\",\"0\",D11)","v":0},{"$f":"IF(C11=$B$2,F11,0)","v":0},{"$f":"(IF(AND($E11=\"\",$C11=$B$2),1,0))","v":1},{"$f":"IF($C11=$B$3,F11,0)","v":0},{"$f":"(IF(AND($E11=\"\",$C11=$B$3),1,0))","v":0},{"$f":"IF($C11=$B$4,F11,0)","v":0},{"$f":"(IF(AND($E11=\"\",$C11=$B$4),1,0))","v":0},{"$f":"IF($C11=$B$5,F11,0)","v":0},{"$f":"(IF(AND($E11=\"\",$C11=$B$5),1,0))","v":0},{"$f":"IF($C11=$B$6,F11,0)","v":0},{"$f":"(IF(AND($E11=\"\",$C11=$B$6),1,0))","v":0},{"$f":"IF($C11=$B$7,F11,0)","v":0},{"$f":"(IF(AND($E11=\"\",$C11=$B$7),1,0))","v":0},{"$nulls":8},{"$f":"IF(Z11=D11,1,0)","v":1},{"$f":"IF(Z11=0,0,1)","v":0},{"$f":"IF(AA11+AB11=2,\"Korrekt\",\"\")","v":""}]
[3,{"$f":"'Wettkampf 1'!B12","v":"Margret Pohlgeers"},{"$f":"'Wettkampf 1'!C12","v":"Börger II"},null,null,0,0,1,0,0,0,0,0,0,0,0,0,0,{"$nulls":8},1,0,""]
[4,{"$f":"'Wettkampf 1'!B13","v":"Gundula Schwarte"},{"$f":"'Wettkampf 1'!C13","v":"Börger II"},null,null,0,0,1,0,0,0,0,0,0,0,0,0,0,{"$nulls":8},1,0,""]
[5,{"$f":"'Wettkampf 1'!B14","v":"Annette Schwarte"},{"$f":"'Wettkampf 1'!C14","v":"Börger II"},null,null,0,0,1,0,0,0,0,0,0,0,0,0,0,{"$nulls":8},1,0,""]
[6,{"$f":"'Wettkampf 1'!B15","v":"Petra Dödtmann"},{"$f":"'Wettkampf 1'!C15","v":"Börger II"},null,null,0,0,1,0,0,0,0,0,0,0,0,0,0,{"$nulls":8},1,0,""]
[7,{"$f":"'Wettkampf 1'!B16","v":"Sarah Deyen"},{"$f":"'Wettkampf 1'!C16","v":"Neuvrees II"},null,null,0,0,0,0,1,0,0,0,0,0,0,0,0,{"$nulls":8},1,0,""]
[8,{"$f":"'Wettkampf 1'!B17","v":"Silvia Thunert"},{"$f":"'Wettkampf 1'!C17","v":"Neuvrees II"},null,null,0,0,0,0,1,0,0,0,0,0,0,0,0,{"$nulls":8},1,0,""]
[9,{"$f":"'Wettkampf 1'!B18","v":"Margret Pohlmann"},{"$f":"'Wettkampf 1'!C18","v":"Neuvrees II"},null,null,0,0,0,0,1,0,0,0,0,0,0,0,0,{"$nulls":8},1,0,""]
[10,{"$f":"'Wettkampf 1'!B19","v":"Harma Steenken"},{"$f":"'Wettkampf 1'!C19","v":"Neuvrees II"},null,null,0,0,0,0,1,0,0,0,0,0,0,0,0,{"$nulls":8},1,0,""]
[11,{"$f":"'Wettkampf 1'!B20","v":"Claudia Rolfes"},{"$f":"'Wettkampf 1'!C20","v":"Neuvrees II"},null,null,0,0,0,0,1,0,0,0,0,0,0,0,0,{"$nulls":8},1,0,""]
[12,{"$f":"'Wettkampf 1'!B21","v":"Silvia Junge"},{"$f":"'Wettkampf 1'!C21","v":"Neuvrees II"},null,null,0,0,0,0,1,0,0,0,0,0,0,0,0,{"$nulls":8},1,0,""]
[13,{"$f":"'Wettkampf 1'!B22","v":"Ulla Schnieders"},{"$f":"'Wettkampf 1'!C22","v":"Börgermoor I"},null,null,0,0,0,0,0,0,1,0,0,0,0,0,0,{"$nulls":8},1,0,""]
[14,{"$f":"'Wettkampf 1'!B23","v":"Jasmin Kramer"},{"$f":"'Wettkampf 1'!C23","v":"Börgermoor I"},null,null,0,0,0,0,0,0,1,0,0,0,0,0,0,{"$nulls":8},1,0,""]
[15,{"$f":"'Wettkampf 1'!B24","v":"Anni Küwen"},{"$f":"'Wettkampf 1'!C24","v":"Börgermoor I"},null,null,0,0,0,0,0,0,1,0,0,0,0,0,0,{"$nulls":8},1,0,""]
[16,{"$f":"'Wettkampf 1'!B25","v":"Waltraud Dobelmann"},{"$f":"'Wettkampf 1'!C25","v":"Börgermoor I"},null,null,0,0,0,0,0,0,1,0,0,0,0,0,0,{"$nulls":8},1,0,""]
[17,{"$f":"'Wettkampf 1'!B26","v":"Schütze 17"},{"$f":"'Wettkampf 1'!C26","v":"Börgermoor I"},null,null,0,0,0,0,0,0,1,0,0,0,0,0,0,{"$nulls":8},1,0,""]
[18,{"$f":"'Wettkampf 1'!B27","v":"Schütze 18"},{"$f":"'Wettkampf 1'!C27","v":"Börgermoor I"},null,null,0,0,0,0,0,0,1,0,0,0,0,0,0,{"$nulls":8},1,0,""]
[19,{"$f":"'Wettkampf 1'!B28","v":"Hanna Gebken"},{"$f":"'Wettkampf 1'!C28","v":"Lorup III"},null,null,0,0,0,0,0,0,0,0,1,0,0,0,0,{"$nulls":8},1,0,""]
[20,{"$f":"'Wettkampf 1'!B29","v":"Monika Reimann"},{"$f":"'Wettkampf 1'!C29","v":"Lorup III"},null,null,0,0,0,0,0,0,0,0,1,0,0,0,0,{"$nulls":8},1,0,""]
[21,{"$f":"'Wettkampf 1'!B30","v":"Marina Schrand"},{"$f":"'Wettkampf 1'!C30","v":"Lorup III"},null,null,0,0,0,0,0,0,0,0,1,0,0,0,0,{"$nulls":8},1,0,""]
[22,{"$f":"'Wettkampf 1'!B31","v":"Nadine Krömer"},{"$f":"'Wettkampf 1'!C31","v":"Lorup III"},null,null,0,0,0,0,0,0,0,0,1,0,0,0,0,{"$nulls":8},1,0,""]
[23,{"$f":"'Wettkampf 1'!B32","v":"Nina Krömer"},{"$f":"'Wettkampf 1'!C32","v":"Lorup III"},null,null,0,0,0,0,0,0,0,0,1,0,0,0,0,{"$nulls":8},1,0,""]
[24,{"$f":"'Wettkampf 1'!B33","v":"Margret Büter"},{"$f":"'Wettkampf 1'!C33","v":"Lorup III"},null,null,0,0,0,0,0,0,0,0,1,0,0,0,0,{"$nulls":8},1,0,""]
[25,{"$f":"'Wettkampf 1'!B34","v":"Sarah Meiners"},{"$f":"'Wettkampf 1'!C34","v":"Ostenwalde II"},null,null,0,0,0,0,0,0,0,0,0,0,1,0,0,{"$nulls":8},1,0,""]
[26,{"$f":"'Wettkampf 1'!B35","v":"Anna Temmen"},{"$f":"'Wettkampf 1'!C35","v":"Ostenwalde II"},null,null,0,0,0,0,0,0,0,0,0,0,1,0,0,{"$nulls":8},1,0,""]
[27,{"$f":"'Wettkampf 1'!B36","v":"Helga Meiners"},{"$f":"'Wettkampf 1'!C36","v":"Ostenwalde II"},null,null,0,0,0,0,0,0,0,0,0,0,1,0,0,{"$nulls":8},1,0,""]
[28,{"$f":"'Wettkampf 1'!B37","v":"Carmen Benten"},{"$f":"'Wettkampf 1'!C37","v":"Ostenwalde II"},null,null,0,0,0,0,0,0,0,0,0,0,1,0,0,{"$nulls":8},1,0,""]
[29,{"$f":"'Wettkampf 1'!B38","v":"Anna -Maria Wimberg"},{"$f":"'Wettkampf 1'!C38","v":"Ostenwalde II"},null,null,0,0,0,0,0,0,0,0,0,0,1,0,0,{"$nulls":8},1,0,""]
[30,{"$f":"'Wettkampf 1'!B39","v":"Evelyn Feder"},{"$f":"'Wettkampf 1'!C39","v":"Ostenwalde II"},null,null,0,0,0,0,0,0,0,0,0,0,1,0,0,{"$nulls":8},1,0,""]
[31,{"$f":"'Wettkampf 1'!B40","v":"Monika Jansen"},{"$f":"'Wettkampf 1'!C40","v":"Spahnharrenstätte I"},null,null,0,0,0,0,0,0,0,0,0,0,0,0,1,{"$nulls":8},1,0,""]
[32,{"$f":"'Wettkampf 1'!B41","v":"Kerstin Sträche"},{"$f":"'Wettkampf 1'!C41","v":"Spahnharrenstätte I"},null,null,0,0,0,0,0,0,0,0,0,0,0,0,1,{"$nulls":8},1,0,""]
[33,{"$f":"'Wettkampf 1'!B42","v":"Rita Hanekamp"},{"$f":"'Wettkampf 1'!C42","v":"Spahnharrenstätte I"},null,null,0,0,0,0,0,0,0,0,0,0,0,0,1,{"$nulls":8},1,0,""]
[34,{"$f":"'Wettkampf 1'!B43","v":"Maria Beusing"},{"$f":"'Wettkampf 1'!C43","v":"Spahnharrenstätte I"},null,null,0,0,0,0,0,0,0,0,0,0,0,0,1,{"$nulls":8},1,0,""]
[35,{"$f":"'Wettkampf 1'!B44","v":"Schütze 35"},{"$f":"'Wettkampf 1'!C44","v":"Spahnharrenstätte I"},null,null,0,0,0,0,0,0,0,0,0,0,0,0,1,{"$nulls":8},1,0,""]
[36,{"$f":"'Wettkampf 1'!B45","v":"Schütze 36"},{"$f":"'Wettkampf 1'!C45","v":"Spahnharrenstätte I"},null,null,0,0,0,0,0,0,0,0,0,0,0,0,1,{"$nulls":8},1,0,""]
[{"$nulls":6},{"$f":"LARGE(G10:G45,1)+LARGE(G10:G45,2)+LARGE(G10:G45,3)","v":0},{"$f":"SUM(H10:H45)","v":6},{"$f":"LARGE(I10:I45,1)+LARGE(I10:I45,2)+LARGE(I10:I45,3)","v":0},{"$f":"SUM(J10:J45)","v":6},{"$f":"LARGE(K10:K45,1)+LARGE(K10:K45,2)+LARGE(K10:K45,3)","v":0},{"$f":"SUM(L10:L45)","v":6},{"$f":"LARGE(M10:M45,1)+LARGE(M10:M45,2)+LARGE(M10:M45,3)","v":0},{"$f":"SUM(N10:N45)","v":6},{"$f":"LARGE(O10:O45,1)+LARGE(O10:O45,2)+LARGE(O10:O45,3)","v":0},{"$f":"SUM(P10:P45)","v":6},{"$f":"LARGE(Q10:Q45,1)+LARGE(Q10:Q45,2)+LARGE(Q10:Q45,3)","v":0},{"$f":"SUM(R10:S45)","v":6}]
[]
[null,"Bitte beachtet, dass die Standaufsicht benannt werden muss"]

{"sheet":"Ausdruck blank","index":14,"n_rows":48,"n_cols":29,"rows_kept":48,"merged":[[0,3,0,19],[0,24,0,25],[1,3,1,19],[1,24,1,25],[2,3,2,19],[3,3,3,19],[4,24,4,25],[5,24,5,25],[6,24,6,25],[8,22,8,25]]}
[null,"Verein / Gruppe","Ergebnisse",{"$f":"Übersicht!K1","v":"2024/2025"},{"$nulls":19},"Austragungsort:"]
[1,null,null,"Klasse:",{"$nulls":19},"Wettkampftag:"]
[2]
[3,{"$nulls":24},"Ansprechpartner für Rückfragen:"]
[4,{"$nulls":22},"Name:"]
[5,{"$nulls":22},"Tel:"]
[6,{"$nulls":22},"Standaufsicht:"]
[]
[null,"Name Schütze","Verein/Gruppe","Ergebnis","AW? ",null,"Verein 1",null,"Verein 2",null,"Verein 3",null,"Verein 4",null,"Verein 5",null,"Verein 6",{"$nulls":3},"Geburts-datum",null,"Proberechnung bei Streifen:"]
[1,{"$nulls":4},{"$f":"IF(E10=\"x\",\"0\",D10)","v":0},{"$f":"IF(C10=$B$2,F10,0)","v":0},{"$f":"(IF(AND($E10=\"\",$C10=$B$2),1,0))","v":1},{"$f":"IF($C10=$B$3,F10,0)","v":0},{"$f":"(IF(AND($E10=\"\",$C10=$B$3),1,0))","v":1},{"$f":"IF($C10=$B$4,F10,0)","v":0},{"$f":"(IF(AND($E10=\"\",$C10=$B$4),1,0))","v":1},{"$f":"IF($C10=$B$5,F10,0)","v":0},{"$f":"(IF(AND($E10=\"\",$C10=$B$5),1,0))","v":1},{"$f":"IF($C10=$B$6,F10,0)","v":0},{"$f":"(IF(AND($E10=\"\",$C10=$B$6),1,0))","v":1},{"$f":"IF($C10=$B$7,F10,0)","v":0},{"$f":"(IF(AND($E10=\"\",$C10=$B$7),1,0))","v":1},{"$nulls":8},{"$f":"IF(Z10=D10,1,0)","v":1},{"$f":"IF(Z10=0,0,1)","v":0},{"$f":"IF(AA10+AB10=2,\"Korrekt\",\"\")","v":""}]
[2,{"$nulls":4},{"$f":"IF(E11=\"x\",\"0\",D11)","v":0},{"$f":"IF(C11=$B$2,F11,0)","v":0},{"$f":"(IF(AND($E11=\"\",$C11=$B$2),1,0))","v":1},{"$f":"IF($C11=$B$3,F11,0)","v":0},{"$f":"(IF(AND($E11=\"\",$C11=$B$3),1,0))","v":1},{"$f":"IF($C11=$B$4,F11,0)","v":0},{"$f":"(IF(AND($E11=\"\",$C11=$B$4),1,0))","v":1},{"$f":"IF($C11=$B$5,F11,0)","v":0},{"$f":"(IF(AND($E11=\"\",$C11=$B$5),1,0))","v":1},{"$f":"IF($C11=$B$6,F11,0)","v":0},{"$f":"(IF(AND($E11=\"\",$C11=$B$6),1,0))","v":1},{"$f":"IF($C11=$B$7,F11,0)","v":0},{"$f":"(IF(AND($E11=\"\",$C11=$B$7),1,0))","v":1},{"$nulls":8},{"$f":"IF(Z11=D11,1,0)","v":1},{"$f":"IF(Z11=0,0,1)","v":0},{"$f":"IF(AA11+AB11=2,\"Korrekt\",\"\")","v":""}]
[3,{"$nulls":4},0,0,1,0,1,0,1,0,1,0,1,0,1,{"$nulls":8},1,0,""]
[4,{"$nulls":4},0,0,1,0,1,0,1,0,1,0,1,0,1,{"$nulls":8},1,0,""]
[5,{"$nulls":4},0,0,1,0,1,0,1,0,1,0,1,0,1,{"$nulls":8},1,0,""]
[6,{"$nulls":4},0,0,1,0,1,0,1,0,1,0,1,0,1,{"$nulls":8},1,0,""]
[7,{"$nulls":4},0,0,1,0,1,0,1,0,1,0,1,0,1,{"$nulls":8},1,0,""]
[8,{"$nulls":4},0,0,1,0,1,0,1,0,1,0,1,0,1,{"$nulls":8},1,0,""]
[9,{"$nulls":4},0,0,1,0,1,0,1,0,1,0,1,0,1,{"$nulls":8},1,0,""]
[10,{"$nulls":4},0,0,1,0,1,0,1,0,1,0,1,0,1,{"$nulls":8},1,0,""]
[11,{"$nulls":4},0,0,1,0,1,0,1,0,1,0,1,0,1,{"$nulls":8},1,0,""]
[12,{"$nulls":4},0,0,1,0,1,0,1,0,1,0,1,0,1,{"$nulls":8},1,0,""]
[13,{"$nulls":4},0,0,1,0,1,0,1,0,1,0,1,0,1,{"$nulls":8},1,0,""]
[14,{"$nulls":4},0,0,1,0,1,0,1,0,1,0,1,0,1,{"$nulls":8},1,0,""]
[15,{"$nulls":4},0,0,1,0,1,0,1,0,1,0,1,0,1,{"$nulls":8},1,0,""]
[16,{"$nulls":4},0,0,1,0,1,0,1,0,1,0,1,0,1,{"$nulls":8},1,0,""]
[17,{"$nulls":4},0,0,1,0,1,0,1,0,1,0,1,0,1,{"$nulls":8},1,0,""]
[18,{"$nulls":4},0,0,1,0,1,0,1,0,1,0,1,0,1,{"$nulls":8},1,0,""]
[19,{"$nulls":4},0,0,1,0,1,0,1,0,1,0,1,0,1,{"$nulls":8},1,0,""]
[20,{"$nulls":4},0,0,1,0,1,0,1,0,1,0,1,0,1,{"$nulls":8},1,0,""]
[21,{"$nulls":4},0,0,1,0,1,0,1,0,1,0,1,0,1,{"$nulls":8},1,0,""]
[22,{"$nulls":4},0,0,1,0,1,0,1,0,1,0,1,0,1,{"$nulls":8},1,0,""]
[23,{"$nulls":4},0,0,1,0,1,0,1,0,1,0,1,0,1,{"$nulls":8},1,0,""]
[24,{"$nulls":4},0,0,1,0,1,0,1,0,1,0,1,0,1,{"$nulls":8},1,0,""]
[25,{"$nulls":4},0,0,1,0,1,0,1,0,1,0,1,0,1,{"$nulls":8},1,0,""]
[26,{"$nulls":4},0,0,1,0,1,0,1,0,1,0,1,0,1,{"$nulls":8},1,0,""]
[27,{"$nulls":4},0,0,1,0,1,0,1,0,1,0,1,0,1,{"$nulls":8},1,0,""]
[28,{"$nulls":4},0,0,1,0,1,0,1,0,1,0,1,0,1,{"$nulls":8},1,0,""]
[29,{"$nulls":4},0,0,1,0,1,0,1,0,1,0,1,0,1,{"$nulls":8},1,0,""]
[30,{"$nulls":4},0,0,1,0,1,0,1,0,1,0,1,0,1,{"$nulls":8},1,0,""]
[31,{"$nulls":4},0,0,1,0,1,0,1,0,1,0,1,0,1,{"$nulls":8},1,0,""]
[32,{"$nulls":4},0,0,1,0,1,0,1,0,1,0,1,0,1,{"$nulls":8},1,0,""]
[33,{"$nulls":4},0,0,1,0,1,0,1,0,1,0,1,0,1,{"$nulls":8},1,0,""]
[34,{"$nulls":4},0,0,1,0,1,0,1,0,1,0,1,0,1,{"$nulls":8},1,0,""]
[35,{"$nulls":4},0,0,1,0,1,0,1,0,1,0,1,0,1,{"$nulls":8},1,0,""]
[36,{"$nulls":4},0,0,1,0,1,0,1,0,1,0,1,0,1,{"$nulls":8},1,0,""]
[{"$nulls":6},{"$f":"LARGE(G10:G45,1)+LARGE(G10:G45,2)+LARGE(G10:G45,3)","v":0},{"$f":"SUM(H10:H45)","v":36},{"$f":"LARGE(I10:I45,1)+LARGE(I10:I45,2)+LARGE(I10:I45,3)","v":0},{"$f":"SUM(J10:J45)","v":36},{"$f":"LARGE(K10:K45,1)+LARGE(K10:K45,2)+LARGE(K10:K45,3)","v":0},{"$f":"SUM(L10:L45)","v":36},{"$f":"LARGE(M10:M45,1)+LARGE(M10:M45,2)+LARGE(M10:M45,3)","v":0},{"$f":"SUM(N10:N45)","v":36},{"$f":"LARGE(O10:O45,1)+LARGE(O10:O45,2)+LARGE(O10:O45,3)","v":0},{"$f":"SUM(P10:P45)","v":36},{"$f":"LARGE(Q10:Q45,1)+LARGE(Q10:Q45,2)+LARGE(Q10:Q45,3)","v":0},{"$f":"SUM(R10:S45)","v":36}]
[]
[null,"Bitte beachtet, dass die Standaufsicht benannt werden muss"]

{"sheet":"Übersicht Schützen","index":15,"n_rows":37,"n_cols":23,"rows_kept":37,"hidden":true}
[null,null,{"v":1,"d":"1.0"},{"v":2,"d":"2.0"},{"v":3,"d":"3.0"},{"v":4,"d":"4.0"},{"v":5,"d":"5.0"},{"v":6,"d":"6.0"},{"$nulls":3},{"v":7,"d":"7.0"},{"v":8,"d":"8.0"},{"v":9,"d":"9.0"},{"v":10,"d":"10.0"},{"v":11,"d":"11.0"},{"v":12,"d":"12.0"}]
["Nadine Krömer",{"$f":"VLOOKUP(A2,'Wettkampf 1'!$B$10:$C$45,2,FALSE)","v":"Lorup III"},{"$f":"VLOOKUP(A2,'Wettkampf 1'!$B$10:$D$45,3,FALSE)","v":314.2},{"$f":"VLOOKUP($A2,'2'!$B$10:$D$45,3,FALSE)","v":313.3},{"$f":"VLOOKUP($A2,'3'!$B$10:$D$45,3,FALSE)","v":313.8},{"$f":"VLOOKUP($A2,'4'!$B$10:$D$45,3,FALSE)","v":315.1},{"$f":"VLOOKUP($A2,'5'!$B$10:$D$45,3,FALSE)","v":308.1},{"$f":"VLOOKUP($A2,'6'!$B$10:$D$45,3,FALSE)","v":312.2},{"$f":"IF(J2 > 0,K2/J2,0)","v":{"v":312.78333333333336,"d":"312.8"}},{"$f":"VLOOKUP(A2,Formelhilfe!$A$9:$H$44,8,FALSE)","v":{"v":6,"d":"6.0"}},{"$f":"SUM(C2:H2)","v":{"v":1876.7,"d":"1,876.7"}},{"$f":"VLOOKUP($A2,'7'!$B$10:$D$45,3,FALSE)","v":310.4},{"$f":"VLOOKUP($A2,'8'!$B$10:$D$45,3,FALSE)","v":312.1},{"$f":"VLOOKUP($A2,'9'!$B$10:$D$45,3,FALSE)","v":312.6},{"$f":"VLOOKUP($A2,'10'!$B$10:$D$45,3,FALSE)","v":315.7},{"$f":"VLOOKUP($A2,'11'!$B$10:$D$45,3,FALSE)","v":309.8},{"$f":"VLOOKUP($A2,'12'!$B$10:$D$45,3,FALSE)","v":{"v":0,"d":"0.0"}},{"$f":"IF(S2 >0,T2/S2,0)","v":{"v":312.12,"d":"312.1"}},{"$f":"VLOOKUP(A2,Formelhilfe!$A$9:$O$44,15,FALSE)","v":{"v":5,"d":"5.0"}},{"$f":"SUM(L2:Q2)","v":{"v":1560.6,"d":"1,560.6"}},{"$f":"IF(V2>0,W2/V2,0)","v":{"v":312.48181818181814,"d":"312.5"}},{"$f":"VLOOKUP(A2,Formelhilfe!$A$9:$P$44,16,FALSE)","v":{"v":11,"d":"11.0"}},{"$f":"SUM(C2:H2,L2:Q2)","v":{"v":3437.2999999999997,"d":"3,437.3"}}]
["Anna Temmen",{"$f":"VLOOKUP(A3,'Wettkampf 1'!$B$10:$C$45,2,FALSE)","v":"Ostenwalde II"},{"$f":"VLOOKUP(A3,'Wettkampf 1'!$B$10:$D$45,3,FALSE)","v":307.5},{"$f":"VLOOKUP($A3,'2'!$B$10:$D$45,3,FALSE)","v":311.9},{"$f":"VLOOKUP($A3,'3'!$B$10:$D$45,3,FALSE)","v":316.6},{"$f":"VLOOKUP($A3,'4'!$B$10:$D$45,3,FALSE)","v":{"v":315,"d":"315.0"}},{"$f":"VLOOKUP($A3,'5'!$B$10:$D$45,3,FALSE)","v":311.6},{"$f":"VLOOKUP($A3,'6'!$B$10:$D$45,3,FALSE)","v":311.6},{"$f":"IF(J3 > 0,K3/J3,0)","v":{"v":312.3666666666666,"d":"312.4"}},{"$f":"VLOOKUP(A3,Formelhilfe!$A$9:$H$44,8,FALSE)","v":{"v":6,"d":"6.0"}},{"$f":"SUM(C3:H3)","v":{"v":1874.1999999999998,"d":"1,874.2"}},{"$f":"VLOOKUP($A3,'7'!$B$10:$D$45,3,FALSE)","v":309.5},{"$f":"VLOOKUP($A3,'8'!$B$10:$D$45,3,FALSE)","v":311.3},{"$f":"VLOOKUP($A3,'9'!$B$10:$D$45,3,FALSE)","v":310.8},{"$f":"VLOOKUP($A3,'10'!$B$10:$D$45,3,FALSE)","v":313.3},{"$f":"VLOOKUP($A3,'11'!$B$10:$D$45,3,FALSE)","v":312.2},{"$f":"VLOOKUP($A3,'12'!$B$10:$D$45,3,FALSE)","v":{"v":0,"d":"0.0"}},{"$f":"IF(S3 >0,T3/S3,0)","v":{"v":311.41999999999996,"d":"311.4"}},{"$f":"VLOOKUP(A3,Formelhilfe!$A$9:$O$44,15,FALSE)","v":{"v":5,"d":"5.0"}},{"$f":"SUM(L3:Q3)","v":{"v":1557.1,"d":"1,557.1"}},{"$f":"IF(V3>0,W3/V3,0)","v":{"v":311.93636363636364,"d":"311.9"}},{"$f":"VLOOKUP(A3,Formelhilfe!$A$9:$P$44,16,FALSE)","v":{"v":11,"d":"11.0"}},{"$f":"SUM(C3:H3,L3:Q3)","v":{"v":3431.3,"d":"3,431.3"}}]
["Margret Pohlgeers",{"$f":"VLOOKUP(A4,'Wettkampf 1'!$B$10:$C$45,2,FALSE)","v":"Börger II"},{"$f":"VLOOKUP(A4,'Wettkampf 1'!$B$10:$D$45,3,FALSE)","v":310.6},{"$f":"VLOOKUP($A4,'2'!$B$10:$D$45,3,FALSE)","v":307.4},{"$f":"VLOOKUP($A4,'3'!$B$10:$D$45,3,FALSE)","v":311.3},{"$f":"VLOOKUP($A4,'4'!$B$10:$D$45,3,FALSE)","v":315.2},{"$f":"VLOOKUP($A4,'5'!$B$10:$D$45,3,FALSE)","v":311.3},{"$f":"VLOOKUP($A4,'6'!$B$10:$D$45,3,FALSE)","v":312.9},{"$f":"IF(J4 > 0,K4/J4,0)","v":{"v":311.45,"d":"311.5"}},{"$f":"VLOOKUP(A4,Formelhilfe!$A$9:$H$44,8,FALSE)","v":{"v":6,"d":"6.0"}},{"$f":"SUM(C4:H4)","v":{"v":1868.6999999999998,"d":"1,868.7"}},{"$f":"VLOOKUP($A4,'7'!$B$10:$D$45,3,FALSE)","v":308.8},{"$f":"VLOOKUP($A4,'8'!$B$10:$D$45,3,FALSE)","v":312.9},{"$f":"VLOOKUP($A4,'9'!$B$10:$D$45,3,FALSE)","v":312.4},{"$f":"VLOOKUP($A4,'10'!$B$10:$D$45,3,FALSE)","v":313.7},{"$f":"VLOOKUP($A4,'11'!$B$10:$D$45,3,FALSE)","v":308.5},{"$f":"VLOOKUP($A4,'12'!$B$10:$D$45,3,FALSE)","v":{"v":0,"d":"0.0"}},{"$f":"IF(S4 >0,T4/S4,0)","v":{"v":311.26,"d":"311.3"}},{"$f":"VLOOKUP(A4,Formelhilfe!$A$9:$O$44,15,FALSE)","v":{"v":5,"d":"5.0"}},{"$f":"SUM(L4:Q4)","v":{"v":1556.3,"d":"1,556.3"}},{"$f":"IF(V4>0,W4/V4,0)","v":{"v":311.3636363636364,"d":"311.4"}},{"$f":"VLOOKUP(A4,Formelhilfe!$A$9:$P$44,16,FALSE)","v":{"v":11,"d":"11.0"}},{"$f":"SUM(C4:H4,L4:Q4)","v":{"v":3425,"d":"3,425.0"}}]
["Monika Jansen",{"$f":"VLOOKUP(A5,'Wettkampf 1'!$B$10:$C$45,2,FALSE)","v":"Spahnharrenstätte I"},{"$f":"VLOOKUP(A5,'Wettkampf 1'!$B$10:$D$45,3,FALSE)","v":312.1},{"$f":"VLOOKUP($A5,'2'!$B$10:$D$45,3,FALSE)","v":312.7},{"$f":"VLOOKUP($A5,'3'!$B$10:$D$45,3,FALSE)","v":315.1},{"$f":"VLOOKUP($A5,'4'!$B$10:$D$45,3,FALSE)","v":316.1},{"$f":"VLOOKUP($A5,'5'!$B$10:$D$45,3,FALSE)","v":{"v":303,"d":"303.0"}},{"$f":"VLOOKUP($A5,'6'!$B$10:$D$45,3,FALSE)","v":311.3},{"$f":"IF(J5 > 0,K5/J5,0)","v":{"v":311.71666666666664,"d":"311.7"}},{"$f":"VLOOKUP(A5,Formelhilfe!$A$9:$H$44,8,FALSE)","v":{"v":6,"d":"6.0"}},{"$f":"SUM(C5:H5)","v":{"v":1870.3,"d":"1,870.3"}},{"$f":"VLOOKUP($A5,'7'!$B$10:$D$45,3,FALSE)","v":304.5},{"$f":"VLOOKUP($A5,'8'!$B$10:$D$45,3,FALSE)","v":309.6},{"$f":"VLOOKUP($A5,'9'!$B$10:$D$45,3,FALSE)","v":309.7},{"$f":"VLOOKUP($A5,'10'!$B$10:$D$45,3,FALSE)","v":308.6},{"$f":"VLOOKUP($A5,'11'!$B$10:$D$45,3,FALSE)","v":309.9},{"$f":"VLOOKUP($A5,'12'!$B$10:$D$45,3,FALSE)","v":{"v":0,"d":"0.0"}},{"$f":"IF(S5 >0,T5/S5,0)","v":{"v":308.46000000000004,"d":"308.5"}},{"$f":"VLOOKUP(A5,Formelhilfe!$A$9:$O$44,15,FALSE)","v":{"v":5,"d":"5.0"}},{"$f":"SUM(L5:Q5)","v":{"v":1542.3000000000002,"d":"1,542.3"}},{"$f":"IF(V5>0,W5/V5,0)","v":{"v":310.23636363636365,"d":"310.2"}},{"$f":"VLOOKUP(A5,Formelhilfe!$A$9:$P$44,16,FALSE)","v":{"v":11,"d":"11.0"}},{"$f":"SUM(C5:H5,L5:Q5)","v":{"v":3412.6,"d":"3,412.6"}}]
["Hanna Gebken",{"$f":"VLOOKUP(A6,'Wettkampf 1'!$B$10:$C$45,2,FALSE)","v":"Lorup III"},{"$f":"VLOOKUP(A6,'Wettkampf 1'!$B$10:$D$45,3,FALSE)","v":309.8},{"$f":"VLOOKUP($A6,'2'!$B$10:$D$45,3,FALSE)","v":311.6},{"$f":"VLOOKUP($A6,'3'!$B$10:$D$45,3,FALSE)","v":309.9},{"$f":"VLOOKUP($A6,'4'!$B$10:$D$45,3,FALSE)","v":312.2},{"$f":"VLOOKUP($A6,'5'!$B$10:$D$45,3,FALSE)","v":312.1},{"$f":"VLOOKUP($A6,'6'!$B$10:$D$45,3,FALSE)","v":306.7},{"$f":"IF(J6 > 0,K6/J6,0)","v":{"v":310.3833333333333,"d":"310.4"}},{"$f":"VLOOKUP(A6,Formelhilfe!$A$9:$H$44,8,FALSE)","v":{"v":6,"d":"6.0"}},{"$f":"SUM(C6:H6)","v":{"v":1862.3,"d":"1,862.3"}},{"$f":"VLOOKUP($A6,'7'!$B$10:$D$45,3,FALSE)","v":309.6},{"$f":"VLOOKUP($A6,'8'!$B$10:$D$45,3,FALSE)","v":307.2},{"$f":"VLOOKUP($A6,'9'!$B$10:$D$45,3,FALSE)","v":309.4},{"$f":"VLOOKUP($A6,'10'!$B$10:$D$45,3,FALSE)","v":307.5},{"$f":"VLOOKUP($A6,'11'!$B$10:$D$45,3,FALSE)","v":305.1},{"$f":"VLOOKUP($A6,'12'!$B$10:$D$45,3,FALSE)","v":{"v":0,"d":"0.0"}},{"$f":"IF(S6 >0,T6/S6,0)","v":{"v":307.75999999999993,"d":"307.8"}},{"$f":"VLOOKUP(A6,Formelhilfe!$A$9:$O$44,15,FALSE)","v":{"v":5,"d":"5.0"}},{"$f":"SUM(L6:Q6)","v":{"v":1538.7999999999997,"d":"1,538.8"}},{"$f":"IF(V6>0,W6/V6,0)","v":{"v":309.1909090909091,"d":"309.2"}},{"$f":"VLOOKUP(A6,Formelhilfe!$A$9:$P$44,16,FALSE)","v":{"v":11,"d":"11.0"}},{"$f":"SUM(C6:H6,L6:Q6)","v":{"v":3401.1,"d":"3,401.1"}}]
["Maria Beusing",{"$f":"VLOOKUP(A7,'Wettkampf 1'!$B$10:$C$45,2,FALSE)","v":"Spahnharrenstätte I"},{"$f":"VLOOKUP(A7,'Wettkampf 1'!$B$10:$D$45,3,FALSE)","v":304.1},{"$f":"VLOOKUP($A7,'2'!$B$10:$D$45,3,FALSE)","v":308.3},{"$f":"VLOOKUP($A7,'3'!$B$10:$D$45,3,FALSE)","v":308.1},{"$f":"VLOOKUP($A7,'4'!$B$10:$D$45,3,FALSE)","v":310.8},{"$f":"VLOOKUP($A7,'5'!$B$10:$D$45,3,FALSE)","v":308.6},{"$f":"VLOOKUP($A7,'6'!$B$10:$D$45,3,FALSE)","v":309.6},{"$f":"IF(J7 > 0,K7/J7,0)","v":{"v":308.25,"d":"308.3"}},{"$f":"VLOOKUP(A7,Formelhilfe!$A$9:$H$44,8,FALSE)","v":{"v":6,"d":"6.0"}},{"$f":"SUM(C7:H7)","v":{"v":1849.5,"d":"1,849.5"}},{"$f":"VLOOKUP($A7,'7'!$B$10:$D$45,3,FALSE)","v":314.9},{"$f":"VLOOKUP($A7,'8'!$B$10:$D$45,3,FALSE)","v":309.9},{"$f":"VLOOKUP($A7,'9'!$B$10:$D$45,3,FALSE)","v":310.8},{"$f":"VLOOKUP($A7,'10'!$B$10:$D$45,3,FALSE)","v":308.6},{"$f":"VLOOKUP($A7,'11'!$B$10:$D$45,3,FALSE)","v":{"v":307,"d":"307.0"}},{"$f":"VLOOKUP($A7,'12'!$B$10:$D$45,3,FALSE)","v":{"v":0,"d":"0.0"}},{"$f":"IF(S7 >0,T7/S7,0)","v":{"v":310.23999999999995,"d":"310.2"}},{"$f":"VLOOKUP(A7,Formelhilfe!$A$9:$O$44,15,FALSE)","v":{"v":5,"d":"5.0"}},{"$f":"SUM(L7:Q7)","v":{"v":1551.1999999999998,"d":"1,551.2"}},{"$f":"IF(V7>0,W7/V7,0)","v":{"v":309.1545454545455,"d":"309.2"}},{"$f":"VLOOKUP(A7,Formelhilfe!$A$9:$P$44,16,FALSE)","v":{"v":11,"d":"11.0"}},{"$f":"SUM(C7:H7,L7:Q7)","v":{"v":3400.7000000000003,"d":"3,400.7"}}]
["Claudia Rolfes",{"$f":"VLOOKUP(A8,'Wettkampf 1'!$B$10:$C$45,2,FALSE)","v":"Neuvrees II"},{"$f":"VLOOKUP(A8,'Wettkampf 1'!$B$10:$D$45,3,FALSE)","v":305.2},{"$f":"VLOOKUP($A8,'2'!$B$10:$D$45,3,FALSE)","v":305.4},{"$f":"VLOOKUP($A8,'3'!$B$10:$D$45,3,FALSE)","v":306.8},{"$f":"VLOOKUP($A8,'4'!$B$10:$D$45,3,FALSE)","v":311.3},{"$f":"VLOOKUP($A8,'5'!$B$10:$D$45,3,FALSE)","v":305.4},{"$f":"VLOOKUP($A8,'6'!$B$10:$D$45,3,FALSE)","v":311.4},{"$f":"IF(J8 > 0,K8/J8,0)","v":{"v":307.5833333333333,"d":"307.6"}},{"$f":"VLOOKUP(A8,Formelhilfe!$A$9:$H$44,8,FALSE)","v":{"v":6,"d":"6.0"}},{"$f":"SUM(C8:H8)","v":{"v":1845.5,"d":"1,845.5"}},{"$f":"VLOOKUP($A8,'7'!$B$10:$D$45,3,FALSE)","v":313.1},{"$f":"VLOOKUP($A8,'8'!$B$10:$D$45,3,FALSE)","v":309.2},{"$f":"VLOOKUP($A8,'9'!$B$10:$D$45,3,FALSE)","v":307.9},{"$f":"VLOOKUP($A8,'10'!$B$10:$D$45,3,FALSE)","v":313.3},{"$f":"VLOOKUP($A8,'11'!$B$10:$D$45,3,FALSE)","v":303.7},{"$f":"VLOOKUP($A8,'12'!$B$10:$D$45,3,FALSE)","v":{"v":0,"d":"0.0"}},{"$f":"IF(S8 >0,T8/S8,0)","v":{"v":309.44,"d":"309.4"}},{"$f":"VLOOKUP(A8,Formelhilfe!$A$9:$O$44,15,FALSE)","v":{"v":5,"d":"5.0"}},{"$f":"SUM(L8:Q8)","v":{"v":1547.2,"d":"1,547.2"}},{"$f":"IF(V8>0,W8/V8,0)","v":{"v":308.42727272727274,"d":"308.4"}},{"$f":"VLOOKUP(A8,Formelhilfe!$A$9:$P$44,16,FALSE)","v":{"v":11,"d":"11.0"}},{"$f":"SUM(C8:H8,L8:Q8)","v":{"v":3392.7,"d":"3,392.7"}}]
["Silvia Thunert",{"$f":"VLOOKUP(A9,'Wettkampf 1'!$B$10:$C$45,2,FALSE)","v":"Neuvrees II"},{"$f":"VLOOKUP(A9,'Wettkampf 1'!$B$10:$D$45,3,FALSE)","v":310.7},{"$f":"VLOOKUP($A9,'2'!$B$10:$D$45,3,FALSE)","v":311.3},{"$f":"VLOOKUP($A9,'3'!$B$10:$D$45,3,FALSE)","v":{"v":309,"d":"309.0"}},{"$f":"VLOOKUP($A9,'4'!$B$10:$D$45,3,FALSE)","v":307.4},{"$f":"VLOOKUP($A9,'5'!$B$10:$D$45,3,FALSE)","v":301.7},{"$f":"VLOOKUP($A9,'6'!$B$10:$D$45,3,FALSE)","v":{"v":312,"d":"312.0"}},{"$f":"IF(J9 > 0,K9/J9,0)","v":{"v":308.68333333333334,"d":"308.7"}},{"$f":"VLOOKUP(A9,Formelhilfe!$A$9:$H$44,8,FALSE)","v":{"v":6,"d":"6.0"}},{"$f":"SUM(C9:H9)","v":{"v":1852.1000000000001,"d":"1,852.1"}},{"$f":"VLOOKUP($A9,'7'!$B$10:$D$45,3,FALSE)","v":307.2},{"$f":"VLOOKUP($A9,'8'!$B$10:$D$45,3,FALSE)","v":306.8},{"$f":"VLOOKUP($A9,'9'!$B$10:$D$45,3,FALSE)","v":311.3},{"$f":"VLOOKUP($A9,'10'!$B$10:$D$45,3,FALSE)","v":{"v":307,"d":"307.0"}},{"$f":"VLOOKUP($A9,'11'!$B$10:$D$45,3,FALSE)","v":304.8},{"$f":"VLOOKUP($A9,'12'!$B$10:$D$45,3,FALSE)","v":{"v":0,"d":"0.0"}},{"$f":"IF(S9 >0,T9/S9,0)","v":{"v":307.41999999999996,"d":"307.4"}},{"$f":"VLOOKUP(A9,Formelhilfe!$A$9:$O$44,15,FALSE)","v":{"v":5,"d":"5.0"}},{"$f":"SUM(L9:Q9)","v":{"v":1537.1,"d":"1,537.1"}},{"$f":"IF(V9>0,W9/V9,0)","v":{"v":308.109090909091,"d":"308.1"}},{"$f":"VLOOKUP(A9,Formelhilfe!$A$9:$P$44,16,FALSE)","v":{"v":11,"d":"11.0"}},{"$f":"SUM(C9:H9,L9:Q9)","v":{"v":3389.2000000000007,"d":"3,389.2"}}]
["Sarah Deyen",{"$f":"VLOOKUP(A10,'Wettkampf 1'!$B$10:$C$45,2,FALSE)","v":"Neuvrees II"},{"$f":"VLOOKUP(A10,'Wettkampf 1'!$B$10:$D$45,3,FALSE)","v":308.1},{"$f":"VLOOKUP($A10,'2'!$B$10:$D$45,3,FALSE)","v":305.2},{"$f":"VLOOKUP($A10,'3'!$B$10:$D$45,3,FALSE)","v":309.7},{"$f":"VLOOKUP($A10,'4'!$B$10:$D$45,3,FALSE)","v":312.6},{"$f":"VLOOKUP($A10,'5'!$B$10:$D$45,3,FALSE)","v":301.4},{"$f":"VLOOKUP($A10,'6'!$B$10:$D$45,3,FALSE)","v":310.1},{"$f":"IF(J10 > 0,K10/J10,0)","v":{"v":307.84999999999997,"d":"307.9"}},{"$f":"VLOOKUP(A10,Formelhilfe!$A$9:$H$44,8,FALSE)","v":{"v":6,"d":"6.0"}},{"$f":"SUM(C10:H10)","v":{"v":1847.1,"d":"1,847.1"}},{"$f":"VLOOKUP($A10,'7'!$B$10:$D$45,3,FALSE)","v":302.3},{"$f":"VLOOKUP($A10,'8'!$B$10:$D$45,3,FALSE)","v":311.1},{"$f":"VLOOKUP($A10,'9'!$B$10:$D$45,3,FALSE)","v":{"v":306,"d":"306.0"}},{"$f":"VLOOKUP($A10,'10'!$B$10:$D$45,3,FALSE)","v":{"v":309,"d":"309.0"}},{"$f":"VLOOKUP($A10,'11'!$B$10:$D$45,3,FALSE)","v":304.4},{"$f":"VLOOKUP($A10,'12'!$B$10:$D$45,3,FALSE)","v":{"v":0,"d":"0.0"}},{"$f":"IF(S10 >0,T10/S10,0)","v":{"v":306.56000000000006,"d":"306.6"}},{"$f":"VLOOKUP(A10,Formelhilfe!$A$9:$O$44,15,FALSE)","v":{"v":5,"d":"5.0"}},{"$f":"SUM(L10:Q10)","v":{"v":1532.8000000000002,"d":"1,532.8"}},{"$f":"IF(V10>0,W10/V10,0)","v":{"v":307.26363636363635,"d":"307.3"}},{"$f":"VLOOKUP(A10,Formelhilfe!$A$9:$P$44,16,FALSE)","v":{"v":11,"d":"11.0"}},{"$f":"SUM(C10:H10,L10:Q10)","v":{"v":3379.9,"d":"3,379.9"}}]
["Ulla Schnieders",{"$f":"VLOOKUP(A11,'Wettkampf 1'!$B$10:$C$45,2,FALSE)","v":"Börgermoor I"},{"$f":"VLOOKUP(A11,'Wettkampf 1'!$B$10:$D$45,3,FALSE)","v":306.6},{"$f":"VLOOKUP($A11,'2'!$B$10:$D$45,3,FALSE)","v":308.5},{"$f":"VLOOKUP($A11,'3'!$B$10:$D$45,3,FALSE)","v":309.8},{"$f":"VLOOKUP($A11,'4'!$B$10:$D$45,3,FALSE)","v":310.1},{"$f":"VLOOKUP($A11,'5'!$B$10:$D$45,3,FALSE)","v":308.8},{"$f":"VLOOKUP($A11,'6'!$B$10:$D$45,3,FALSE)","v":307.1},{"$f":"IF(J11 > 0,K11/J11,0)","v":{"v":308.48333333333335,"d":"308.5"}},{"$f":"VLOOKUP(A11,Formelhilfe!$A$9:$H$44,8,FALSE)","v":{"v":6,"d":"6.0"}},{"$f":"SUM(C11:H11)","v":{"v":1850.9,"d":"1,850.9"}},{"$f":"VLOOKUP($A11,'7'!$B$10:$D$45,3,FALSE)","v":300.9},{"$f":"VLOOKUP($A11,'8'!$B$10:$D$45,3,FALSE)","v":302.9},{"$f":"VLOOKUP($A11,'9'!$B$10:$D$45,3,FALSE)","v":{"v":304,"d":"304.0"}},{"$f":"VLOOKUP($A11,'10'!$B$10:$D$45,3,FALSE)","v":308.2},{"$f":"VLOOKUP($A11,'11'!$B$10:$D$45,3,FALSE)","v":{"v":310,"d":"310.0"}},{"$f":"VLOOKUP($A11,'12'!$B$10:$D$45,3,FALSE)","v":{"v":0,"d":"0.0"}},{"$f":"IF(S11 >0,T11/S11,0)","v":305.2},{"$f":"VLOOKUP(A11,Formelhilfe!$A$9:$O$44,15,FALSE)","v":{"v":5,"d":"5.0"}},{"$f":"SUM(L11:Q11)","v":{"v":1526,"d":"1,526.0"}},{"$f":"IF(V11>0,W11/V11,0)","v":{"v":306.9909090909091,"d":"307.0"}},{"$f":"VLOOKUP(A11,Formelhilfe!$A$9:$P$44,16,FALSE)","v":{"v":11,"d":"11.0"}},{"$f":"SUM(C11:H11,L11:Q11)","v":{"v":3376.9,"d":"3,376.9"}}]
["Kerstin Sträche",{"$f":"VLOOKUP(A12,'Wettkampf 1'!$B$10:$C$45,2,FALSE)","v":"Spahnharrenstätte I"},{"$f":"VLOOKUP(A12,'Wettkampf 1'!$B$10:$D$45,3,FALSE)","v":302.8},{"$f":"VLOOKUP($A12,'2'!$B$10:$D$45,3,FALSE)","v":311.9},{"$f":"VLOOKUP($A12,'3'!$B$10:$D$45,3,FALSE)","v":{"v":305,"d":"305.0"}},{"$f":"VLOOKUP($A12,'4'!$B$10:$D$45,3,FALSE)","v":{"v":302,"d":"302.0"}},{"$f":"VLOOKUP($A12,'5'!$B$10:$D$45,3,FALSE)","v":305.7},{"$f":"VLOOKUP($A12,'6'!$B$10:$D$45,3,FALSE)","v":307.3},{"$f":"IF(J12 > 0,K12/J12,0)","v":{"v":305.78333333333336,"d":"305.8"}},{"$f":"VLOOKUP(A12,Formelhilfe!$A$9:$H$44,8,FALSE)","v":{"v":6,"d":"6.0"}},{"$f":"SUM(C12:H12)","v":{"v":1834.7,"d":"1,834.7"}},{"$f":"VLOOKUP($A12,'7'!$B$10:$D$45,3,FALSE)","v":307.8},{"$f":"VLOOKUP($A12,'8'!$B$10:$D$45,3,FALSE)","v":299.7},{"$f":"VLOOKUP($A12,'9'!$B$10:$D$45,3,FALSE)","v":308.4},{"$f":"VLOOKUP($A12,'10'!$B$10:$D$45,3,FALSE)","v":304.8},{"$f":"VLOOKUP($A12,'11'!$B$10:$D$45,3,FALSE)","v":307.3},{"$f":"VLOOKUP($A12,'12'!$B$10:$D$45,3,FALSE)","v":{"v":0,"d":"0.0"}},{"$f":"IF(S12 >0,T12/S12,0)","v":305.6},{"$f":"VLOOKUP(A12,Formelhilfe!$A$9:$O$44,15,FALSE)","v":{"v":5,"d":"5.0"}},{"$f":"SUM(L12:Q12)","v":{"v":1528,"d":"1,528.0"}},{"$f":"IF(V12>0,W12/V12,0)","v":{"v":305.70000000000005,"d":"305.7"}},{"$f":"VLOOKUP(A12,Formelhilfe!$A$9:$P$44,16,FALSE)","v":{"v":11,"d":"11.0"}},{"$f":"SUM(C12:H12,L12:Q12)","v":{"v":3362.7000000000003,"d":"3,362.7"}}]
["Marina Schrand",{"$f":"VLOOKUP(A13,'Wettkampf 1'!$B$10:$C$45,2,FALSE)","v":"Lorup III"},{"$f":"VLOOKUP(A13,'Wettkampf 1'!$B$10:$D$45,3,FALSE)","v":305.9},{"$f":"VLOOKUP($A13,'2'!$B$10:$D$45,3,FALSE)","v":306.4},{"$f":"VLOOKUP($A13,'3'!$B$10:$D$45,3,FALSE)","v":303.9},{"$f":"VLOOKUP($A13,'4'!$B$10:$D$45,3,FALSE)","v":306.2},{"$f":"VLOOKUP($A13,'5'!$B$10:$D$45,3,FALSE)","v":{"v":303,"d":"303.0"}},{"$f":"VLOOKUP($A13,'6'!$B$10:$D$45,3,FALSE)","v":305.5},{"$f":"IF(J13 > 0,K13/J13,0)","v":{"v":305.15,"d":"305.2"}},{"$f":"VLOOKUP(A13,Formelhilfe!$A$9:$H$44,8,FALSE)","v":{"v":6,"d":"6.0"}},{"$f":"SUM(C13:H13)","v":{"v":1830.8999999999999,"d":"1,830.9"}},{"$f":"VLOOKUP($A13,'7'!$B$10:$D$45,3,FALSE)","v":304.1},{"$f":"VLOOKUP($A13,'8'!$B$10:$D$45,3,FALSE)","v":306.7},{"$f":"VLOOKUP($A13,'9'!$B$10:$D$45,3,FALSE)","v":303.5},{"$f":"VLOOKUP($A13,'10'!$B$10:$D$45,3,FALSE)","v":308.3},{"$f":"VLOOKUP($A13,'11'!$B$10:$D$45,3,FALSE)","v":308.8},{"$f":"VLOOKUP($A13,'12'!$B$10:$D$45,3,FALSE)","v":{"v":0,"d":"0.0"}},{"$f":"IF(S13 >0,T13/S13,0)","v":{"v":306.28,"d":"306.3"}},{"$f":"VLOOKUP(A13,Formelhilfe!$A$9:$O$44,15,FALSE)","v":{"v":5,"d":"5.0"}},{"$f":"SUM(L13:Q13)","v":{"v":1531.3999999999999,"d":"1,531.4"}},{"$f":"IF(V13>0,W13/V13,0)","v":{"v":305.6636363636364,"d":"305.7"}},{"$f":"VLOOKUP(A13,Formelhilfe!$A$9:$P$44,16,FALSE)","v":{"v":11,"d":"11.0"}},{"$f":"SUM(C13:H13,L13:Q13)","v":{"v":3362.3,"d":"3,362.3"}}]
["Waltraud Dobelmann",{"$f":"VLOOKUP(A14,'Wettkampf 1'!$B$10:$C$45,2,FALSE)","v":"Börgermoor I"},{"$f":"VLOOKUP(A14,'Wettkampf 1'!$B$10:$D$45,3,FALSE)","v":305.9},{"$f":"VLOOKUP($A14,'2'!$B$10:$D$45,3,FALSE)","v":303.7},{"$f":"VLOOKUP($A14,'3'!$B$10:$D$45,3,FALSE)","v":{"v":300,"d":"300.0"}},{"$f":"VLOOKUP($A14,'4'!$B$10:$D$45,3,FALSE)","v":308.5},{"$f":"VLOOKUP($A14,'5'!$B$10:$D$45,3,FALSE)","v":302.8},{"$f":"VLOOKUP($A14,'6'!$B$10:$D$45,3,FALSE)","v":302.8},{"$f":"IF(J14 > 0,K14/J14,0)","v":{"v":303.95,"d":"304.0"}},{"$f":"VLOOKUP(A14,Formelhilfe!$A$9:$H$44,8,FALSE)","v":{"v":6,"d":"6.0"}},{"$f":"SUM(C14:H14)","v":{"v":1823.6999999999998,"d":"1,823.7"}},{"$f":"VLOOKUP($A14,'7'!$B$10:$D$45,3,FALSE)","v":303.6},{"$f":"VLOOKUP($A14,'8'!$B$10:$D$45,3,FALSE)","v":311.1},{"$f":"VLOOKUP($A14,'9'!$B$10:$D$45,3,FALSE)","v":304.6},{"$f":"VLOOKUP($A14,'10'!$B$10:$D$45,3,FALSE)","v":304.7},{"$f":"VLOOKUP($A14,'11'!$B$10:$D$45,3,FALSE)","v":309.2},{"$f":"VLOOKUP($A14,'12'!$B$10:$D$45,3,FALSE)","v":{"v":0,"d":"0.0"}},{"$f":"IF(S14 >0,T14/S14,0)","v":{"v":306.64,"d":"306.6"}},{"$f":"VLOOKUP(A14,Formelhilfe!$A$9:$O$44,15,FALSE)","v":{"v":5,"d":"5.0"}},{"$f":"SUM(L14:Q14)","v":{"v":1533.2,"d":"1,533.2"}},{"$f":"IF(V14>0,W14/V14,0)","v":{"v":305.1727272727272,"d":"305.2"}},{"$f":"VLOOKUP(A14,Formelhilfe!$A$9:$P$44,16,FALSE)","v":{"v":11,"d":"11.0"}},{"$f":"SUM(C14:H14,L14:Q14)","v":{"v":3356.899999999999,"d":"3,356.9"}}]
["Anni Küwen",{"$f":"VLOOKUP(A15,'Wettkampf 1'!$B$10:$C$45,2,FALSE)","v":"Börgermoor I"},{"$f":"VLOOKUP(A15,'Wettkampf 1'!$B$10:$D$45,3,FALSE)","v":299.3},{"$f":"VLOOKUP($A15,'2'!$B$10:$D$45,3,FALSE)","v":300.1},{"$f":"VLOOKUP($A15,'3'!$B$10:$D$45,3,FALSE)","v":306.2},{"$f":"VLOOKUP($A15,'4'!$B$10:$D$45,3,FALSE)","v":312.6},{"$f":"VLOOKUP($A15,'5'!$B$10:$D$45,3,FALSE)","v":297.9},{"$f":"VLOOKUP($A15,'6'!$B$10:$D$45,3,FALSE)","v":308.9},{"$f":"IF(J15 > 0,K15/J15,0)","v":{"v":304.16666666666674,"d":"304.2"}},{"$f":"VLOOKUP(A15,Formelhilfe!$A$9:$H$44,8,FALSE)","v":{"v":6,"d":"6.0"}},{"$f":"SUM(C15:H15)","v":{"v":1825.0000000000005,"d":"1,825.0"}},{"$f":"VLOOKUP($A15,'7'!$B$10:$D$45,3,FALSE)","v":308.6},{"$f":"VLOOKUP($A15,'8'!$B$10:$D$45,3,FALSE)","v":310.7},{"$f":"VLOOKUP($A15,'9'!$B$10:$D$45,3,FALSE)","v":311.1},{"$f":"VLOOKUP($A15,'10'!$B$10:$D$45,3,FALSE)","v":{"v":302,"d":"302.0"}},{"$f":"VLOOKUP($A15,'11'!$B$10:$D$45,3,FALSE)","v":297.6},{"$f":"VLOOKUP($A15,'12'!$B$10:$D$45,3,FALSE)","v":{"v":0,"d":"0.0"}},{"$f":"IF(S15 >0,T15/S15,0)","v":{"v":306,"d":"306.0"}},{"$f":"VLOOKUP(A15,Formelhilfe!$A$9:$O$44,15,FALSE)","v":{"v":5,"d":"5.0"}},{"$f":"SUM(L15:Q15)","v":{"v":1530,"d":"1,530.0"}},{"$f":"IF(V15>0,W15/V15,0)","v":{"v":305,"d":"305.0"}},{"$f":"VLOOKUP(A15,Formelhilfe!$A$9:$P$44,16,FALSE)","v":{"v":11,"d":"11.0"}},{"$f":"SUM(C15:H15,L15:Q15)","v":{"v":3355,"d":"3,355.0"}}]
["Monika Reimann",{"$f":"VLOOKUP(A16,'Wettkampf 1'!$B$10:$C$45,2,FALSE)","v":"Lorup III"},{"$f":"VLOOKUP(A16,'Wettkampf 1'!$B$10:$D$45,3,FALSE)","v":307.6},{"$f":"VLOOKUP($A16,'2'!$B$10:$D$45,3,FALSE)","v":303.8},{"$f":"VLOOKUP($A16,'3'!$B$10:$D$45,3,FALSE)","v":299.9},{"$f":"VLOOKUP($A16,'4'!$B$10:$D$45,3,FALSE)","v":305.8},{"$f":"VLOOKUP($A16,'5'!$B$10:$D$45,3,FALSE)","v":305.2},{"$f":"VLOOKUP($A16,'6'!$B$10:$D$45,3,FALSE)","v":304.6},{"$f":"IF(J16 > 0,K16/J16,0)","v":{"v":304.48333333333335,"d":"304.5"}},{"$f":"VLOOKUP(A16,Formelhilfe!$A$9:$H$44,8,FALSE)","v":{"v":6,"d":"6.0"}},{"$f":"SUM(C16:H16)","v":{"v":1826.9,"d":"1,826.9"}},{"$f":"VLOOKUP($A16,'7'!$B$10:$D$45,3,FALSE)","v":308.3},{"$f":"VLOOKUP($A16,'8'!$B$10:$D$45,3,FALSE)","v":301.8},{"$f":"VLOOKUP($A16,'9'!$B$10:$D$45,3,FALSE)","v":305.7},{"$f":"VLOOKUP($A16,'10'!$B$10:$D$45,3,FALSE)","v":304.1},{"$f":"VLOOKUP($A16,'11'!$B$10:$D$45,3,FALSE)","v":304.8},{"$f":"VLOOKUP($A16,'12'!$B$10:$D$45,3,FALSE)","v":{"v":0,"d":"0.0"}},{"$f":"IF(S16 >0,T16/S16,0)","v":{"v":304.94,"d":"304.9"}},{"$f":"VLOOKUP(A16,Formelhilfe!$A$9:$O$44,15,FALSE)","v":{"v":5,"d":"5.0"}},{"$f":"SUM(L16:Q16)","v":{"v":1524.7,"d":"1,524.7"}},{"$f":"IF(V16>0,W16/V16,0)","v":{"v":304.69090909090914,"d":"304.7"}},{"$f":"VLOOKUP(A16,Formelhilfe!$A$9:$P$44,16,FALSE)","v":{"v":11,"d":"11.0"}},{"$f":"SUM(C16:H16,L16:Q16)","v":{"v":3351.6000000000004,"d":"3,351.6"}}]
["Gertrud Kuchta",{"$f":"VLOOKUP(A17,'Wettkampf 1'!$B$10:$C$45,2,FALSE)","v":"Börger II"},{"$f":"VLOOKUP(A17,'Wettkampf 1'!$B$10:$D$45,3,FALSE)","v":300.7},{"$f":"VLOOKUP($A17,'2'!$B$10:$D$45,3,FALSE)","v":303.7},{"$f":"VLOOKUP($A17,'3'!$B$10:$D$45,3,FALSE)","v":305.3},{"$f":"VLOOKUP($A17,'4'!$B$10:$D$45,3,FALSE)","v":{"v":305,"d":"305.0"}},{"$f":"VLOOKUP($A17,'5'!$B$10:$D$45,3,FALSE)","v":{"v":301,"d":"301.0"}},{"$f":"VLOOKUP($A17,'6'!$B$10:$D$45,3,FALSE)","v":310.4},{"$f":"IF(J17 > 0,K17/J17,0)","v":{"v":304.34999999999997,"d":"304.4"}},{"$f":"VLOOKUP(A17,Formelhilfe!$A$9:$H$44,8,FALSE)","v":{"v":6,"d":"6.0"}},{"$f":"SUM(C17:H17)","v":{"v":1826.1,"d":"1,826.1"}},{"$f":"VLOOKUP($A17,'7'!$B$10:$D$45,3,FALSE)","v":303.7},{"$f":"VLOOKUP($A17,'8'!$B$10:$D$45,3,FALSE)","v":305.8},{"$f":"VLOOKUP($A17,'9'!$B$10:$D$45,3,FALSE)","v":307.5},{"$f":"VLOOKUP($A17,'10'!$B$10:$D$45,3,FALSE)","v":301.6},{"$f":"VLOOKUP($A17,'11'!$B$10:$D$45,3,FALSE)","v":304.8},{"$f":"VLOOKUP($A17,'12'!$B$10:$D$45,3,FALSE)","v":{"v":0,"d":"0.0"}},{"$f":"IF(S17 >0,T17/S17,0)","v":{"v":304.67999999999995,"d":"304.7"}},{"$f":"VLOOKUP(A17,Formelhilfe!$A$9:$O$44,15,FALSE)","v":{"v":5,"d":"5.0"}},{"$f":"SUM(L17:Q17)","v":{"v":1523.3999999999999,"d":"1,523.4"}},{"$f":"IF(V17>0,W17/V17,0)","v":304.5},{"$f":"VLOOKUP(A17,Formelhilfe!$A$9:$P$44,16,FALSE)","v":{"v":11,"d":"11.0"}},{"$f":"SUM(C17:H17,L17:Q17)","v":{"v":3349.5,"d":"3,349.5"}}]
["Carmen Benten",{"$f":"VLOOKUP(A18,'Wettkampf 1'!$B$10:$C$45,2,FALSE)","v":"Ostenwalde II"},{"$f":"VLOOKUP(A18,'Wettkampf 1'!$B$10:$D$45,3,FALSE)","v":301.6},{"$f":"VLOOKUP($A18,'2'!$B$10:$D$45,3,FALSE)","v":308.7},{"$f":"VLOOKUP($A18,'3'!$B$10:$D$45,3,FALSE)","v":308.4},{"$f":"VLOOKUP($A18,'4'!$B$10:$D$45,3,FALSE)","v":304.5},{"$f":"VLOOKUP($A18,'5'!$B$10:$D$45,3,FALSE)","v":296.8},{"$f":"VLOOKUP($A18,'6'!$B$10:$D$45,3,FALSE)","v":297.8},{"$f":"IF(J18 > 0,K18/J18,0)","v":{"v":302.96666666666664,"d":"303.0"}},{"$f":"VLOOKUP(A18,Formelhilfe!$A$9:$H$44,8,FALSE)","v":{"v":6,"d":"6.0"}},{"$f":"SUM(C18:H18)","v":{"v":1817.7999999999997,"d":"1,817.8"}},{"$f":"VLOOKUP($A18,'7'!$B$10:$D$45,3,FALSE)","v":306.8},{"$f":"VLOOKUP($A18,'8'!$B$10:$D$45,3,FALSE)","v":{"v":298,"d":"298.0"}},{"$f":"VLOOKUP($A18,'9'!$B$10:$D$45,3,FALSE)","v":309.8},{"$f":"VLOOKUP($A18,'10'!$B$10:$D$45,3,FALSE)","v":307.2},{"$f":"VLOOKUP($A18,'11'!$B$10:$D$45,3,FALSE)","v":{"v":308,"d":"308.0"}},{"$f":"VLOOKUP($A18,'12'!$B$10:$D$45,3,FALSE)","v":{"v":0,"d":"0.0"}},{"$f":"IF(S18 >0,T18/S18,0)","v":{"v":305.96,"d":"306.0"}},{"$f":"VLOOKUP(A18,Formelhilfe!$A$9:$O$44,15,FALSE)","v":{"v":5,"d":"5.0"}},{"$f":"SUM(L18:Q18)","v":{"v":1529.8,"d":"1,529.8"}},{"$f":"IF(V18>0,W18/V18,0)","v":{"v":304.3272727272727,"d":"304.3"}},{"$f":"VLOOKUP(A18,Formelhilfe!$A$9:$P$44,16,FALSE)","v":{"v":11,"d":"11.0"}},{"$f":"SUM(C18:H18,L18:Q18)","v":{"v":3347.6,"d":"3,347.6"}}]
["Gundula Schwarte",{"$f":"VLOOKUP(A19,'Wettkampf 1'!$B$10:$C$45,2,FALSE)","v":"Börger II"},{"$f":"VLOOKUP(A19,'Wettkampf 1'!$B$10:$D$45,3,FALSE)","v":297.5},{"$f":"VLOOKUP($A19,'2'!$B$10:$D$45,3,FALSE)","v":298.7},{"$f":"VLOOKUP($A19,'3'!$B$10:$D$45,3,FALSE)","v":307.5},{"$f":"VLOOKUP($A19,'4'!$B$10:$D$45,3,FALSE)","v":308.9},{"$f":"VLOOKUP($A19,'5'!$B$10:$D$45,3,FALSE)","v":304.4},{"$f":"VLOOKUP($A19,'6'!$B$10:$D$45,3,FALSE)","v":301.6},{"$f":"IF(J19 > 0,K19/J19,0)","v":{"v":303.09999999999997,"d":"303.1"}},{"$f":"VLOOKUP(A19,Formelhilfe!$A$9:$H$44,8,FALSE)","v":{"v":6,"d":"6.0"}},{"$f":"SUM(C19:H19)","v":{"v":1818.6,"d":"1,818.6"}},{"$f":"VLOOKUP($A19,'7'!$B$10:$D$45,3,FALSE)","v":300.6},{"$f":"VLOOKUP($A19,'8'!$B$10:$D$45,3,FALSE)","v":300.3},{"$f":"VLOOKUP($A19,'9'!$B$10:$D$45,3,FALSE)","v":{"v":303,"d":"303.0"}},{"$f":"VLOOKUP($A19,'10'!$B$10:$D$45,3,FALSE)","v":305.2},{"$f":"VLOOKUP($A19,'11'!$B$10:$D$45,3,FALSE)","v":307.9},{"$f":"VLOOKUP($A19,'12'!$B$10:$D$45,3,FALSE)","v":{"v":0,"d":"0.0"}},{"$f":"IF(S19 >0,T19/S19,0)","v":303.4},{"$f":"VLOOKUP(A19,Formelhilfe!$A$9:$O$44,15,FALSE)","v":{"v":5,"d":"5.0"}},{"$f":"SUM(L19:Q19)","v":{"v":1517,"d":"1,517.0"}},{"$f":"IF(V19>0,W19/V19,0)","v":{"v":303.23636363636365,"d":"303.2"}},{"$f":"VLOOKUP(A19,Formelhilfe!$A$9:$P$44,16,FALSE)","v":{"v":11,"d":"11.0"}},{"$f":"SUM(C19:H19,L19:Q19)","v":{"v":3335.6,"d":"3,335.6"}}]
["Margret Pohlmann",{"$f":"VLOOKUP(A20,'Wettkampf 1'!$B$10:$C$45,2,FALSE)","v":"Neuvrees II"},{"$f":"VLOOKUP(A20,'Wettkampf 1'!$B$10:$D$45,3,FALSE)","v":298.4},{"$f":"VLOOKUP($A20,'2'!$B$10:$D$45,3,FALSE)","v":302.3},{"$f":"VLOOKUP($A20,'3'!$B$10:$D$45,3,FALSE)","v":296.6},{"$f":"VLOOKUP($A20,'4'!$B$10:$D$45,3,FALSE)","v":302.3},{"$f":"VLOOKUP($A20,'5'!$B$10:$D$45,3,FALSE)","v":306.7},{"$f":"VLOOKUP($A20,'6'!$B$10:$D$45,3,FALSE)","v":301.1},{"$f":"IF(J20 > 0,K20/J20,0)","v":{"v":301.23333333333335,"d":"301.2"}},{"$f":"VLOOKUP(A20,Formelhilfe!$A$9:$H$44,8,FALSE)","v":{"v":6,"d":"6.0"}},{"$f":"SUM(C20:H20)","v":{"v":1807.4,"d":"1,807.4"}},{"$f":"VLOOKUP($A20,'7'!$B$10:$D$45,3,FALSE)","v":301.2},{"$f":"VLOOKUP($A20,'8'!$B$10:$D$45,3,FALSE)","v":{"v":302,"d":"302.0"}},{"$f":"VLOOKUP($A20,'9'!$B$10:$D$45,3,FALSE)","v":300.8},{"$f":"VLOOKUP($A20,'10'!$B$10:$D$45,3,FALSE)","v":297.6},{"$f":"VLOOKUP($A20,'11'!$B$10:$D$45,3,FALSE)","v":304.3},{"$f":"VLOOKUP($A20,'12'!$B$10:$D$45,3,FALSE)","v":{"v":0,"d":"0.0"}},{"$f":"IF(S20 >0,T20/S20,0)","v":{"v":301.17999999999995,"d":"301.2"}},{"$f":"VLOOKUP(A20,Formelhilfe!$A$9:$O$44,15,FALSE)","v":{"v":5,"d":"5.0"}},{"$f":"SUM(L20:Q20)","v":{"v":1505.8999999999999,"d":"1,505.9"}},{"$f":"IF(V20>0,W20/V20,0)","v":{"v":301.20909090909095,"d":"301.2"}},{"$f":"VLOOKUP(A20,Formelhilfe!$A$9:$P$44,16,FALSE)","v":{"v":11,"d":"11.0"}},{"$f":"SUM(C20:H20,L20:Q20)","v":{"v":3313.3,"d":"3,313.3"}}]
["Annette Schwarte",{"$f":"VLOOKUP(A21,'Wettkampf 1'!$B$10:$C$45,2,FALSE)","v":"Börger II"},{"$f":"VLOOKUP(A21,'Wettkampf 1'!$B$10:$D$45,3,FALSE)","v":301.2},{"$f":"VLOOKUP($A21,'2'!$B$10:$D$45,3,FALSE)","v":298.2},{"$f":"VLOOKUP($A21,'3'!$B$10:$D$45,3,FALSE)","v":306.1},{"$f":"VLOOKUP($A21,'4'!$B$10:$D$45,3,FALSE)","v":304.3},{"$f":"VLOOKUP($A21,'5'!$B$10:$D$45,3,FALSE)","v":301.2},{"$f":"VLOOKUP($A21,'6'!$B$10:$D$45,3,FALSE)","v":305.3},{"$f":"IF(J21 > 0,K21/J21,0)","v":{"v":302.71666666666664,"d":"302.7"}},{"$f":"VLOOKUP(A21,Formelhilfe!$A$9:$H$44,8,FALSE)","v":{"v":6,"d":"6.0"}},{"$f":"SUM(C21:H21)","v":{"v":1816.3,"d":"1,816.3"}},{"$f":"VLOOKUP($A21,'7'!$B$10:$D$45,3,FALSE)","v":296.1},{"$f":"VLOOKUP($A21,'8'!$B$10:$D$45,3,FALSE)","v":303.1},{"$f":"VLOOKUP($A21,'9'!$B$10:$D$45,3,FALSE)","v":{"v":299,"d":"299.0"}},{"$f":"VLOOKUP($A21,'10'!$B$10:$D$45,3,FALSE)","v":304.5},{"$f":"VLOOKUP($A21,'11'!$B$10:$D$45,3,FALSE)","v":290.6},{"$f":"VLOOKUP($A21,'12'!$B$10:$D$45,3,FALSE)","v":{"v":0,"d":"0.0"}},{"$f":"IF(S21 >0,T21/S21,0)","v":{"v":298.66,"d":"298.7"}},{"$f":"VLOOKUP(A21,Formelhilfe!$A$9:$O$44,15,FALSE)","v":{"v":5,"d":"5.0"}},{"$f":"SUM(L21:Q21)","v":{"v":1493.3000000000002,"d":"1,493.3"}},{"$f":"IF(V21>0,W21/V21,0)","v":{"v":300.8727272727273,"d":"300.9"}},{"$f":"VLOOKUP(A21,Formelhilfe!$A$9:$P$44,16,FALSE)","v":{"v":11,"d":"11.0"}},{"$f":"SUM(C21:H21,L21:Q21)","v":{"v":3309.6,"d":"3,309.6"}}]
["Nina Krömer",{"$f":"VLOOKUP(A22,'Wettkampf 1'!$B$10:$C$45,2,FALSE)","v":"Lorup III"},{"$f":"VLOOKUP(A22,'Wettkampf 1'!$B$10:$D$45,3,FALSE)","v":274.4},{"$f":"VLOOKUP($A22,'2'!$B$10:$D$45,3,FALSE)","v":292.3},{"$f":"VLOOKUP($A22,'3'!$B$10:$D$45,3,FALSE)","v":304.6},{"$f":"VLOOKUP($A22,'4'!$B$10:$D$45,3,FALSE)","v":{"v":298,"d":"298.0"}},{"$f":"VLOOKUP($A22,'5'!$B$10:$D$45,3,FALSE)","v":287.8},{"$f":"VLOOKUP($A22,'6'!$B$10:$D$45,3,FALSE)","v":305.4},{"$f":"IF(J22 > 0,K22/J22,0)","v":{"v":293.75,"d":"293.8"}},{"$f":"VLOOKUP(A22,Formelhilfe!$A$9:$H$44,8,FALSE)","v":{"v":6,"d":"6.0"}},{"$f":"SUM(C22:H22)","v":{"v":1762.5,"d":"1,762.5"}},{"$f":"VLOOKUP($A22,'7'!$B$10:$D$45,3,FALSE)","v":299.7},{"$f":"VLOOKUP($A22,'8'!$B$10:$D$45,3,FALSE)","v":292.7},{"$f":"VLOOKUP($A22,'9'!$B$10:$D$45,3,FALSE)","v":{"v":296,"d":"296.0"}},{"$f":"VLOOKUP($A22,'10'!$B$10:$D$45,3,FALSE)","v":303.1},{"$f":"VLOOKUP($A22,'11'!$B$10:$D$45,3,FALSE)","v":291.6},{"$f":"VLOOKUP($A22,'12'!$B$10:$D$45,3,FALSE)","v":{"v":0,"d":"0.0"}},{"$f":"IF(S22 >0,T22/S22,0)","v":{"v":296.62,"d":"296.6"}},{"$f":"VLOOKUP(A22,Formelhilfe!$A$9:$O$44,15,FALSE)","v":{"v":5,"d":"5.0"}},{"$f":"SUM(L22:Q22)","v":{"v":1483.1,"d":"1,483.1"}},{"$f":"IF(V22>0,W22/V22,0)","v":{"v":295.0545454545454,"d":"295.1"}},{"$f":"VLOOKUP(A22,Formelhilfe!$A$9:$P$44,16,FALSE)","v":{"v":11,"d":"11.0"}},{"$f":"SUM(C22:H22,L22:Q22)","v":{"v":3245.5999999999995,"d":"3,245.6"}}]
["Silvia Junge",{"$f":"VLOOKUP(A23,'Wettkampf 1'!$B$10:$C$45,2,FALSE)","v":"Neuvrees II"},{"$f":"VLOOKUP(A23,'Wettkampf 1'!$B$10:$D$45,3,FALSE)","v":296.5},{"$f":"VLOOKUP($A23,'2'!$B$10:$D$45,3,FALSE)","v":294.8},{"$f":"VLOOKUP($A23,'3'!$B$10:$D$45,3,FALSE)","v":{"v":283,"d":"283.0"}},{"$f":"VLOOKUP($A23,'4'!$B$10:$D$45,3,FALSE)","v":280.9},{"$f":"VLOOKUP($A23,'5'!$B$10:$D$45,3,FALSE)","v":290.8},{"$f":"VLOOKUP($A23,'6'!$B$10:$D$45,3,FALSE)","v":299.5},{"$f":"IF(J23 > 0,K23/J23,0)","v":{"v":290.91666666666663,"d":"290.9"}},{"$f":"VLOOKUP(A23,Formelhilfe!$A$9:$H$44,8,FALSE)","v":{"v":6,"d":"6.0"}},{"$f":"SUM(C23:H23)","v":{"v":1745.4999999999998,"d":"1,745.5"}},{"$f":"VLOOKUP($A23,'7'!$B$10:$D$45,3,FALSE)","v":300.3},{"$f":"VLOOKUP($A23,'8'!$B$10:$D$45,3,FALSE)","v":299.8},{"$f":"VLOOKUP($A23,'9'!$B$10:$D$45,3,FALSE)","v":247.4},{"$f":"VLOOKUP($A23,'10'!$B$10:$D$45,3,FALSE)","v":297.2},{"$f":"VLOOKUP($A23,'11'!$B$10:$D$45,3,FALSE)","v":301.9},{"$f":"VLOOKUP($A23,'12'!$B$10:$D$45,3,FALSE)","v":{"v":0,"d":"0.0"}},{"$f":"IF(S23 >0,T23/S23,0)","v":{"v":289.32,"d":"289.3"}},{"$f":"VLOOKUP(A23,Formelhilfe!$A$9:$O$44,15,FALSE)","v":{"v":5,"d":"5.0"}},{"$f":"SUM(L23:Q23)","v":{"v":1446.6,"d":"1,446.6"}},{"$f":"IF(V23>0,W23/V23,0)","v":{"v":290.1909090909091,"d":"290.2"}},{"$f":"VLOOKUP(A23,Formelhilfe!$A$9:$P$44,16,FALSE)","v":{"v":11,"d":"11.0"}},{"$f":"SUM(C23:H23,L23:Q23)","v":{"v":3192.1,"d":"3,192.1"}}]
["Jasmin Kramer",{"$f":"VLOOKUP(A24,'Wettkampf 1'!$B$10:$C$45,2,FALSE)","v":"Börgermoor I"},{"$f":"VLOOKUP(A24,'Wettkampf 1'!$B$10:$D$45,3,FALSE)","v":298.8},{"$f":"VLOOKUP($A24,'2'!$B$10:$D$45,3,FALSE)","v":302.4},{"$f":"VLOOKUP($A24,'3'!$B$10:$D$45,3,FALSE)","v":306.2},{"$f":"VLOOKUP($A24,'4'!$B$10:$D$45,3,FALSE)","v":310.5},{"$f":"VLOOKUP($A24,'5'!$B$10:$D$45,3,FALSE)","v":310.3},{"$f":"VLOOKUP($A24,'6'!$B$10:$D$45,3,FALSE)","v":309.3},{"$f":"IF(J24 > 0,K24/J24,0)","v":{"v":306.25,"d":"306.3"}},{"$f":"VLOOKUP(A24,Formelhilfe!$A$9:$H$44,8,FALSE)","v":{"v":6,"d":"6.0"}},{"$f":"SUM(C24:H24)","v":{"v":1837.5,"d":"1,837.5"}},{"$f":"VLOOKUP($A24,'7'!$B$10:$D$45,3,FALSE)","v":311.7},{"$f":"VLOOKUP($A24,'8'!$B$10:$D$45,3,FALSE)","v":312.3},{"$f":"VLOOKUP($A24,'9'!$B$10:$D$45,3,FALSE)","v":312.3},{"$f":"VLOOKUP($A24,'10'!$B$10:$D$45,3,FALSE)","v":305.4},{"$f":"VLOOKUP($A24,'11'!$B$10:$D$45,3,FALSE)","v":{"v":0,"d":"0.0"}},{"$f":"VLOOKUP($A24,'12'!$B$10:$D$45,3,FALSE)","v":{"v":0,"d":"0.0"}},{"$f":"IF(S24 >0,T24/S24,0)","v":{"v":310.42499999999995,"d":"310.4"}},{"$f":"VLOOKUP(A24,Formelhilfe!$A$9:$O$44,15,FALSE)","v":{"v":4,"d":"4.0"}},{"$f":"SUM(L24:Q24)","v":{"v":1241.6999999999998,"d":"1,241.7"}},{"$f":"IF(V24>0,W24/V24,0)","v":{"v":307.92,"d":"307.9"}},{"$f":"VLOOKUP(A24,Formelhilfe!$A$9:$P$44,16,FALSE)","v":{"v":10,"d":"10.0"}},{"$f":"SUM(C24:H24,L24:Q24)","v":{"v":3079.2000000000003,"d":"3,079.2"}}]
["Rita Hanekamp",{"$f":"VLOOKUP(A25,'Wettkampf 1'!$B$10:$C$45,2,FALSE)","v":"Spahnharrenstätte I"},{"$f":"VLOOKUP(A25,'Wettkampf 1'!$B$10:$D$45,3,FALSE)","v":295.1},{"$f":"VLOOKUP($A25,'2'!$B$10:$D$45,3,FALSE)","v":300.5},{"$f":"VLOOKUP($A25,'3'!$B$10:$D$45,3,FALSE)","v":288.4},{"$f":"VLOOKUP($A25,'4'!$B$10:$D$45,3,FALSE)","v":296.9},{"$f":"VLOOKUP($A25,'5'!$B$10:$D$45,3,FALSE)","v":287.8},{"$f":"VLOOKUP($A25,'6'!$B$10:$D$45,3,FALSE)","v":{"v":287,"d":"287.0"}},{"$f":"IF(J25 > 0,K25/J25,0)","v":{"v":292.6166666666667,"d":"292.6"}},{"$f":"VLOOKUP(A25,Formelhilfe!$A$9:$H$44,8,FALSE)","v":{"v":6,"d":"6.0"}},{"$f":"SUM(C25:H25)","v":{"v":1755.7,"d":"1,755.7"}},{"$f":"VLOOKUP($A25,'7'!$B$10:$D$45,3,FALSE)","v":{"v":0,"d":"0.0"}},{"$f":"VLOOKUP($A25,'8'!$B$10:$D$45,3,FALSE)","v":284.9},{"$f":"VLOOKUP($A25,'9'!$B$10:$D$45,3,FALSE)","v":296.3},{"$f":"VLOOKUP($A25,'10'!$B$10:$D$45,3,FALSE)","v":295.2},{"$f":"VLOOKUP($A25,'11'!$B$10:$D$45,3,FALSE)","v":291.8},{"$f":"VLOOKUP($A25,'12'!$B$10:$D$45,3,FALSE)","v":{"v":0,"d":"0.0"}},{"$f":"IF(S25 >0,T25/S25,0)","v":{"v":292.05,"d":"292.1"}},{"$f":"VLOOKUP(A25,Formelhilfe!$A$9:$O$44,15,FALSE)","v":{"v":4,"d":"4.0"}},{"$f":"SUM(L25:Q25)","v":{"v":1168.2,"d":"1,168.2"}},{"$f":"IF(V25>0,W25/V25,0)","v":{"v":292.39,"d":"292.4"}},{"$f":"VLOOKUP(A25,Formelhilfe!$A$9:$P$44,16,FALSE)","v":{"v":10,"d":"10.0"}},{"$f":"SUM(C25:H25,L25:Q25)","v":{"v":2923.9,"d":"2,923.9"}}]
["Petra Dödtmann",{"$f":"VLOOKUP(A26,'Wettkampf 1'!$B$10:$C$45,2,FALSE)","v":"Börger II"},{"$f":"VLOOKUP(A26,'Wettkampf 1'!$B$10:$D$45,3,FALSE)","v":{"v":0,"d":"0.0"}},{"$f":"VLOOKUP($A26,'2'!$B$10:$D$45,3,FALSE)","v":304.5},{"$f":"VLOOKUP($A26,'3'!$B$10:$D$45,3,FALSE)","v":{"v":0,"d":"0.0"}},{"$f":"VLOOKUP($A26,'4'!$B$10:$D$45,3,FALSE)","v":315.1},{"$f":"VLOOKUP($A26,'5'!$B$10:$D$45,3,FALSE)","v":305.4},{"$f":"VLOOKUP($A26,'6'!$B$10:$D$45,3,FALSE)","v":309.8},{"$f":"IF(J26 > 0,K26/J26,0)","v":308.7},{"$f":"VLOOKUP(A26,Formelhilfe!$A$9:$H$44,8,FALSE)","v":{"v":4,"d":"4.0"}},{"$f":"SUM(C26:H26)","v":{"v":1234.8,"d":"1,234.8"}},{"$f":"VLOOKUP($A26,'7'!$B$10:$D$45,3,FALSE)","v":310.5},{"$f":"VLOOKUP($A26,'8'!$B$10:$D$45,3,FALSE)","v":308.9},{"$f":"VLOOKUP($A26,'9'!$B$10:$D$45,3,FALSE)","v":307.6},{"$f":"VLOOKUP($A26,'10'!$B$10:$D$45,3,FALSE)","v":309.9},{"$f":"VLOOKUP($A26,'11'!$B$10:$D$45,3,FALSE)","v":312.3},{"$f":"VLOOKUP($A26,'12'!$B$10:$D$45,3,FALSE)","v":{"v":0,"d":"0.0"}},{"$f":"IF(S26 >0,T26/S26,0)","v":{"v":309.84000000000003,"d":"309.8"}},{"$f":"VLOOKUP(A26,Formelhilfe!$A$9:$O$44,15,FALSE)","v":{"v":5,"d":"5.0"}},{"$f":"SUM(L26:Q26)","v":{"v":1549.2,"d":"1,549.2"}},{"$f":"IF(V26>0,W26/V26,0)","v":{"v":309.3333333333333,"d":"309.3"}},{"$f":"VLOOKUP(A26,Formelhilfe!$A$9:$P$44,16,FALSE)","v":{"v":9,"d":"9.0"}},{"$f":"SUM(C26:H26,L26:Q26)","v":{"v":2784,"d":"2,784.0"}}]
["Sarah Meiners",{"$f":"VLOOKUP(A27,'Wettkampf 1'!$B$10:$C$45,2,FALSE)","v":"Ostenwalde II"},{"$f":"VLOOKUP(A27,'Wettkampf 1'!$B$10:$D$45,3,FALSE)","v":292.6},{"$f":"VLOOKUP($A27,'2'!$B$10:$D$45,3,FALSE)","v":291.6},{"$f":"VLOOKUP($A27,'3'!$B$10:$D$45,3,FALSE)","v":{"v":286,"d":"286.0"}},{"$f":"VLOOKUP($A27,'4'!$B$10:$D$45,3,FALSE)","v":290.4},{"$f":"VLOOKUP($A27,'5'!$B$10:$D$45,3,FALSE)","v":286.8},{"$f":"VLOOKUP($A27,'6'!$B$10:$D$45,3,FALSE)","v":278.1},{"$f":"IF(J27 > 0,K27/J27,0)","v":{"v":287.5833333333333,"d":"287.6"}},{"$f":"VLOOKUP(A27,Formelhilfe!$A$9:$H$44,8,FALSE)","v":{"v":6,"d":"6.0"}},{"$f":"SUM(C27:H27)","v":{"v":1725.5,"d":"1,725.5"}},{"$f":"VLOOKUP($A27,'7'!$B$10:$D$45,3,FALSE)","v":286.3},{"$f":"VLOOKUP($A27,'8'!$B$10:$D$45,3,FALSE)","v":{"v":0,"d":"0.0"}},{"$f":"VLOOKUP($A27,'9'!$B$10:$D$45,3,FALSE)","v":291.9},{"$f":"VLOOKUP($A27,'10'!$B$10:$D$45,3,FALSE)","v":291.9},{"$f":"VLOOKUP($A27,'11'!$B$10:$D$45,3,FALSE)","v":{"v":0,"d":"0.0"}},{"$f":"VLOOKUP($A27,'12'!$B$10:$D$45,3,FALSE)","v":{"v":0,"d":"0.0"}},{"$f":"IF(S27 >0,T27/S27,0)","v":{"v":290.03333333333336,"d":"290.0"}},{"$f":"VLOOKUP(A27,Formelhilfe!$A$9:$O$44,15,FALSE)","v":{"v":3,"d":"3.0"}},{"$f":"SUM(L27:Q27)","v":870.1},{"$f":"IF(V27>0,W27/V27,0)","v":288.4},{"$f":"VLOOKUP(A27,Formelhilfe!$A$9:$P$44,16,FALSE)","v":{"v":9,"d":"9.0"}},{"$f":"SUM(C27:H27,L27:Q27)","v":{"v":2595.6,"d":"2,595.6"}}]
["Helga Meiners",{"$f":"VLOOKUP(A28,'Wettkampf 1'!$B$10:$C$45,2,FALSE)","v":"Ostenwalde II"},{"$f":"VLOOKUP(A28,'Wettkampf 1'!$B$10:$D$45,3,FALSE)","v":302.1},{"$f":"VLOOKUP($A28,'2'!$B$10:$D$45,3,FALSE)","v":293.4},{"$f":"VLOOKUP($A28,'3'!$B$10:$D$45,3,FALSE)","v":299.3},{"$f":"VLOOKUP($A28,'4'!$B$10:$D$45,3,FALSE)","v":298.7},{"$f":"VLOOKUP($A28,'5'!$B$10:$D$45,3,FALSE)","v":299.4},{"$f":"VLOOKUP($A28,'6'!$B$10:$D$45,3,FALSE)","v":299.9},{"$f":"IF(J28 > 0,K28/J28,0)","v":298.8},{"$f":"VLOOKUP(A28,Formelhilfe!$A$9:$H$44,8,FALSE)","v":{"v":6,"d":"6.0"}},{"$f":"SUM(C28:H28)","v":{"v":1792.8000000000002,"d":"1,792.8"}},{"$f":"VLOOKUP($A28,'7'!$B$10:$D$45,3,FALSE)","v":296.1},{"$f":"VLOOKUP($A28,'8'!$B$10:$D$45,3,FALSE)","v":291.6},{"$f":"VLOOKUP($A28,'9'!$B$10:$D$45,3,FALSE)","v":{"v":0,"d":"0.0"}},{"$f":"VLOOKUP($A28,'10'!$B$10:$D$45,3,FALSE)","v":{"v":0,"d":"0.0"}},{"$f":"VLOOKUP($A28,'11'!$B$10:$D$45,3,FALSE)","v":{"v":0,"d":"0.0"}},{"$f":"VLOOKUP($A28,'12'!$B$10:$D$45,3,FALSE)","v":{"v":0,"d":"0.0"}},{"$f":"IF(S28 >0,T28/S28,0)","v":{"v":293.85,"d":"293.9"}},{"$f":"VLOOKUP(A28,Formelhilfe!$A$9:$O$44,15,FALSE)","v":{"v":2,"d":"2.0"}},{"$f":"SUM(L28:Q28)","v":587.7},{"$f":"IF(V28>0,W28/V28,0)","v":{"v":297.5625,"d":"297.6"}},{"$f":"VLOOKUP(A28,Formelhilfe!$A$9:$P$44,16,FALSE)","v":{"v":8,"d":"8.0"}},{"$f":"SUM(C28:H28,L28:Q28)","v":{"v":2380.5,"d":"2,380.5"}}]
["Sarah Breer",{"$f":"VLOOKUP(A29,'Wettkampf 1'!$B$10:$C$45,2,FALSE)","v":"Börger II"},{"$f":"VLOOKUP(A29,'Wettkampf 1'!$B$10:$D$45,3,FALSE)","v":288.8},{"$f":"VLOOKUP($A29,'2'!$B$10:$D$45,3,FALSE)","v":283.5},{"$f":"VLOOKUP($A29,'3'!$B$10:$D$45,3,FALSE)","v":284.3},{"$f":"VLOOKUP($A29,'4'!$B$10:$D$45,3,FALSE)","v":{"v":0,"d":"0.0"}},{"$f":"VLOOKUP($A29,'5'!$B$10:$D$45,3,FALSE)","v":266.4},{"$f":"VLOOKUP($A29,'6'!$B$10:$D$45,3,FALSE)","v":{"v":271.85,"d":"271.9"}},{"$f":"IF(J29 > 0,K29/J29,0)","v":{"v":278.96999999999997,"d":"279.0"}},{"$f":"VLOOKUP(A29,Formelhilfe!$A$9:$H$44,8,FALSE)","v":{"v":5,"d":"5.0"}},{"$f":"SUM(C29:H29)","v":{"v":1394.85,"d":"1,394.9"}},{"$f":"VLOOKUP($A29,'7'!$B$10:$D$45,3,FALSE)","v":266.2},{"$f":"VLOOKUP($A29,'8'!$B$10:$D$45,3,FALSE)","v":{"v":0,"d":"0.0"}},{"$f":"VLOOKUP($A29,'9'!$B$10:$D$45,3,FALSE)","v":{"v":0,"d":"0.0"}},{"$f":"VLOOKUP($A29,'10'!$B$10:$D$45,3,FALSE)","v":{"v":0,"d":"0.0"}},{"$f":"VLOOKUP($A29,'11'!$B$10:$D$45,3,FALSE)","v":{"v":0,"d":"0.0"}},{"$f":"VLOOKUP($A29,'12'!$B$10:$D$45,3,FALSE)","v":{"v":0,"d":"0.0"}},{"$f":"IF(S29 >0,T29/S29,0)","v":266.2},{"$f":"VLOOKUP(A29,Formelhilfe!$A$9:$O$44,15,FALSE)","v":{"v":1,"d":"1.0"}},{"$f":"SUM(L29:Q29)","v":266.2},{"$f":"IF(V29>0,W29/V29,0)","v":{"v":276.84166666666664,"d":"276.8"}},{"$f":"VLOOKUP(A29,Formelhilfe!$A$9:$P$44,16,FALSE)","v":{"v":6,"d":"6.0"}},{"$f":"SUM(C29:H29,L29:Q29)","v":{"v":1661.05,"d":"1,661.1"}}]
["Harma Steenken",{"$f":"VLOOKUP(A30,'Wettkampf 1'!$B$10:$C$45,2,FALSE)","v":"Neuvrees II"},{"$f":"VLOOKUP(A30,'Wettkampf 1'!$B$10:$D$45,3,FALSE)","v":275.9},{"$f":"VLOOKUP($A30,'2'!$B$10:$D$45,3,FALSE)","v":297.5},{"$f":"VLOOKUP($A30,'3'!$B$10:$D$45,3,FALSE)","v":{"v":0,"d":"0.0"}},{"$f":"VLOOKUP($A30,'4'!$B$10:$D$45,3,FALSE)","v":268.4},{"$f":"VLOOKUP($A30,'5'!$B$10:$D$45,3,FALSE)","v":{"v":0,"d":"0.0"}},{"$f":"VLOOKUP($A30,'6'!$B$10:$D$45,3,FALSE)","v":{"v":0,"d":"0.0"}},{"$f":"IF(J30 > 0,K30/J30,0)","v":{"v":280.59999999999997,"d":"280.6"}},{"$f":"VLOOKUP(A30,Formelhilfe!$A$9:$H$44,8,FALSE)","v":{"v":3,"d":"3.0"}},{"$f":"SUM(C30:H30)","v":841.8},{"$f":"VLOOKUP($A30,'7'!$B$10:$D$45,3,FALSE)","v":261.1},{"$f":"VLOOKUP($A30,'8'!$B$10:$D$45,3,FALSE)","v":{"v":0,"d":"0.0"}},{"$f":"VLOOKUP($A30,'9'!$B$10:$D$45,3,FALSE)","v":{"v":282,"d":"282.0"}},{"$f":"VLOOKUP($A30,'10'!$B$10:$D$45,3,FALSE)","v":{"v":0,"d":"0.0"}},{"$f":"VLOOKUP($A30,'11'!$B$10:$D$45,3,FALSE)","v":{"v":0,"d":"0.0"}},{"$f":"VLOOKUP($A30,'12'!$B$10:$D$45,3,FALSE)","v":{"v":0,"d":"0.0"}},{"$f":"IF(S30 >0,T30/S30,0)","v":{"v":271.55,"d":"271.6"}},{"$f":"VLOOKUP(A30,Formelhilfe!$A$9:$O$44,15,FALSE)","v":{"v":2,"d":"2.0"}},{"$f":"SUM(L30:Q30)","v":543.1},{"$f":"IF(V30>0,W30/V30,0)","v":{"v":276.98,"d":"277.0"}},{"$f":"VLOOKUP(A30,Formelhilfe!$A$9:$P$44,16,FALSE)","v":{"v":5,"d":"5.0"}},{"$f":"SUM(C30:H30,L30:Q30)","v":{"v":1384.9,"d":"1,384.9"}}]
["Margret Büter",{"$f":"VLOOKUP(A31,'Wettkampf 1'!$B$10:$C$45,2,FALSE)","v":"Lorup III"},{"$f":"VLOOKUP(A31,'Wettkampf 1'!$B$10:$D$45,3,FALSE)","v":288.4},{"$f":"VLOOKUP($A31,'2'!$B$10:$D$45,3,FALSE)","v":277.1},{"$f":"VLOOKUP($A31,'3'!$B$10:$D$45,3,FALSE)","v":{"v":0,"d":"0.0"}},{"$f":"VLOOKUP($A31,'4'!$B$10:$D$45,3,FALSE)","v":{"v":0,"d":"0.0"}},{"$f":"VLOOKUP($A31,'5'!$B$10:$D$45,3,FALSE)","v":{"v":0,"d":"0.0"}},{"$f":"VLOOKUP($A31,'6'!$B$10:$D$45,3,FALSE)","v":{"v":0,"d":"0.0"}},{"$f":"IF(J31 > 0,K31/J31,0)","v":{"v":282.75,"d":"282.8"}},{"$f":"VLOOKUP(A31,Formelhilfe!$A$9:$H$44,8,FALSE)","v":{"v":2,"d":"2.0"}},{"$f":"SUM(C31:H31)","v":565.5},{"$f":"VLOOKUP($A31,'7'!$B$10:$D$45,3,FALSE)","v":{"v":0,"d":"0.0"}},{"$f":"VLOOKUP($A31,'8'!$B$10:$D$45,3,FALSE)","v":{"v":0,"d":"0.0"}},{"$f":"VLOOKUP($A31,'9'!$B$10:$D$45,3,FALSE)","v":{"v":0,"d":"0.0"}},{"$f":"VLOOKUP($A31,'10'!$B$10:$D$45,3,FALSE)","v":{"v":0,"d":"0.0"}},{"$f":"VLOOKUP($A31,'11'!$B$10:$D$45,3,FALSE)","v":{"v":0,"d":"0.0"}},{"$f":"VLOOKUP($A31,'12'!$B$10:$D$45,3,FALSE)","v":{"v":0,"d":"0.0"}},{"$f":"IF(S31 >0,T31/S31,0)","v":{"v":0,"d":"0.0"}},{"$f":"VLOOKUP(A31,Formelhilfe!$A$9:$O$44,15,FALSE)","v":{"v":0,"d":"0.0"}},{"$f":"SUM(L31:Q31)","v":{"v":0,"d":"0.0"}},{"$f":"IF(V31>0,W31/V31,0)","v":{"v":282.75,"d":"282.8"}},{"$f":"VLOOKUP(A31,Formelhilfe!$A$9:$P$44,16,FALSE)","v":{"v":2,"d":"2.0"}},{"$f":"SUM(C31:H31,L31:Q31)","v":565.5}]
["Evelyn Feder",{"$f":"VLOOKUP(A32,'Wettkampf 1'!$B$10:$C$45,2,FALSE)","v":"Ostenwalde II"},{"$f":"VLOOKUP(A32,'Wettkampf 1'!$B$10:$D$45,3,FALSE)","v":{"v":0,"d":"0.0"}},{"$f":"VLOOKUP($A32,'2'!$B$10:$D$45,3,FALSE)","v":{"v":0,"d":"0.0"}},{"$f":"VLOOKUP($A32,'3'!$B$10:$D$45,3,FALSE)","v":{"v":0,"d":"0.0"}},{"$f":"VLOOKUP($A32,'4'!$B$10:$D$45,3,FALSE)","v":{"v":0,"d":"0.0"}},{"$f":"VLOOKUP($A32,'5'!$B$10:$D$45,3,FALSE)","v":{"v":0,"d":"0.0"}},{"$f":"VLOOKUP($A32,'6'!$B$10:$D$45,3,FALSE)","v":{"v":0,"d":"0.0"}},{"$f":"IF(J32 > 0,K32/J32,0)","v":{"v":0,"d":"0.0"}},{"$f":"VLOOKUP(A32,Formelhilfe!$A$9:$H$44,8,FALSE)","v":{"v":0,"d":"0.0"}},{"$f":"SUM(C32:H32)","v":{"v":0,"d":"0.0"}},{"$f":"VLOOKUP($A32,'7'!$B$10:$D$45,3,FALSE)","v":{"v":0,"d":"0.0"}},{"$f":"VLOOKUP($A32,'8'!$B$10:$D$45,3,FALSE)","v":299.5},{"$f":"VLOOKUP($A32,'9'!$B$10:$D$45,3,FALSE)","v":{"v":0,"d":"0.0"}},{"$f":"VLOOKUP($A32,'10'!$B$10:$D$45,3,FALSE)","v":{"v":0,"d":"0.0"}},{"$f":"VLOOKUP($A32,'11'!$B$10:$D$45,3,FALSE)","v":{"v":0,"d":"0.0"}},{"$f":"VLOOKUP($A32,'12'!$B$10:$D$45,3,FALSE)","v":{"v":0,"d":"0.0"}},{"$f":"IF(S32 >0,T32/S32,0)","v":299.5},{"$f":"VLOOKUP(A32,Formelhilfe!$A$9:$O$44,15,FALSE)","v":{"v":1,"d":"1.0"}},{"$f":"SUM(L32:Q32)","v":299.5},{"$f":"IF(V32>0,W32/V32,0)","v":299.5},{"$f":"VLOOKUP(A32,Formelhilfe!$A$9:$P$44,16,FALSE)","v":{"v":1,"d":"1.0"}},{"$f":"SUM(C32:H32,L32:Q32)","v":299.5}]
["Anna -Maria Wimberg",{"$f":"VLOOKUP(A33,'Wettkampf 1'!$B$10:$C$45,2,FALSE)","v":"Ostenwalde II"},{"$f":"VLOOKUP(A33,'Wettkampf 1'!$B$10:$D$45,3,FALSE)","v":{"v":0,"d":"0.0"}},{"$f":"VLOOKUP($A33,'2'!$B$10:$D$45,3,FALSE)","v":{"v":0,"d":"0.0"}},{"$f":"VLOOKUP($A33,'3'!$B$10:$D$45,3,FALSE)","v":{"v":0,"d":"0.0"}},{"$f":"VLOOKUP($A33,'4'!$B$10:$D$45,3,FALSE)","v":{"v":0,"d":"0.0"}},{"$f":"VLOOKUP($A33,'5'!$B$10:$D$45,3,FALSE)","v":{"v":0,"d":"0.0"}},{"$f":"VLOOKUP($A33,'6'!$B$10:$D$45,3,FALSE)","v":{"v":0,"d":"0.0"}},{"$f":"IF(J33 > 0,K33/J33,0)","v":{"v":0,"d":"0.0"}},{"$f":"VLOOKUP(A33,Formelhilfe!$A$9:$H$44,8,FALSE)","v":{"v":0,"d":"0.0"}},{"$f":"SUM(C33:H33)","v":{"v":0,"d":"0.0"}},{"$f":"VLOOKUP($A33,'7'!$B$10:$D$45,3,FALSE)","v":{"v":0,"d":"0.0"}},{"$f":"VLOOKUP($A33,'8'!$B$10:$D$45,3,FALSE)","v":{"v":0,"d":"0.0"}},{"$f":"VLOOKUP($A33,'9'!$B$10:$D$45,3,FALSE)","v":{"v":0,"d":"0.0"}},{"$f":"VLOOKUP($A33,'10'!$B$10:$D$45,3,FALSE)","v":{"v":0,"d":"0.0"}},{"$f":"VLOOKUP($A33,'11'!$B$10:$D$45,3,FALSE)","v":296.8},{"$f":"VLOOKUP($A33,'12'!$B$10:$D$45,3,FALSE)","v":{"v":0,"d":"0.0"}},{"$f":"IF(S33 >0,T33/S33,0)","v":296.8},{"$f":"VLOOKUP(A33,Formelhilfe!$A$9:$O$44,15,FALSE)","v":{"v":1,"d":"1.0"}},{"$f":"SUM(L33:Q33)","v":296.8},{"$f":"IF(V33>0,W33/V33,0)","v":296.8},{"$f":"VLOOKUP(A33,Formelhilfe!$A$9:$P$44,16,FALSE)","v":{"v":1,"d":"1.0"}},{"$f":"SUM(C33:H33,L33:Q33)","v":296.8}]
["Schütze 35",{"$f":"VLOOKUP(A34,'Wettkampf 1'!$B$10:$C$45,2,FALSE)","v":"Spahnharrenstätte I"},{"$f":"VLOOKUP(A34,'Wettkampf 1'!$B$10:$D$45,3,FALSE)","v":{"v":0,"d":"0.0"}},{"$f":"VLOOKUP($A34,'2'!$B$10:$D$45,3,FALSE)","v":278.6},{"$f":"VLOOKUP($A34,'3'!$B$10:$D$45,3,FALSE)","v":{"v":0,"d":"0.0"}},{"$f":"VLOOKUP($A34,'4'!$B$10:$D$45,3,FALSE)","v":{"v":0,"d":"0.0"}},{"$f":"VLOOKUP($A34,'5'!$B$10:$D$45,3,FALSE)","v":{"v":0,"d":"0.0"}},{"$f":"VLOOKUP($A34,'6'!$B$10:$D$45,3,FALSE)","v":{"v":0,"d":"0.0"}},{"$f":"IF(J34 > 0,K34/J34,0)","v":278.6},{"$f":"VLOOKUP(A34,Formelhilfe!$A$9:$H$44,8,FALSE)","v":{"v":1,"d":"1.0"}},{"$f":"SUM(C34:H34)","v":278.6},{"$f":"VLOOKUP($A34,'7'!$B$10:$D$45,3,FALSE)","v":{"v":0,"d":"0.0"}},{"$f":"VLOOKUP($A34,'8'!$B$10:$D$45,3,FALSE)","v":{"v":0,"d":"0.0"}},{"$f":"VLOOKUP($A34,'9'!$B$10:$D$45,3,FALSE)","v":{"v":0,"d":"0.0"}},{"$f":"VLOOKUP($A34,'10'!$B$10:$D$45,3,FALSE)","v":{"v":0,"d":"0.0"}},{"$f":"VLOOKUP($A34,'11'!$B$10:$D$45,3,FALSE)","v":{"v":0,"d":"0.0"}},{"$f":"VLOOKUP($A34,'12'!$B$10:$D$45,3,FALSE)","v":{"v":0,"d":"0.0"}},{"$f":"IF(S34 >0,T34/S34,0)","v":{"v":0,"d":"0.0"}},{"$f":"VLOOKUP(A34,Formelhilfe!$A$9:$O$44,15,FALSE)","v":{"v":0,"d":"0.0"}},{"$f":"SUM(L34:Q34)","v":{"v":0,"d":"0.0"}},{"$f":"IF(V34>0,W34/V34,0)","v":278.6},{"$f":"VLOOKUP(A34,Formelhilfe!$A$9:$P$44,16,FALSE)","v":{"v":1,"d":"1.0"}},{"$f":"SUM(C34:H34,L34:Q34)","v":278.6}]
["Schütze 17",{"$f":"VLOOKUP(A35,'Wettkampf 1'!$B$10:$C$45,2,FALSE)","v":"Börgermoor I"},{"$f":"VLOOKUP(A35,'Wettkampf 1'!$B$10:$D$45,3,FALSE)","v":{"v":0,"d":"0.0"}},{"$f":"VLOOKUP($A35,'2'!$B$10:$D$45,3,FALSE)","v":{"v":0,"d":"0.0"}},{"$f":"VLOOKUP($A35,'3'!$B$10:$D$45,3,FALSE)","v":{"v":0,"d":"0.0"}},{"$f":"VLOOKUP($A35,'4'!$B$10:$D$45,3,FALSE)","v":{"v":0,"d":"0.0"}},{"$f":"VLOOKUP($A35,'5'!$B$10:$D$45,3,FALSE)","v":{"v":0,"d":"0.0"}},{"$f":"VLOOKUP($A35,'6'!$B$10:$D$45,3,FALSE)","v":{"v":0,"d":"0.0"}},{"$f":"IF(J35 > 0,K35/J35,0)","v":{"v":0,"d":"0.0"}},{"$f":"VLOOKUP(A35,Formelhilfe!$A$9:$H$44,8,FALSE)","v":{"v":0,"d":"0.0"}},{"$f":"SUM(C35:H35)","v":{"v":0,"d":"0.0"}},{"$f":"VLOOKUP($A35,'7'!$B$10:$D$45,3,FALSE)","v":{"v":0,"d":"0.0"}},{"$f":"VLOOKUP($A35,'8'!$B$10:$D$45,3,FALSE)","v":{"v":0,"d":"0.0"}},{"$f":"VLOOKUP($A35,'9'!$B$10:$D$45,3,FALSE)","v":{"v":0,"d":"0.0"}},{"$f":"VLOOKUP($A35,'10'!$B$10:$D$45,3,FALSE)","v":{"v":0,"d":"0.0"}},{"$f":"VLOOKUP($A35,'11'!$B$10:$D$45,3,FALSE)","v":{"v":0,"d":"0.0"}},{"$f":"VLOOKUP($A35,'12'!$B$10:$D$45,3,FALSE)","v":{"v":0,"d":"0.0"}},{"$f":"IF(S35 >0,T35/S35,0)","v":{"v":0,"d":"0.0"}},{"$f":"VLOOKUP(A35,Formelhilfe!$A$9:$O$44,15,FALSE)","v":{"v":0,"d":"0.0"}},{"$f":"SUM(L35:Q35)","v":{"v":0,"d":"0.0"}},{"$f":"IF(V35>0,W35/V35,0)","v":{"v":0,"d":"0.0"}},{"$f":"VLOOKUP(A35,Formelhilfe!$A$9:$P$44,16,FALSE)","v":{"v":0,"d":"0.0"}},{"$f":"SUM(C35:H35,L35:Q35)","v":{"v":0,"d":"0.0"}}]
["Schütze 18",{"$f":"VLOOKUP(A36,'Wettkampf 1'!$B$10:$C$45,2,FALSE)","v":"Börgermoor I"},{"$f":"VLOOKUP(A36,'Wettkampf 1'!$B$10:$D$45,3,FALSE)","v":{"v":0,"d":"0.0"}},{"$f":"VLOOKUP($A36,'2'!$B$10:$D$45,3,FALSE)","v":{"v":0,"d":"0.0"}},{"$f":"VLOOKUP($A36,'3'!$B$10:$D$45,3,FALSE)","v":{"v":0,"d":"0.0"}},{"$f":"VLOOKUP($A36,'4'!$B$10:$D$45,3,FALSE)","v":{"v":0,"d":"0.0"}},{"$f":"VLOOKUP($A36,'5'!$B$10:$D$45,3,FALSE)","v":{"v":0,"d":"0.0"}},{"$f":"VLOOKUP($A36,'6'!$B$10:$D$45,3,FALSE)","v":{"v":0,"d":"0.0"}},{"$f":"IF(J36 > 0,K36/J36,0)","v":{"v":0,"d":"0.0"}},{"$f":"VLOOKUP(A36,Formelhilfe!$A$9:$H$44,8,FALSE)","v":{"v":0,"d":"0.0"}},{"$f":"SUM(C36:H36)","v":{"v":0,"d":"0.0"}},{"$f":"VLOOKUP($A36,'7'!$B$10:$D$45,3,FALSE)","v":{"v":0,"d":"0.0"}},{"$f":"VLOOKUP($A36,'8'!$B$10:$D$45,3,FALSE)","v":{"v":0,"d":"0.0"}},{"$f":"VLOOKUP($A36,'9'!$B$10:$D$45,3,FALSE)","v":{"v":0,"d":"0.0"}},{"$f":"VLOOKUP($A36,'10'!$B$10:$D$45,3,FALSE)","v":{"v":0,"d":"0.0"}},{"$f":"VLOOKUP($A36,'11'!$B$10:$D$45,3,FALSE)","v":{"v":0,"d":"0.0"}},{"$f":"VLOOKUP($A36,'12'!$B$10:$D$45,3,FALSE)","v":{"v":0,"d":"0.0"}},{"$f":"IF(S36 >0,T36/S36,0)","v":{"v":0,"d":"0.0"}},{"$f":"VLOOKUP(A36,Formelhilfe!$A$9:$O$44,15,FALSE)","v":{"v":0,"d":"0.0"}},{"$f":"SUM(L36:Q36)","v":{"v":0,"d":"0.0"}},{"$f":"IF(V36>0,W36/V36,0)","v":{"v":0,"d":"0.0"}},{"$f":"VLOOKUP(A36,Formelhilfe!$A$9:$P$44,16,FALSE)","v":{"v":0,"d":"0.0"}},{"$f":"SUM(C36:H36,L36:Q36)","v":{"v":0,"d":"0.0"}}]
["Schütze 36",{"$f":"VLOOKUP(A37,'Wettkampf 1'!$B$10:$C$45,2,FALSE)","v":"Spahnharrenstätte I"},{"$f":"VLOOKUP(A37,'Wettkampf 1'!$B$10:$D$45,3,FALSE)","v":{"v":0,"d":"0.0"}},{"$f":"VLOOKUP($A37,'2'!$B$10:$D$45,3,FALSE)","v":{"v":0,"d":"0.0"}},{"$f":"VLOOKUP($A37,'3'!$B$10:$D$45,3,FALSE)","v":{"v":0,"d":"0.0"}},{"$f":"VLOOKUP($A37,'4'!$B$10:$D$45,3,FALSE)","v":{"v":0,"d":"0.0"}},{"$f":"VLOOKUP($A37,'5'!$B$10:$D$45,3,FALSE)","v":{"v":0,"d":"0.0"}},{"$f":"VLOOKUP($A37,'6'!$B$10:$D$45,3,FALSE)","v":{"v":0,"d":"0.0"}},{"$f":"IF(J37 > 0,K37/J37,0)","v":{"v":0,"d":"0.0"}},{"$f":"VLOOKUP(A37,Formelhilfe!$A$9:$H$44,8,FALSE)","v":{"v":0,"d":"0.0"}},{"$f":"SUM(C37:H37)","v":{"v":0,"d":"0.0"}},{"$f":"VLOOKUP($A37,'7'!$B$10:$D$45,3,FALSE)","v":{"v":0,"d":"0.0"}},{"$f":"VLOOKUP($A37,'8'!$B$10:$D$45,3,FALSE)","v":{"v":0,"d":"0.0"}},{"$f":"VLOOKUP($A37,'9'!$B$10:$D$45,3,FALSE)","v":{"v":0,"d":"0.0"}},{"$f":"VLOOKUP($A37,'10'!$B$10:$D$45,3,FALSE)","v":{"v":0,"d":"0.0"}},{"$f":"VLOOKUP($A37,'11'!$B$10:$D$45,3,FALSE)","v":{"v":0,"d":"0.0"}},{"$f":"VLOOKUP($A37,'12'!$B$10:$D$45,3,FALSE)","v":{"v":0,"d":"0.0"}},{"$f":"IF(S37 >0,T37/S37,0)","v":{"v":0,"d":"0.0"}},{"$f":"VLOOKUP(A37,Formelhilfe!$A$9:$O$44,15,FALSE)","v":{"v":0,"d":"0.0"}},{"$f":"SUM(L37:Q37)","v":{"v":0,"d":"0.0"}},{"$f":"IF(V37>0,W37/V37,0)","v":{"v":0,"d":"0.0"}},{"$f":"VLOOKUP(A37,Formelhilfe!$A$9:$P$44,16,FALSE)","v":{"v":0,"d":"0.0"}},{"$f":"SUM(C37:H37,L37:Q37)","v":{"v":0,"d":"0.0"}}]

{"sheet":"Formelhilfe","index":16,"n_rows":45,"n_cols":21,"rows_kept":45,"hidden":true}
[null,1,2,3,4,5,6,"Hinrunde Schnitt",7,8,9,10,11,12,"Rückrunde Schnitt","Gesamt Schnitt",null,null,"Kreisoberliga","Schützen","2023/2024"]
[{"$f":"'Wettkampf 1'!B2","v":"Börger II"},{"$f":"IF('Wettkampf 1'!D2>0,1,0)","v":1},{"$f":"IF('2'!$D2>0,1,0)","v":1},{"$f":"IF('3'!$D2>0,1,0)","v":1},{"$f":"IF('4'!$D2>0,1,0)","v":1},{"$f":"IF('5'!$D2>0,1,0)","v":1},{"$f":"IF('6'!$D2>0,1,0)","v":1},{"$f":"SUM(B2:G2)","v":6},{"$f":"IF('7'!$D2>0,1,0)","v":1},{"$f":"IF('8'!$D2>0,1,0)","v":1},{"$f":"IF('9'!$D2>0,1,0)","v":1},{"$f":"IF('10'!$D2>0,1,0)","v":1},{"$f":"IF('11'!$D2>0,1,0)","v":1},{"$f":"IF('12'!$D2>0,1,0)","v":0},{"$f":"SUM(I2:N2)","v":5},{"$f":"O2+H2","v":11},null,null,"1. Kreisliga","Damen","2024/2025"]
[{"$f":"'Wettkampf 1'!B3","v":"Neuvrees II"},{"$f":"IF('Wettkampf 1'!D3>0,1,0)","v":1},{"$f":"IF('2'!$D3>0,1,0)","v":1},{"$f":"IF('3'!$D3>0,1,0)","v":1},{"$f":"IF('4'!$D3>0,1,0)","v":1},{"$f":"IF('5'!$D3>0,1,0)","v":1},{"$f":"IF('6'!$D3>0,1,0)","v":1},{"$f":"SUM(B3:G3)","v":6},{"$f":"IF('7'!$D3>0,1,0)","v":1},{"$f":"IF('8'!$D3>0,1,0)","v":1},{"$f":"IF('9'!$D3>0,1,0)","v":1},{"$f":"IF('10'!$D3>0,1,0)","v":1},{"$f":"IF('11'!$D3>0,1,0)","v":1},{"$f":"IF('12'!$D3>0,1,0)","v":0},{"$f":"SUM(I3:N3)","v":5},{"$f":"O3+H3","v":11},null,null,"2. Kreisliga","Altersgruppe","2025/2026"]
[{"$f":"'Wettkampf 1'!B4","v":"Börgermoor I"},{"$f":"IF('Wettkampf 1'!D4>0,1,0)","v":1},{"$f":"IF('2'!$D4>0,1,0)","v":1},{"$f":"IF('3'!$D4>0,1,0)","v":1},{"$f":"IF('4'!$D4>0,1,0)","v":1},{"$f":"IF('5'!$D4>0,1,0)","v":1},{"$f":"IF('6'!$D4>0,1,0)","v":1},6,{"$f":"IF('7'!$D4>0,1,0)","v":1},{"$f":"IF('8'!$D4>0,1,0)","v":1},{"$f":"IF('9'!$D4>0,1,0)","v":1},{"$f":"IF('10'!$D4>0,1,0)","v":1},{"$f":"IF('11'!$D4>0,1,0)","v":1},{"$f":"IF('12'!$D4>0,1,0)","v":0},5,11,null,null,"1. Kreisklasse","Senioren","2026/2027"]
[{"$f":"'Wettkampf 1'!B5","v":"Lorup III"},{"$f":"IF('Wettkampf 1'!D5>0,1,0)","v":1},{"$f":"IF('2'!$D5>0,1,0)","v":1},{"$f":"IF('3'!$D5>0,1,0)","v":1},{"$f":"IF('4'!$D5>0,1,0)","v":1},{"$f":"IF('5'!$D5>0,1,0)","v":1},{"$f":"IF('6'!$D5>0,1,0)","v":1},6,{"$f":"IF('7'!$D5>0,1,0)","v":1},{"$f":"IF('8'!$D5>0,1,0)","v":1},{"$f":"IF('9'!$D5>0,1,0)","v":1},{"$f":"IF('10'!$D5>0,1,0)","v":1},{"$f":"IF('11'!$D5>0,1,0)","v":1},{"$f":"IF('12'!$D5>0,1,0)","v":0},5,11,null,null,"2. Kreisklasse","Jugend","2027/2028"]
[{"$f":"'Wettkampf 1'!B6","v":"Ostenwalde II"},{"$f":"IF('Wettkampf 1'!D6>0,1,0)","v":1},{"$f":"IF('2'!$D6>0,1,0)","v":1},{"$f":"IF('3'!$D6>0,1,0)","v":1},{"$f":"IF('4'!$D6>0,1,0)","v":1},{"$f":"IF('5'!$D6>0,1,0)","v":1},{"$f":"IF('6'!$D6>0,1,0)","v":1},6,{"$f":"IF('7'!$D6>0,1,0)","v":1},{"$f":"IF('8'!$D6>0,1,0)","v":1},{"$f":"IF('9'!$D6>0,1,0)","v":1},{"$f":"IF('10'!$D6>0,1,0)","v":1},{"$f":"IF('11'!$D6>0,1,0)","v":1},{"$f":"IF('12'!$D6>0,1,0)","v":0},5,11,null,null,"3. Kreisklasse","Schüler","2028/2029"]
[{"$f":"'Wettkampf 1'!B7","v":"Spahnharrenstätte I"},{"$f":"IF('Wettkampf 1'!D7>0,1,0)","v":1},{"$f":"IF('2'!$D7>0,1,0)","v":1},{"$f":"IF('3'!$D7>0,1,0)","v":1},{"$f":"IF('4'!$D7>0,1,0)","v":1},{"$f":"IF('5'!$D7>0,1,0)","v":1},{"$f":"IF('6'!$D7>0,1,0)","v":1},6,{"$f":"IF('7'!$D7>0,1,0)","v":1},{"$f":"IF('8'!$D7>0,1,0)","v":1},{"$f":"IF('9'!$D7>0,1,0)","v":1},{"$f":"IF('10'!$D7>0,1,0)","v":1},{"$f":"IF('11'!$D7>0,1,0)","v":1},{"$f":"IF('12'!$D7>0,1,0)","v":0},5,11,null,null,"4. Kreisklasse","offene Klasse FHLG","2039/2030"]
[{"$nulls":18},"5. Kreisklasse","Luftpistole"]
["Gertrud Kuchta",{"$f":"IF('Wettkampf 1'!D10>0,1,0)","v":1},{"$f":"IF('2'!$D10>0,1,0)","v":1},{"$f":"IF('3'!$D10>0,1,0)","v":1},{"$f":"IF('4'!$D10>0,1,0)","v":1},{"$f":"IF('5'!$D10>0,1,0)","v":1},{"$f":"IF('6'!$D10>0,1,0)","v":1},6,{"$f":"IF('7'!$D10>0,1,0)","v":1},{"$f":"IF('8'!$D10>0,1,0)","v":1},{"$f":"IF('9'!$D10>0,1,0)","v":1},{"$f":"IF('10'!$D10>0,1,0)","v":1},{"$f":"IF('11'!$D10>0,1,0)","v":1},{"$f":"IF('12'!$D10>0,1,0)","v":0},5,{"$f":"O9+H9","v":11},null,null,"6. Kreisklasse"]
["Sarah Breer",{"$f":"IF('Wettkampf 1'!D11>0,1,0)","v":1},{"$f":"IF('2'!$D11>0,1,0)","v":1},{"$f":"IF('3'!$D11>0,1,0)","v":1},{"$f":"IF('4'!$D11>0,1,0)","v":0},{"$f":"IF('5'!$D11>0,1,0)","v":1},{"$f":"IF('6'!$D11>0,1,0)","v":1},5,{"$f":"IF('7'!$D11>0,1,0)","v":1},{"$f":"IF('8'!$D11>0,1,0)","v":0},{"$f":"IF('9'!$D11>0,1,0)","v":0},{"$f":"IF('10'!$D11>0,1,0)","v":0},{"$f":"IF('11'!$D11>0,1,0)","v":0},{"$f":"IF('12'!$D11>0,1,0)","v":0},1,{"$f":"O10+H10","v":6},null,null,"7. Kreisklasse"]
["Margret Pohlgeers",{"$f":"IF('Wettkampf 1'!D12>0,1,0)","v":1},{"$f":"IF('2'!$D12>0,1,0)","v":1},{"$f":"IF('3'!$D12>0,1,0)","v":1},{"$f":"IF('4'!$D12>0,1,0)","v":1},{"$f":"IF('5'!$D12>0,1,0)","v":1},{"$f":"IF('6'!$D12>0,1,0)","v":1},6,{"$f":"IF('7'!$D12>0,1,0)","v":1},{"$f":"IF('8'!$D12>0,1,0)","v":1},{"$f":"IF('9'!$D12>0,1,0)","v":1},{"$f":"IF('10'!$D12>0,1,0)","v":1},{"$f":"IF('11'!$D12>0,1,0)","v":1},{"$f":"IF('12'!$D12>0,1,0)","v":0},5,11]
["Gundula Schwarte",{"$f":"IF('Wettkampf 1'!D13>0,1,0)","v":1},{"$f":"IF('2'!$D13>0,1,0)","v":1},{"$f":"IF('3'!$D13>0,1,0)","v":1},{"$f":"IF('4'!$D13>0,1,0)","v":1},{"$f":"IF('5'!$D13>0,1,0)","v":1},{"$f":"IF('6'!$D13>0,1,0)","v":1},6,{"$f":"IF('7'!$D13>0,1,0)","v":1},{"$f":"IF('8'!$D13>0,1,0)","v":1},{"$f":"IF('9'!$D13>0,1,0)","v":1},{"$f":"IF('10'!$D13>0,1,0)","v":1},{"$f":"IF('11'!$D13>0,1,0)","v":1},{"$f":"IF('12'!$D13>0,1,0)","v":0},5,11]
["Annette Schwarte",{"$f":"IF('Wettkampf 1'!D14>0,1,0)","v":1},{"$f":"IF('2'!$D14>0,1,0)","v":1},{"$f":"IF('3'!$D14>0,1,0)","v":1},{"$f":"IF('4'!$D14>0,1,0)","v":1},{"$f":"IF('5'!$D14>0,1,0)","v":1},{"$f":"IF('6'!$D14>0,1,0)","v":1},6,{"$f":"IF('7'!$D14>0,1,0)","v":1},{"$f":"IF('8'!$D14>0,1,0)","v":1},{"$f":"IF('9'!$D14>0,1,0)","v":1},{"$f":"IF('10'!$D14>0,1,0)","v":1},{"$f":"IF('11'!$D14>0,1,0)","v":1},{"$f":"IF('12'!$D14>0,1,0)","v":0},5,11]
["Petra Dödtmann",{"$f":"IF('Wettkampf 1'!D15>0,1,0)","v":0},{"$f":"IF('2'!$D15>0,1,0)","v":1},{"$f":"IF('3'!$D15>0,1,0)","v":0},{"$f":"IF('4'!$D15>0,1,0)","v":1},{"$f":"IF('5'!$D15>0,1,0)","v":1},{"$f":"IF('6'!$D15>0,1,0)","v":1},4,{"$f":"IF('7'!$D15>0,1,0)","v":1},{"$f":"IF('8'!$D15>0,1,0)","v":1},{"$f":"IF('9'!$D15>0,1,0)","v":1},{"$f":"IF('10'!$D15>0,1,0)","v":1},{"$f":"IF('11'!$D15>0,1,0)","v":1},{"$f":"IF('12'!$D15>0,1,0)","v":0},5,9]
["Sarah Deyen",{"$f":"IF('Wettkampf 1'!D16>0,1,0)","v":1},{"$f":"IF('2'!$D16>0,1,0)","v":1},{"$f":"IF('3'!$D16>0,1,0)","v":1},{"$f":"IF('4'!$D16>0,1,0)","v":1},{"$f":"IF('5'!$D16>0,1,0)","v":1},{"$f":"IF('6'!$D16>0,1,0)","v":1},6,{"$f":"IF('7'!$D16>0,1,0)","v":1},{"$f":"IF('8'!$D16>0,1,0)","v":1},{"$f":"IF('9'!$D16>0,1,0)","v":1},{"$f":"IF('10'!$D16>0,1,0)","v":1},{"$f":"IF('11'!$D16>0,1,0)","v":1},{"$f":"IF('12'!$D16>0,1,0)","v":0},5,11]
["Silvia Thunert",{"$f":"IF('Wettkampf 1'!D17>0,1,0)","v":1},{"$f":"IF('2'!$D17>0,1,0)","v":1},{"$f":"IF('3'!$D17>0,1,0)","v":1},{"$f":"IF('4'!$D17>0,1,0)","v":1},{"$f":"IF('5'!$D17>0,1,0)","v":1},{"$f":"IF('6'!$D17>0,1,0)","v":1},6,{"$f":"IF('7'!$D17>0,1,0)","v":1},{"$f":"IF('8'!$D17>0,1,0)","v":1},{"$f":"IF('9'!$D17>0,1,0)","v":1},{"$f":"IF('10'!$D17>0,1,0)","v":1},{"$f":"IF('11'!$D17>0,1,0)","v":1},{"$f":"IF('12'!$D17>0,1,0)","v":0},5,11]
["Margret Pohlmann",{"$f":"IF('Wettkampf 1'!D18>0,1,0)","v":1},{"$f":"IF('2'!$D18>0,1,0)","v":1},{"$f":"IF('3'!$D18>0,1,0)","v":1},{"$f":"IF('4'!$D18>0,1,0)","v":1},{"$f":"IF('5'!$D18>0,1,0)","v":1},{"$f":"IF('6'!$D18>0,1,0)","v":1},6,{"$f":"IF('7'!$D18>0,1,0)","v":1},{"$f":"IF('8'!$D18>0,1,0)","v":1},{"$f":"IF('9'!$D18>0,1,0)","v":1},{"$f":"IF('10'!$D18>0,1,0)","v":1},{"$f":"IF('11'!$D18>0,1,0)","v":1},{"$f":"IF('12'!$D18>0,1,0)","v":0},5,11]
["Harma Steenken",{"$f":"IF('Wettkampf 1'!D19>0,1,0)","v":1},{"$f":"IF('2'!$D19>0,1,0)","v":1},{"$f":"IF('3'!$D19>0,1,0)","v":0},{"$f":"IF('4'!$D19>0,1,0)","v":1},{"$f":"IF('5'!$D19>0,1,0)","v":0},{"$f":"IF('6'!$D19>0,1,0)","v":0},3,{"$f":"IF('7'!$D19>0,1,0)","v":1},{"$f":"IF('8'!$D19>0,1,0)","v":0},{"$f":"IF('9'!$D19>0,1,0)","v":1},{"$f":"IF('10'!$D19>0,1,0)","v":0},{"$f":"IF('11'!$D19>0,1,0)","v":0},{"$f":"IF('12'!$D19>0,1,0)","v":0},2,5]
["Claudia Rolfes",{"$f":"IF('Wettkampf 1'!D20>0,1,0)","v":1},{"$f":"IF('2'!$D20>0,1,0)","v":1},{"$f":"IF('3'!$D20>0,1,0)","v":1},{"$f":"IF('4'!$D20>0,1,0)","v":1},{"$f":"IF('5'!$D20>0,1,0)","v":1},{"$f":"IF('6'!$D20>0,1,0)","v":1},6,{"$f":"IF('7'!$D20>0,1,0)","v":1},{"$f":"IF('8'!$D20>0,1,0)","v":1},{"$f":"IF('9'!$D20>0,1,0)","v":1},{"$f":"IF('10'!$D20>0,1,0)","v":1},{"$f":"IF('11'!$D20>0,1,0)","v":1},{"$f":"IF('12'!$D20>0,1,0)","v":0},5,11]
["Silvia Junge",{"$f":"IF('Wettkampf 1'!D21>0,1,0)","v":1},{"$f":"IF('2'!$D21>0,1,0)","v":1},{"$f":"IF('3'!$D21>0,1,0)","v":1},{"$f":"IF('4'!$D21>0,1,0)","v":1},{"$f":"IF('5'!$D21>0,1,0)","v":1},{"$f":"IF('6'!$D21>0,1,0)","v":1},6,{"$f":"IF('7'!$D21>0,1,0)","v":1},{"$f":"IF('8'!$D21>0,1,0)","v":1},{"$f":"IF('9'!$D21>0,1,0)","v":1},{"$f":"IF('10'!$D21>0,1,0)","v":1},{"$f":"IF('11'!$D21>0,1,0)","v":1},{"$f":"IF('12'!$D21>0,1,0)","v":0},5,11]
["Ulla Schnieders",{"$f":"IF('Wettkampf 1'!D22>0,1,0)","v":1},{"$f":"IF('2'!$D22>0,1,0)","v":1},{"$f":"IF('3'!$D22>0,1,0)","v":1},{"$f":"IF('4'!$D22>0,1,0)","v":1},{"$f":"IF('5'!$D22>0,1,0)","v":1},{"$f":"IF('6'!$D22>0,1,0)","v":1},6,{"$f":"IF('7'!$D22>0,1,0)","v":1},{"$f":"IF('8'!$D22>0,1,0)","v":1},{"$f":"IF('9'!$D22>0,1,0)","v":1},{"$f":"IF('10'!$D22>0,1,0)","v":1},{"$f":"IF('11'!$D22>0,1,0)","v":1},{"$f":"IF('12'!$D22>0,1,0)","v":0},5,11]
["Jasmin Kramer",{"$f":"IF('Wettkampf 1'!D23>0,1,0)","v":1},{"$f":"IF('2'!$D23>0,1,0)","v":1},{"$f":"IF('3'!$D23>0,1,0)","v":1},{"$f":"IF('4'!$D23>0,1,0)","v":1},{"$f":"IF('5'!$D23>0,1,0)","v":1},{"$f":"IF('6'!$D23>0,1,0)","v":1},6,{"$f":"IF('7'!$D23>0,1,0)","v":1},{"$f":"IF('8'!$D23>0,1,0)","v":1},{"$f":"IF('9'!$D23>0,1,0)","v":1},{"$f":"IF('10'!$D23>0,1,0)","v":1},{"$f":"IF('11'!$D23>0,1,0)","v":0},{"$f":"IF('12'!$D23>0,1,0)","v":0},4,10]
["Anni Küwen",{"$f":"IF('Wettkampf 1'!D24>0,1,0)","v":1},{"$f":"IF('2'!$D24>0,1,0)","v":1},{"$f":"IF('3'!$D24>0,1,0)","v":1},{"$f":"IF('4'!$D24>0,1,0)","v":1},{"$f":"IF('5'!$D24>0,1,0)","v":1},{"$f":"IF('6'!$D24>0,1,0)","v":1},6,{"$f":"IF('7'!$D24>0,1,0)","v":1},{"$f":"IF('8'!$D24>0,1,0)","v":1},{"$f":"IF('9'!$D24>0,1,0)","v":1},{"$f":"IF('10'!$D24>0,1,0)","v":1},{"$f":"IF('11'!$D24>0,1,0)","v":1},{"$f":"IF('12'!$D24>0,1,0)","v":0},5,11]
["Waltraud Dobelmann",{"$f":"IF('Wettkampf 1'!D25>0,1,0)","v":1},{"$f":"IF('2'!$D25>0,1,0)","v":1},{"$f":"IF('3'!$D25>0,1,0)","v":1},{"$f":"IF('4'!$D25>0,1,0)","v":1},{"$f":"IF('5'!$D25>0,1,0)","v":1},{"$f":"IF('6'!$D25>0,1,0)","v":1},6,{"$f":"IF('7'!$D25>0,1,0)","v":1},{"$f":"IF('8'!$D25>0,1,0)","v":1},{"$f":"IF('9'!$D25>0,1,0)","v":1},{"$f":"IF('10'!$D25>0,1,0)","v":1},{"$f":"IF('11'!$D25>0,1,0)","v":1},{"$f":"IF('12'!$D25>0,1,0)","v":0},5,11]
["Schütze 17",{"$f":"IF('Wettkampf 1'!D26>0,1,0)","v":0},{"$f":"IF('2'!$D26>0,1,0)","v":0},{"$f":"IF('3'!$D26>0,1,0)","v":0},{"$f":"IF('4'!$D26>0,1,0)","v":0},{"$f":"IF('5'!$D26>0,1,0)","v":0},{"$f":"IF('6'!$D26>0,1,0)","v":0},0,{"$f":"IF('7'!$D26>0,1,0)","v":0},{"$f":"IF('8'!$D26>0,1,0)","v":0},{"$f":"IF('9'!$D26>0,1,0)","v":0},{"$f":"IF('10'!$D26>0,1,0)","v":0},{"$f":"IF('11'!$D26>0,1,0)","v":0},{"$f":"IF('12'!$D26>0,1,0)","v":0},0,0]
["Schütze 18",{"$f":"IF('Wettkampf 1'!D27>0,1,0)","v":0},{"$f":"IF('2'!$D27>0,1,0)","v":0},{"$f":"IF('3'!$D27>0,1,0)","v":0},{"$f":"IF('4'!$D27>0,1,0)","v":0},{"$f":"IF('5'!$D27>0,1,0)","v":0},{"$f":"IF('6'!$D27>0,1,0)","v":0},0,{"$f":"IF('7'!$D27>0,1,0)","v":0},{"$f":"IF('8'!$D27>0,1,0)","v":0},{"$f":"IF('9'!$D27>0,1,0)","v":0},{"$f":"IF('10'!$D27>0,1,0)","v":0},{"$f":"IF('11'!$D27>0,1,0)","v":0},{"$f":"IF('12'!$D27>0,1,0)","v":0},0,0]
["Hanna Gebken",{"$f":"IF('Wettkampf 1'!D28>0,1,0)","v":1},{"$f":"IF('2'!$D28>0,1,0)","v":1},{"$f":"IF('3'!$D28>0,1,0)","v":1},{"$f":"IF('4'!$D28>0,1,0)","v":1},{"$f":"IF('5'!$D28>0,1,0)","v":1},{"$f":"IF('6'!$D28>0,1,0)","v":1},6,{"$f":"IF('7'!$D28>0,1,0)","v":1},{"$f":"IF('8'!$D28>0,1,0)","v":1},{"$f":"IF('9'!$D28>0,1,0)","v":1},{"$f":"IF('10'!$D28>0,1,0)","v":1},{"$f":"IF('11'!$D28>0,1,0)","v":1},{"$f":"IF('12'!$D28>0,1,0)","v":0},5,11]
["Monika Reimann",{"$f":"IF('Wettkampf 1'!D29>0,1,0)","v":1},{"$f":"IF('2'!$D29>0,1,0)","v":1},{"$f":"IF('3'!$D29>0,1,0)","v":1},{"$f":"IF('4'!$D29>0,1,0)","v":1},{"$f":"IF('5'!$D29>0,1,0)","v":1},{"$f":"IF('6'!$D29>0,1,0)","v":1},6,{"$f":"IF('7'!$D29>0,1,0)","v":1},{"$f":"IF('8'!$D29>0,1,0)","v":1},{"$f":"IF('9'!$D29>0,1,0)","v":1},{"$f":"IF('10'!$D29>0,1,0)","v":1},{"$f":"IF('11'!$D29>0,1,0)","v":1},{"$f":"IF('12'!$D29>0,1,0)","v":0},5,11]
["Marina Schrand",{"$f":"IF('Wettkampf 1'!D30>0,1,0)","v":1},{"$f":"IF('2'!$D30>0,1,0)","v":1},{"$f":"IF('3'!$D30>0,1,0)","v":1},{"$f":"IF('4'!$D30>0,1,0)","v":1},{"$f":"IF('5'!$D30>0,1,0)","v":1},{"$f":"IF('6'!$D30>0,1,0)","v":1},6,{"$f":"IF('7'!$D30>0,1,0)","v":1},{"$f":"IF('8'!$D30>0,1,0)","v":1},{"$f":"IF('9'!$D30>0,1,0)","v":1},{"$f":"IF('10'!$D30>0,1,0)","v":1},{"$f":"IF('11'!$D30>0,1,0)","v":1},{"$f":"IF('12'!$D30>0,1,0)","v":0},5,11]
["Nadine Krömer",{"$f":"IF('Wettkampf 1'!D31>0,1,0)","v":1},{"$f":"IF('2'!$D31>0,1,0)","v":1},{"$f":"IF('3'!$D31>0,1,0)","v":1},{"$f":"IF('4'!$D31>0,1,0)","v":1},{"$f":"IF('5'!$D31>0,1,0)","v":1},{"$f":"IF('6'!$D31>0,1,0)","v":1},6,{"$f":"IF('7'!$D31>0,1,0)","v":1},{"$f":"IF('8'!$D31>0,1,0)","v":1},{"$f":"IF('9'!$D31>0,1,0)","v":1},{"$f":"IF('10'!$D31>0,1,0)","v":1},{"$f":"IF('11'!$D31>0,1,0)","v":1},{"$f":"IF('12'!$D31>0,1,0)","v":0},5,11]
["Nina Krömer",{"$f":"IF('Wettkampf 1'!D32>0,1,0)","v":1},{"$f":"IF('2'!$D32>0,1,0)","v":1},{"$f":"IF('3'!$D32>0,1,0)","v":1},{"$f":"IF('4'!$D32>0,1,0)","v":1},{"$f":"IF('5'!$D32>0,1,0)","v":1},{"$f":"IF('6'!$D32>0,1,0)","v":1},6,{"$f":"IF('7'!$D32>0,1,0)","v":1},{"$f":"IF('8'!$D32>0,1,0)","v":1},{"$f":"IF('9'!$D32>0,1,0)","v":1},{"$f":"IF('10'!$D32>0,1,0)","v":1},{"$f":"IF('11'!$D32>0,1,0)","v":1},{"$f":"IF('12'!$D32>0,1,0)","v":0},5,11]
["Margret Büter",{"$f":"IF('Wettkampf 1'!D33>0,1,0)","v":1},{"$f":"IF('2'!$D33>0,1,0)","v":1},{"$f":"IF('3'!$D33>0,1,0)","v":0},{"$f":"IF('4'!$D33>0,1,0)","v":0},{"$f":"IF('5'!$D33>0,1,0)","v":0},{"$f":"IF('6'!$D33>0,1,0)","v":0},2,{"$f":"IF('7'!$D33>0,1,0)","v":0},{"$f":"IF('8'!$D33>0,1,0)","v":0},{"$f":"IF('9'!$D33>0,1,0)","v":0},{"$f":"IF('10'!$D33>0,1,0)","v":0},{"$f":"IF('11'!$D33>0,1,0)","v":0},{"$f":"IF('12'!$D33>0,1,0)","v":0},0,2]
["Sarah Meiners",{"$f":"IF('Wettkampf 1'!D34>0,1,0)","v":1},{"$f":"IF('2'!$D34>0,1,0)","v":1},{"$f":"IF('3'!$D34>0,1,0)","v":1},{"$f":"IF('4'!$D34>0,1,0)","v":1},{"$f":"IF('5'!$D34>0,1,0)","v":1},{"$f":"IF('6'!$D34>0,1,0)","v":1},6,{"$f":"IF('7'!$D34>0,1,0)","v":1},{"$f":"IF('8'!$D34>0,1,0)","v":0},{"$f":"IF('9'!$D34>0,1,0)","v":1},{"$f":"IF('10'!$D34>0,1,0)","v":1},{"$f":"IF('11'!$D34>0,1,0)","v":0},{"$f":"IF('12'!$D34>0,1,0)","v":0},3,9]
["Anna Temmen",{"$f":"IF('Wettkampf 1'!D35>0,1,0)","v":1},{"$f":"IF('2'!$D35>0,1,0)","v":1},{"$f":"IF('3'!$D35>0,1,0)","v":1},{"$f":"IF('4'!$D35>0,1,0)","v":1},{"$f":"IF('5'!$D35>0,1,0)","v":1},{"$f":"IF('6'!$D35>0,1,0)","v":1},6,{"$f":"IF('7'!$D35>0,1,0)","v":1},{"$f":"IF('8'!$D35>0,1,0)","v":1},{"$f":"IF('9'!$D35>0,1,0)","v":1},{"$f":"IF('10'!$D35>0,1,0)","v":1},{"$f":"IF('11'!$D35>0,1,0)","v":1},{"$f":"IF('12'!$D35>0,1,0)","v":0},5,11]
["Helga Meiners",{"$f":"IF('Wettkampf 1'!D36>0,1,0)","v":1},{"$f":"IF('2'!$D36>0,1,0)","v":1},{"$f":"IF('3'!$D36>0,1,0)","v":1},{"$f":"IF('4'!$D36>0,1,0)","v":1},{"$f":"IF('5'!$D36>0,1,0)","v":1},{"$f":"IF('6'!$D36>0,1,0)","v":1},6,{"$f":"IF('7'!$D36>0,1,0)","v":1},{"$f":"IF('8'!$D36>0,1,0)","v":1},{"$f":"IF('9'!$D36>0,1,0)","v":0},{"$f":"IF('10'!$D36>0,1,0)","v":0},{"$f":"IF('11'!$D36>0,1,0)","v":0},{"$f":"IF('12'!$D36>0,1,0)","v":0},2,8]
["Carmen Benten",{"$f":"IF('Wettkampf 1'!D37>0,1,0)","v":1},{"$f":"IF('2'!$D37>0,1,0)","v":1},{"$f":"IF('3'!$D37>0,1,0)","v":1},{"$f":"IF('4'!$D37>0,1,0)","v":1},{"$f":"IF('5'!$D37>0,1,0)","v":1},{"$f":"IF('6'!$D37>0,1,0)","v":1},6,{"$f":"IF('7'!$D37>0,1,0)","v":1},{"$f":"IF('8'!$D37>0,1,0)","v":1},{"$f":"IF('9'!$D37>0,1,0)","v":1},{"$f":"IF('10'!$D37>0,1,0)","v":1},{"$f":"IF('11'!$D37>0,1,0)","v":1},{"$f":"IF('12'!$D37>0,1,0)","v":0},5,11]
["Anna -Maria Wimberg",{"$f":"IF('Wettkampf 1'!D38>0,1,0)","v":0},{"$f":"IF('2'!$D38>0,1,0)","v":0},{"$f":"IF('3'!$D38>0,1,0)","v":0},{"$f":"IF('4'!$D38>0,1,0)","v":0},{"$f":"IF('5'!$D38>0,1,0)","v":0},{"$f":"IF('6'!$D38>0,1,0)","v":0},0,{"$f":"IF('7'!$D38>0,1,0)","v":0},{"$f":"IF('8'!$D38>0,1,0)","v":0},{"$f":"IF('9'!$D38>0,1,0)","v":0},{"$f":"IF('10'!$D38>0,1,0)","v":0},{"$f":"IF('11'!$D38>0,1,0)","v":1},{"$f":"IF('12'!$D38>0,1,0)","v":0},1,1]
["Evelyn Feder",{"$f":"IF('Wettkampf 1'!D39>0,1,0)","v":0},{"$f":"IF('2'!$D39>0,1,0)","v":0},{"$f":"IF('3'!$D39>0,1,0)","v":0},{"$f":"IF('4'!$D39>0,1,0)","v":0},{"$f":"IF('5'!$D39>0,1,0)","v":0},{"$f":"IF('6'!$D39>0,1,0)","v":0},0,{"$f":"IF('7'!$D39>0,1,0)","v":0},{"$f":"IF('8'!$D39>0,1,0)","v":1},{"$f":"IF('9'!$D39>0,1,0)","v":0},{"$f":"IF('10'!$D39>0,1,0)","v":0},{"$f":"IF('11'!$D39>0,1,0)","v":0},{"$f":"IF('12'!$D39>0,1,0)","v":0},1,1]
["Monika Jansen",{"$f":"IF('Wettkampf 1'!D40>0,1,0)","v":1},{"$f":"IF('2'!$D40>0,1,0)","v":1},{"$f":"IF('3'!$D40>0,1,0)","v":1},{"$f":"IF('4'!$D40>0,1,0)","v":1},{"$f":"IF('5'!$D40>0,1,0)","v":1},{"$f":"IF('6'!$D40>0,1,0)","v":1},6,{"$f":"IF('7'!$D40>0,1,0)","v":1},{"$f":"IF('8'!$D40>0,1,0)","v":1},{"$f":"IF('9'!$D40>0,1,0)","v":1},{"$f":"IF('10'!$D40>0,1,0)","v":1},{"$f":"IF('11'!$D40>0,1,0)","v":1},{"$f":"IF('12'!$D40>0,1,0)","v":0},5,{"$f":"O39+H39","v":11}]
["Kerstin Sträche",{"$f":"IF('Wettkampf 1'!D41>0,1,0)","v":1},{"$f":"IF('2'!$D41>0,1,0)","v":1},{"$f":"IF('3'!$D41>0,1,0)","v":1},{"$f":"IF('4'!$D41>0,1,0)","v":1},{"$f":"IF('5'!$D41>0,1,0)","v":1},{"$f":"IF('6'!$D41>0,1,0)","v":1},6,{"$f":"IF('7'!$D41>0,1,0)","v":1},{"$f":"IF('8'!$D41>0,1,0)","v":1},{"$f":"IF('9'!$D41>0,1,0)","v":1},{"$f":"IF('10'!$D41>0,1,0)","v":1},{"$f":"IF('11'!$D41>0,1,0)","v":1},{"$f":"IF('12'!$D41>0,1,0)","v":0},5,11]
["Rita Hanekamp",{"$f":"IF('Wettkampf 1'!D42>0,1,0)","v":1},{"$f":"IF('2'!$D42>0,1,0)","v":1},{"$f":"IF('3'!$D42>0,1,0)","v":1},{"$f":"IF('4'!$D42>0,1,0)","v":1},{"$f":"IF('5'!$D42>0,1,0)","v":1},{"$f":"IF('6'!$D42>0,1,0)","v":1},6,{"$f":"IF('7'!$D42>0,1,0)","v":0},{"$f":"IF('8'!$D42>0,1,0)","v":1},{"$f":"IF('9'!$D42>0,1,0)","v":1},{"$f":"IF('10'!$D42>0,1,0)","v":1},{"$f":"IF('11'!$D42>0,1,0)","v":1},{"$f":"IF('12'!$D42>0,1,0)","v":0},4,10]
["Maria Beusing",{"$f":"IF('Wettkampf 1'!D43>0,1,0)","v":1},{"$f":"IF('2'!$D43>0,1,0)","v":1},{"$f":"IF('3'!$D43>0,1,0)","v":1},{"$f":"IF('4'!$D43>0,1,0)","v":1},{"$f":"IF('5'!$D43>0,1,0)","v":1},{"$f":"IF('6'!$D43>0,1,0)","v":1},6,{"$f":"IF('7'!$D43>0,1,0)","v":1},{"$f":"IF('8'!$D43>0,1,0)","v":1},{"$f":"IF('9'!$D43>0,1,0)","v":1},{"$f":"IF('10'!$D43>0,1,0)","v":1},{"$f":"IF('11'!$D43>0,1,0)","v":1},{"$f":"IF('12'!$D43>0,1,0)","v":0},5,11]
["Schütze 35",{"$f":"IF('Wettkampf 1'!D44>0,1,0)","v":0},{"$f":"IF('2'!$D44>0,1,0)","v":1},{"$f":"IF('3'!$D44>0,1,0)","v":0},{"$f":"IF('4'!$D44>0,1,0)","v":0},{"$f":"IF('5'!$D44>0,1,0)","v":0},{"$f":"IF('6'!$D44>0,1,0)","v":0},1,{"$f":"IF('7'!$D44>0,1,0)","v":0},{"$f":"IF('8'!$D44>0,1,0)","v":0},{"$f":"IF('9'!$D44>0,1,0)","v":0},{"$f":"IF('10'!$D44>0,1,0)","v":0},{"$f":"IF('11'!$D44>0,1,0)","v":0},{"$f":"IF('12'!$D44>0,1,0)","v":0},0,1]
["Schütze 36",{"$f":"IF('Wettkampf 1'!D45>0,1,0)","v":0},{"$f":"IF('2'!$D45>0,1,0)","v":0},{"$f":"IF('3'!$D45>0,1,0)","v":0},{"$f":"IF('4'!$D45>0,1,0)","v":0},{"$f":"IF('5'!$D45>0,1,0)","v":0},{"$f":"IF('6'!$D45>0,1,0)","v":0},0,{"$f":"IF('7'!$D45>0,1,0)","v":0},{"$f":"IF('8'!$D45>0,1,0)","v":0},{"$f":"IF('9'!$D45>0,1,0)","v":0},{"$f":"IF('10'!$D45>0,1,0)","v":0},{"$f":"IF('11'!$D45>0,1,0)","v":0},{"$f":"IF('12'!$D45>0,1,0)","v":0},0,0]
[null,{"$f":"SUM(B9:B44)","v":{"v":29,"d":"29.00"}},{"$f":"SUM(C9:C44)","v":{"v":31,"d":"31.00"}},{"v":27,"d":"27.00"},{"v":28,"d":"28.00"},{"v":28,"d":"28.00"},{"v":28,"d":"28.00"},{"$f":"SUM(H9:H44)","v":{"v":171,"d":"171.00"}},{"$f":"SUM(I9:I44)","v":{"v":28,"d":"28.00"}},{"$f":"SUM(J9:J44)","v":{"v":27,"d":"27.00"}},{"v":27,"d":"27.00"},{"v":26,"d":"26.00"},{"v":25,"d":"25.00"},{"v":0,"d":"0.00"},{"$f":"SUM(O9:O44)","v":{"v":133,"d":"133.00"}},{"$f":"SUM(P9:P44)","v":{"v":304,"d":"304.00"}}]

{"sheet":"Übersicht Gruppen","index":17,"n_rows":7,"n_cols":20,"rows_kept":7,"hidden":true}
[]
[null,"Lorup III",{"$f":"VLOOKUP($B$2:$B$7,'Wettkampf 1'!$B$2:$D$7,3,FALSE)","v":931.6},{"$f":"VLOOKUP($B$2:$B$7,'2'!$B$2:$D$7,3,FALSE)","v":{"v":931.3000000000001,"d":"931.3"}},{"$f":"VLOOKUP($B$2:$B$7,'3'!$B$2:$D$7,3,FALSE)","v":927.6},{"$f":"VLOOKUP($B$2:$B$7,'4'!$B$2:$D$7,3,FALSE)","v":933.5},{"$f":"VLOOKUP($B$2:$B$7,'5'!$B$2:$D$7,3,FALSE)","v":920.3},{"$f":"VLOOKUP($B$2:$B$7,'6'!$B$2:$D$7,3,FALSE)","v":924.4},{"$f":"IF(Formelhilfe!H2 > 0,J2/Formelhilfe!H2,0)","v":{"v":928.1166666666667,"d":"928.1"}},{"$f":"SUM(C2:H2)","v":{"v":5568.7,"d":"5,568.7"}},{"$f":"VLOOKUP($B$2:$B$7,'7'!$B$2:$D$7,3,FALSE)","v":924.1},{"$f":"VLOOKUP($B$2:$B$7,'8'!$B$2:$D$7,3,FALSE)","v":{"v":926,"d":"926.0"}},{"$f":"VLOOKUP($B$2:$B$7,'9'!$B$2:$D$7,3,FALSE)","v":927.7},{"$f":"VLOOKUP($B$2:$B$7,'10'!$B$2:$D$7,3,FALSE)","v":931.5},{"$f":"VLOOKUP($B$2:$B$7,'11'!$B$2:$D$7,3,FALSE)","v":923.7},{"$f":"VLOOKUP($B$2:$B$7,'12'!$B$2:$D$7,3,FALSE)","v":{"v":0,"d":"0.0"}},{"$f":"IF(Formelhilfe!O2>0,R2/Formelhilfe!O2,0)","v":926.6},{"$f":"SUM(K2:P2)","v":{"v":4633,"d":"4,633.0"}},{"$f":"IF(Formelhilfe!P2>0,T2/Formelhilfe!P2,0)","v":{"v":927.4272727272728,"d":"927.4"}},{"$f":"SUM(C2:H2,K2:P2)","v":{"v":10201.7,"d":"10,201.7"}}]
[null,"Spahnharrenstätte I",{"$f":"VLOOKUP($B$2:$B$7,'Wettkampf 1'!$B$2:$D$7,3,FALSE)","v":{"v":919,"d":"919.0"}},{"$f":"VLOOKUP($B$2:$B$7,'2'!$B$2:$D$7,3,FALSE)","v":{"v":932.8999999999999,"d":"932.9"}},{"$f":"VLOOKUP($B$2:$B$7,'3'!$B$2:$D$7,3,FALSE)","v":928.2},{"$f":"VLOOKUP($B$2:$B$7,'4'!$B$2:$D$7,3,FALSE)","v":{"v":928.9000000000001,"d":"928.9"}},{"$f":"VLOOKUP($B$2:$B$7,'5'!$B$2:$D$7,3,FALSE)","v":917.3},{"$f":"VLOOKUP($B$2:$B$7,'6'!$B$2:$D$7,3,FALSE)","v":928.2},{"$f":"IF(Formelhilfe!H3 > 0,J3/Formelhilfe!H3,0)","v":{"v":925.75,"d":"925.8"}},{"$f":"SUM(C3:H3)","v":{"v":5554.5,"d":"5,554.5"}},{"$f":"VLOOKUP($B$2:$B$7,'7'!$B$2:$D$7,3,FALSE)","v":927.2},{"$f":"VLOOKUP($B$2:$B$7,'8'!$B$2:$D$7,3,FALSE)","v":919.2},{"$f":"VLOOKUP($B$2:$B$7,'9'!$B$2:$D$7,3,FALSE)","v":928.9},{"$f":"VLOOKUP($B$2:$B$7,'10'!$B$2:$D$7,3,FALSE)","v":{"v":922,"d":"922.0"}},{"$f":"VLOOKUP($B$2:$B$7,'11'!$B$2:$D$7,3,FALSE)","v":924.2},{"$f":"VLOOKUP($B$2:$B$7,'12'!$B$2:$D$7,3,FALSE)","v":{"v":0,"d":"0.0"}},{"$f":"IF(Formelhilfe!O3>0,R3/Formelhilfe!O3,0)","v":924.3},{"$f":"SUM(K3:P3)","v":{"v":4621.5,"d":"4,621.5"}},{"$f":"IF(Formelhilfe!P3>0,T3/Formelhilfe!P3,0)","v":{"v":925.0909090909091,"d":"925.1"}},{"$f":"SUM(C3:H3,K3:P3)","v":{"v":10176,"d":"10,176.0"}}]
[null,"Börger II",{"$f":"VLOOKUP($B$2:$B$7,'Wettkampf 1'!$B$2:$D$7,3,FALSE)","v":912.5},{"$f":"VLOOKUP($B$2:$B$7,'2'!$B$2:$D$7,3,FALSE)","v":{"v":915.5999999999999,"d":"915.6"}},{"$f":"VLOOKUP($B$2:$B$7,'3'!$B$2:$D$7,3,FALSE)","v":922.7},{"$f":"VLOOKUP($B$2:$B$7,'4'!$B$2:$D$7,3,FALSE)","v":935.3},{"$f":"VLOOKUP($B$2:$B$7,'5'!$B$2:$D$7,3,FALSE)","v":921.1},{"$f":"VLOOKUP($B$2:$B$7,'6'!$B$2:$D$7,3,FALSE)","v":{"v":933.0999999999999,"d":"933.1"}},{"$f":"IF(Formelhilfe!H5 > 0,J4/Formelhilfe!H5,0)","v":{"v":923.3833333333336,"d":"923.4"}},{"$f":"SUM(C4:H4)","v":{"v":5540.300000000001,"d":"5,540.3"}},{"$f":"VLOOKUP($B$2:$B$7,'7'!$B$2:$D$7,3,FALSE)","v":{"v":923,"d":"923.0"}},{"$f":"VLOOKUP($B$2:$B$7,'8'!$B$2:$D$7,3,FALSE)","v":{"v":927.5999999999999,"d":"927.6"}},{"$f":"VLOOKUP($B$2:$B$7,'9'!$B$2:$D$7,3,FALSE)","v":927.5},{"$f":"VLOOKUP($B$2:$B$7,'10'!$B$2:$D$7,3,FALSE)","v":928.8},{"$f":"VLOOKUP($B$2:$B$7,'11'!$B$2:$D$7,3,FALSE)","v":{"v":928.6999999999999,"d":"928.7"}},{"$f":"VLOOKUP($B$2:$B$7,'12'!$B$2:$D$7,3,FALSE)","v":{"v":0,"d":"0.0"}},{"$f":"IF(Formelhilfe!O5>0,R4/Formelhilfe!O5,0)","v":{"v":927.1199999999999,"d":"927.1"}},{"$f":"SUM(K4:P4)","v":{"v":4635.599999999999,"d":"4,635.6"}},{"$f":"IF(Formelhilfe!P5>0,T4/Formelhilfe!P5,0)","v":{"v":925.0818181818183,"d":"925.1"}},{"$f":"SUM(C4:H4,K4:P4)","v":{"v":10175.900000000001,"d":"10,175.9"}}]
[null,"Neuvrees II",{"$f":"VLOOKUP($B$2:$B$7,'Wettkampf 1'!$B$2:$D$7,3,FALSE)","v":{"v":924,"d":"924.0"}},{"$f":"VLOOKUP($B$2:$B$7,'2'!$B$2:$D$7,3,FALSE)","v":{"v":921.9000000000001,"d":"921.9"}},{"$f":"VLOOKUP($B$2:$B$7,'3'!$B$2:$D$7,3,FALSE)","v":925.5},{"$f":"VLOOKUP($B$2:$B$7,'4'!$B$2:$D$7,3,FALSE)","v":{"v":931.3000000000001,"d":"931.3"}},{"$f":"VLOOKUP($B$2:$B$7,'5'!$B$2:$D$7,3,FALSE)","v":913.8},{"$f":"VLOOKUP($B$2:$B$7,'6'!$B$2:$D$7,3,FALSE)","v":933.5},{"$f":"IF(Formelhilfe!H6 > 0,J5/Formelhilfe!H6,0)","v":{"v":925,"d":"925.0"}},{"$f":"SUM(C5:H5)","v":{"v":5550,"d":"5,550.0"}},{"$f":"VLOOKUP($B$2:$B$7,'7'!$B$2:$D$7,3,FALSE)","v":{"v":922.5999999999999,"d":"922.6"}},{"$f":"VLOOKUP($B$2:$B$7,'8'!$B$2:$D$7,3,FALSE)","v":{"v":927.0999999999999,"d":"927.1"}},{"$f":"VLOOKUP($B$2:$B$7,'9'!$B$2:$D$7,3,FALSE)","v":925.2},{"$f":"VLOOKUP($B$2:$B$7,'10'!$B$2:$D$7,3,FALSE)","v":929.3},{"$f":"VLOOKUP($B$2:$B$7,'11'!$B$2:$D$7,3,FALSE)","v":913.5},{"$f":"VLOOKUP($B$2:$B$7,'12'!$B$2:$D$7,3,FALSE)","v":{"v":0,"d":"0.0"}},{"$f":"IF(Formelhilfe!O6>0,R5/Formelhilfe!O6,0)","v":{"v":923.54,"d":"923.5"}},{"$f":"SUM(K5:P5)","v":{"v":4617.7,"d":"4,617.7"}},{"$f":"IF(Formelhilfe!P6>0,T5/Formelhilfe!P6,0)","v":{"v":924.3363636363637,"d":"924.3"}},{"$f":"SUM(C5:H5,K5:P5)","v":{"v":10167.7,"d":"10,167.7"}}]
[null,"Börgermoor I",{"$f":"VLOOKUP($B$2:$B$7,'Wettkampf 1'!$B$2:$D$7,3,FALSE)","v":911.8},{"$f":"VLOOKUP($B$2:$B$7,'2'!$B$2:$D$7,3,FALSE)","v":914.6},{"$f":"VLOOKUP($B$2:$B$7,'3'!$B$2:$D$7,3,FALSE)","v":922.2},{"$f":"VLOOKUP($B$2:$B$7,'4'!$B$2:$D$7,3,FALSE)","v":933.2},{"$f":"VLOOKUP($B$2:$B$7,'5'!$B$2:$D$7,3,FALSE)","v":{"v":921.9000000000001,"d":"921.9"}},{"$f":"VLOOKUP($B$2:$B$7,'6'!$B$2:$D$7,3,FALSE)","v":{"v":925.3000000000001,"d":"925.3"}},{"$f":"IF(Formelhilfe!H4 > 0,J6/Formelhilfe!H4,0)","v":{"v":921.5000000000001,"d":"921.5"}},{"$f":"SUM(C6:H6)","v":{"v":5529.000000000001,"d":"5,529.0"}},{"$f":"VLOOKUP($B$2:$B$7,'7'!$B$2:$D$7,3,FALSE)","v":923.9},{"$f":"VLOOKUP($B$2:$B$7,'8'!$B$2:$D$7,3,FALSE)","v":{"v":934.1000000000001,"d":"934.1"}},{"$f":"VLOOKUP($B$2:$B$7,'9'!$B$2:$D$7,3,FALSE)","v":{"v":928.0000000000001,"d":"928.0"}},{"$f":"VLOOKUP($B$2:$B$7,'10'!$B$2:$D$7,3,FALSE)","v":918.3},{"$f":"VLOOKUP($B$2:$B$7,'11'!$B$2:$D$7,3,FALSE)","v":{"v":916.8000000000001,"d":"916.8"}},{"$f":"VLOOKUP($B$2:$B$7,'12'!$B$2:$D$7,3,FALSE)","v":{"v":0,"d":"0.0"}},{"$f":"IF(Formelhilfe!O4>0,R6/Formelhilfe!O4,0)","v":{"v":924.22,"d":"924.2"}},{"$f":"SUM(K6:P6)","v":{"v":4621.1,"d":"4,621.1"}},{"$f":"IF(Formelhilfe!P4>0,T6/Formelhilfe!P4,0)","v":{"v":922.7363636363636,"d":"922.7"}},{"$f":"SUM(C6:H6,K6:P6)","v":{"v":10150.1,"d":"10,150.1"}}]
[null,"Ostenwalde II",{"$f":"VLOOKUP($B$2:$B$7,'Wettkampf 1'!$B$2:$D$7,3,FALSE)","v":911.2},{"$f":"VLOOKUP($B$2:$B$7,'2'!$B$2:$D$7,3,FALSE)","v":{"v":913.9999999999999,"d":"914.0"}},{"$f":"VLOOKUP($B$2:$B$7,'3'!$B$2:$D$7,3,FALSE)","v":924.3},{"$f":"VLOOKUP($B$2:$B$7,'4'!$B$2:$D$7,3,FALSE)","v":918.2},{"$f":"VLOOKUP($B$2:$B$7,'5'!$B$2:$D$7,3,FALSE)","v":907.8},{"$f":"VLOOKUP($B$2:$B$7,'6'!$B$2:$D$7,3,FALSE)","v":909.3},{"$f":"IF(Formelhilfe!H7 > 0,J7/Formelhilfe!H7,0)","v":{"v":914.1333333333333,"d":"914.1"}},{"$f":"SUM(C7:H7)","v":{"v":5484.8,"d":"5,484.8"}},{"$f":"VLOOKUP($B$2:$B$7,'7'!$B$2:$D$7,3,FALSE)","v":912.4},{"$f":"VLOOKUP($B$2:$B$7,'8'!$B$2:$D$7,3,FALSE)","v":908.8},{"$f":"VLOOKUP($B$2:$B$7,'9'!$B$2:$D$7,3,FALSE)","v":912.5},{"$f":"VLOOKUP($B$2:$B$7,'10'!$B$2:$D$7,3,FALSE)","v":912.4},{"$f":"VLOOKUP($B$2:$B$7,'11'!$B$2:$D$7,3,FALSE)","v":{"v":917,"d":"917.0"}},{"$f":"VLOOKUP($B$2:$B$7,'12'!$B$2:$D$7,3,FALSE)","v":{"v":0,"d":"0.0"}},{"$f":"IF(Formelhilfe!O7>0,R7/Formelhilfe!O7,0)","v":{"v":912.6200000000001,"d":"912.6"}},{"$f":"SUM(K7:P7)","v":{"v":4563.1,"d":"4,563.1"}},{"$f":"IF(Formelhilfe!P7>0,T7/Formelhilfe!P7,0)","v":{"v":913.4454545454545,"d":"913.4"}},{"$f":"SUM(C7:H7,K7:P7)","v":{"v":10047.9,"d":"10,047.9"}}]