{"text_format":"3","workbook":"xlsx","n_sheets":18,"sheets":["Übersicht","Wettkampf 1","2","3","4","5","6","7","8","9","10","11","12","Ausdruck","Ausdruck blank","Übersicht Schützen","Formelhilfe","Übersicht Gruppen"],"not_rendered":{"images":2,"macros":1,"defined_names":12},"read":"whole","date_system":"1900"}

{"sheet":"Übersicht","index":0,"n_rows":54,"n_cols":22,"rows_kept":54,"merged":[[0,10,0,11],[0,12,0,14],[0,15,0,16],[2,9,2,10],[2,17,2,18],[2,19,2,20],[3,1,3,2],[3,21,5,21],[5,1,5,2],[6,1,6,2],[7,1,7,2],[8,1,8,2],[9,1,9,2],[10,1,10,2],[14,9,14,10],[14,17,14,18],[14,19,14,20],[14,21,16,21]]}
[{"$nulls":3},"Kreisrundenwettkampf",{"$nulls":5},"Saison","2023/2024",null,"2. Kreisklasse",null,null,"Schützen"]
[]
[null,null,"Wettkampftag:","03.09.","17.09.","01.10.","15.10.","29.10.","19.11.","Hinrunde",null,"14.01.","28.01.","11.02.","25.02.","10.03.","07.04.","Rückrunde",null,"Serie komplett"]
["Pos.","Verein / Gruppe",null,"Börgerwald","Neuvrees","Börger","Börger","Lahn","Neuvrees","Schnitt","Gesamt ","Neuvrees",{"$f":"E4","v":"Neuvrees"},"Börger","Börger","Lahn","Börgerwald","Schnitt","Gesamt ","Schnitt","Gesamt","Differenz"]
[]
[1,{"$f":"'Übersicht Gruppen'!B2","v":"Neuvrees II"},null,{"$f":"'Übersicht Gruppen'!C2","v":932.5},{"$f":"'Übersicht Gruppen'!D2","v":{"v":931.4000000000001,"d":"931.4"}},{"$f":"'Übersicht Gruppen'!E2","v":{"v":938,"d":"938.0"}},{"$f":"'Übersicht Gruppen'!F2","v":931.6},{"$f":"'Übersicht Gruppen'!G2","v":{"v":935.9000000000001,"d":"935.9"}},{"$f":"'Übersicht Gruppen'!H2","v":933.7},{"$f":"'Übersicht Gruppen'!I2","v":{"v":933.8499999999999,"d":"933.85"}},{"$f":"SUM(D6:I6)","v":{"v":5603.099999999999,"d":"5,603.1"}},{"$f":"'Übersicht Gruppen'!K2","v":{"v":0,"d":"0.0"}},{"$f":"'Übersicht Gruppen'!L2","v":{"v":0,"d":"0.0"}},{"$f":"'Übersicht Gruppen'!M2","v":{"v":0,"d":"0.0"}},{"$f":"'Übersicht Gruppen'!N2","v":{"v":0,"d":"0.0"}},{"$f":"'Übersicht Gruppen'!O2","v":{"v":0,"d":"0.0"}},{"$f":"'Übersicht Gruppen'!P2","v":{"v":0,"d":"0.0"}},{"$f":"'Übersicht Gruppen'!Q2","v":{"v":0,"d":"0.00"}},{"$f":"SUM(L6:Q6)","v":{"v":0,"d":"0.0"}},{"$f":"'Übersicht Gruppen'!S2","v":{"v":933.8499999999999,"d":"933.85"}},{"$f":"SUM(S6+K6)","v":{"v":5603.099999999999,"d":"5,603.1"}}]
[2,{"$f":"'Übersicht Gruppen'!B3","v":"Lahn IV"},null,{"$f":"'Übersicht Gruppen'!C3","v":{"v":929.5000000000001,"d":"929.5"}},{"$f":"'Übersicht Gruppen'!D3","v":935.3},{"$f":"'Übersicht Gruppen'!E3","v":{"v":933,"d":"933.0"}},{"$f":"'Übersicht Gruppen'!F3","v":940.1},{"$f":"'Übersicht Gruppen'!G3","v":{"v":933.4000000000001,"d":"933.4"}},{"$f":"'Übersicht Gruppen'!H3","v":{"v":928.5000000000001,"d":"928.5"}},{"$f":"'Übersicht Gruppen'!I3","v":{"v":933.3000000000001,"d":"933.30"}},{"v":5599.8,"d":"5,599.8"},{"$f":"'Übersicht Gruppen'!K3","v":{"v":0,"d":"0.0"}},{"$f":"'Übersicht Gruppen'!L3","v":{"v":0,"d":"0.0"}},{"$f":"'Übersicht Gruppen'!M3","v":{"v":0,"d":"0.0"}},{"$f":"'Übersicht Gruppen'!N3","v":{"v":0,"d":"0.0"}},{"$f":"'Übersicht Gruppen'!O3","v":{"v":0,"d":"0.0"}},{"$f":"'Übersicht Gruppen'!P3","v":{"v":0,"d":"0.0"}},{"$f":"'Übersicht Gruppen'!Q3","v":{"v":0,"d":"0.00"}},{"v":0,"d":"0.0"},{"$f":"'Übersicht Gruppen'!S3","v":{"v":933.3000000000001,"d":"933.30"}},{"$f":"SUM(S7+K7)","v":{"v":5599.8,"d":"5,599.8"}},{"$f":"(U6-U7)*-1","v":{"v":-3.2999999999992724,"d":"-3.3"}}]
[3,{"$f":"'Übersicht Gruppen'!B4","v":"Börgerwald II"},null,{"$f":"'Übersicht Gruppen'!C4","v":{"v":932.9000000000001,"d":"932.9"}},{"$f":"'Übersicht Gruppen'!D4","v":935.1},{"$f":"'Übersicht Gruppen'!E4","v":931.1},{"$f":"'Übersicht Gruppen'!F4","v":936.7},{"$f":"'Übersicht Gruppen'!G4","v":935.1},{"$f":"'Übersicht Gruppen'!H4","v":927.8},{"$f":"'Übersicht Gruppen'!I4","v":{"v":933.1166666666668,"d":"933.12"}},{"v":5598.700000000001,"d":"5,598.7"},{"$f":"'Übersicht Gruppen'!K4","v":{"v":0,"d":"0.0"}},{"$f":"'Übersicht Gruppen'!L4","v":{"v":0,"d":"0.0"}},{"$f":"'Übersicht Gruppen'!M4","v":{"v":0,"d":"0.0"}},{"$f":"'Übersicht Gruppen'!N4","v":{"v":0,"d":"0.0"}},{"$f":"'Übersicht Gruppen'!O4","v":{"v":0,"d":"0.0"}},{"$f":"'Übersicht Gruppen'!P4","v":{"v":0,"d":"0.0"}},{"$f":"'Übersicht Gruppen'!Q4","v":{"v":0,"d":"0.00"}},{"v":0,"d":"0.0"},{"$f":"'Übersicht Gruppen'!S4","v":{"v":933.1166666666668,"d":"933.12"}},{"v":5598.700000000001,"d":"5,598.7"},{"$f":"(U7-U8)*-1","v":{"v":-1.0999999999994543,"d":"-1.1"}}]
[4,{"$f":"'Übersicht Gruppen'!B5","v":"Neuvrees I"},null,{"$f":"'Übersicht Gruppen'!C5","v":933.2},{"$f":"'Übersicht Gruppen'!D5","v":{"v":929.1000000000001,"d":"929.1"}},{"$f":"'Übersicht Gruppen'!E5","v":926.2},{"$f":"'Übersicht Gruppen'!F5","v":{"v":931.6999999999999,"d":"931.7"}},{"$f":"'Übersicht Gruppen'!G5","v":{"v":932.1999999999999,"d":"932.2"}},{"$f":"'Übersicht Gruppen'!H5","v":{"v":932.9000000000001,"d":"932.9"}},{"$f":"'Übersicht Gruppen'!I5","v":{"v":930.8833333333332,"d":"930.88"}},{"v":5585.299999999999,"d":"5,585.3"},{"$f":"'Übersicht Gruppen'!K5","v":{"v":0,"d":"0.0"}},{"$f":"'Übersicht Gruppen'!L5","v":{"v":0,"d":"0.0"}},{"$f":"'Übersicht Gruppen'!M5","v":{"v":0,"d":"0.0"}},{"$f":"'Übersicht Gruppen'!N5","v":{"v":0,"d":"0.0"}},{"$f":"'Übersicht Gruppen'!O5","v":{"v":0,"d":"0.0"}},{"$f":"'Übersicht Gruppen'!P5","v":{"v":0,"d":"0.0"}},{"$f":"'Übersicht Gruppen'!Q5","v":{"v":0,"d":"0.00"}},{"v":0,"d":"0.0"},{"$f":"'Übersicht Gruppen'!S5","v":{"v":930.8833333333332,"d":"930.88"}},{"v":5585.299999999999,"d":"5,585.3"},{"v":-13.400000000001455,"d":"-13.4"}]
[5,{"$f":"'Übersicht Gruppen'!B6","v":"Börger II"},null,{"$f":"'Übersicht Gruppen'!C6","v":{"v":934.4000000000001,"d":"934.4"}},{"$f":"'Übersicht Gruppen'!D6","v":934.2},{"$f":"'Übersicht Gruppen'!E6","v":925.6},{"$f":"'Übersicht Gruppen'!F6","v":{"v":934,"d":"934.0"}},{"$f":"'Übersicht Gruppen'!G6","v":921.6},{"$f":"'Übersicht Gruppen'!H6","v":929.2},{"$f":"'Übersicht Gruppen'!I6","v":{"v":929.8333333333334,"d":"929.83"}},{"v":5579,"d":"5,579.0"},{"$f":"'Übersicht Gruppen'!K6","v":{"v":0,"d":"0.0"}},{"$f":"'Übersicht Gruppen'!L6","v":{"v":0,"d":"0.0"}},{"$f":"'Übersicht Gruppen'!M6","v":{"v":0,"d":"0.0"}},{"$f":"'Übersicht Gruppen'!N6","v":{"v":0,"d":"0.0"}},{"$f":"'Übersicht Gruppen'!O6","v":{"v":0,"d":"0.0"}},{"$f":"'Übersicht Gruppen'!P6","v":{"v":0,"d":"0.0"}},{"$f":"'Übersicht Gruppen'!Q6","v":{"v":0,"d":"0.00"}},{"v":0,"d":"0.0"},{"$f":"'Übersicht Gruppen'!S6","v":{"v":929.8333333333334,"d":"929.83"}},{"v":5579,"d":"5,579.0"},{"v":-6.299999999999272,"d":"-6.3"}]
[6,{"$f":"'Übersicht Gruppen'!B7","v":"Börger III"},null,{"$f":"'Übersicht Gruppen'!C7","v":{"v":923.6000000000001,"d":"923.6"}},{"$f":"'Übersicht Gruppen'!D7","v":{"v":926.3000000000001,"d":"926.3"}},{"$f":"'Übersicht Gruppen'!E7","v":927.2},{"$f":"'Übersicht Gruppen'!F7","v":934.7},{"$f":"'Übersicht Gruppen'!G7","v":{"v":931.9000000000001,"d":"931.9"}},{"$f":"'Übersicht Gruppen'!H7","v":933.3},{"$f":"'Übersicht Gruppen'!I7","v":{"v":929.5000000000001,"d":"929.50"}},{"v":5577.000000000001,"d":"5,577.0"},{"$f":"'Übersicht Gruppen'!K7","v":{"v":0,"d":"0.0"}},{"$f":"'Übersicht Gruppen'!L7","v":{"v":0,"d":"0.0"}},{"$f":"'Übersicht Gruppen'!M7","v":{"v":0,"d":"0.0"}},{"$f":"'Übersicht Gruppen'!N7","v":{"v":0,"d":"0.0"}},{"$f":"'Übersicht Gruppen'!O7","v":{"v":0,"d":"0.0"}},{"$f":"'Übersicht Gruppen'!P7","v":{"v":0,"d":"0.0"}},{"$f":"'Übersicht Gruppen'!Q7","v":{"v":0,"d":"0.00"}},{"v":0,"d":"0.0"},{"$f":"'Übersicht Gruppen'!S7","v":{"v":929.5000000000001,"d":"929.50"}},{"v":5577.000000000001,"d":"5,577.0"},{"v":-1.9999999999990905,"d":"-2.0"}]
[]
[null,null,"Schnitt:",{"$f":"AVERAGE(D6:D11)","v":{"v":931.0166666666668,"d":"931.0"}},{"$f":"AVERAGE(E6:E11)","v":{"v":931.9000000000001,"d":"931.9"}},{"v":930.1833333333334,"d":"930.2"},{"v":934.8000000000001,"d":"934.8"},{"v":931.6833333333334,"d":"931.7"},{"v":930.9000000000001,"d":"930.9"},{"v":931.7472222222223,"d":"931.75"},{"$f":"SUM(K6:K11)/6","v":{"v":5590.483333333334,"d":"5,590.5"}},{"v":0,"d":"0.0"},{"v":0,"d":"0.0"},{"v":0,"d":"0.0"},{"v":0,"d":"0.0"},{"v":0,"d":"0.0"},{"v":0,"d":"0.0"},{"v":0,"d":"0.00"},{"v":0,"d":"0.0"},{"v":931.7472222222223,"d":"931.75"},{"v":5590.483333333334,"d":"5,590.5"}]
[]
[{"$nulls":9},"Hinrunde",{"$nulls":7},"Rückrunde",null,"Serie komplett",null,"Differenz"]
["Pos.","Vorname Name","Verein / Gruppe",{"$nulls":6},"Schnitt","Gesamt",{"$nulls":6},"Schnitt","Gesamt","Schnitt","Gesamt"]
[1,{"$f":"'Übersicht Schützen'!A2","v":"Ingo Zdralik"},{"$f":"'Übersicht Schützen'!B2","v":"Börger II"},{"$f":"'Übersicht Schützen'!C2","v":316.1},{"$f":"'Übersicht Schützen'!D2","v":316.2},{"$f":"'Übersicht Schützen'!E2","v":312.9},{"$f":"'Übersicht Schützen'!F2","v":316.6},{"$f":"'Übersicht Schützen'!G2","v":314.1},{"$f":"'Übersicht Schützen'!H2","v":317.8},{"$f":"'Übersicht Schützen'!I2","v":{"v":315.6166666666667,"d":"315.62"}},{"$f":"SUM(D17:I17)","v":{"v":1893.7,"d":"1,893.7"}},{"$f":"'Übersicht Schützen'!L2","v":{"v":0,"d":"0.0"}},{"$f":"'Übersicht Schützen'!M2","v":{"v":0,"d":"0.0"}},{"$f":"'Übersicht Schützen'!N2","v":{"v":0,"d":"0.0"}},{"$f":"'Übersicht Schützen'!O2","v":{"v":0,"d":"0.0"}},{"$f":"'Übersicht Schützen'!P2","v":{"v":0,"d":"0.0"}},{"$f":"'Übersicht Schützen'!Q2","v":{"v":0,"d":"0.0"}},{"$f":"'Übersicht Schützen'!R2","v":{"v":0,"d":"0.00"}},{"$f":"SUM(L17:Q17)","v":{"v":0,"d":"0.0"}},{"$f":"'Übersicht Schützen'!U2","v":{"v":315.6166666666667,"d":"315.62"}},{"$f":"SUM(K17+S17)","v":{"v":1893.7,"d":"1,893.7"}}]
[2,{"$f":"'Übersicht Schützen'!A3","v":"Johannes Thesing"},{"$f":"'Übersicht Schützen'!B3","v":"Lahn IV"},{"$f":"'Übersicht Schützen'!C3","v":313.1},{"$f":"'Übersicht Schützen'!D3","v":313.8},{"$f":"'Übersicht Schützen'!E3","v":312.5},{"$f":"'Übersicht Schützen'!F3","v":316.2},{"$f":"'Übersicht Schützen'!G3","v":317.3},{"$f":"'Übersicht Schützen'!H3","v":312.1},{"$f":"'Übersicht Schützen'!I3","v":{"v":314.1666666666667,"d":"314.17"}},{"$f":"SUM(D18:I18)","v":{"v":1885,"d":"1,885.0"}},{"$f":"'Übersicht Schützen'!L3","v":{"v":0,"d":"0.0"}},{"$f":"'Übersicht Schützen'!M3","v":{"v":0,"d":"0.0"}},{"$f":"'Übersicht Schützen'!N3","v":{"v":0,"d":"0.0"}},{"$f":"'Übersicht Schützen'!O3","v":{"v":0,"d":"0.0"}},{"$f":"'Übersicht Schützen'!P3","v":{"v":0,"d":"0.0"}},{"$f":"'Übersicht Schützen'!Q3","v":{"v":0,"d":"0.0"}},{"$f":"'Übersicht Schützen'!R3","v":{"v":0,"d":"0.00"}},{"$f":"SUM(L18:Q18)","v":{"v":0,"d":"0.0"}},{"$f":"'Übersicht Schützen'!U3","v":{"v":314.1666666666667,"d":"314.17"}},{"$f":"SUM(K18+S18)","v":{"v":1885,"d":"1,885.0"}},{"$f":"(U17-U18)*-1","v":{"v":-8.700000000000045,"d":"-8.7"}}]
[3,{"$f":"'Übersicht Schützen'!A4","v":"Bernd Witting"},{"$f":"'Übersicht Schützen'!B4","v":"Neuvrees II"},{"$f":"'Übersicht Schützen'!C4","v":{"v":315,"d":"315.0"}},{"$f":"'Übersicht Schützen'!D4","v":311.8},{"$f":"'Übersicht Schützen'!E4","v":313.8},{"$f":"'Übersicht Schützen'!F4","v":309.6},{"$f":"'Übersicht Schützen'!G4","v":310.3},{"$f":"'Übersicht Schützen'!H4","v":311.1},{"$f":"'Übersicht Schützen'!I4","v":{"v":311.93333333333334,"d":"311.93"}},{"$f":"SUM(D19:I19)","v":{"v":1871.6,"d":"1,871.6"}},{"$f":"'Übersicht Schützen'!L4","v":{"v":0,"d":"0.0"}},{"$f":"'Übersicht Schützen'!M4","v":{"v":0,"d":"0.0"}},{"$f":"'Übersicht Schützen'!N4","v":{"v":0,"d":"0.0"}},{"$f":"'Übersicht Schützen'!O4","v":{"v":0,"d":"0.0"}},{"$f":"'Übersicht Schützen'!P4","v":{"v":0,"d":"0.0"}},{"$f":"'Übersicht Schützen'!Q4","v":{"v":0,"d":"0.0"}},{"$f":"'Übersicht Schützen'!R4","v":{"v":0,"d":"0.00"}},{"v":0,"d":"0.0"},{"$f":"'Übersicht Schützen'!U4","v":{"v":311.93333333333334,"d":"311.93"}},{"v":1871.6,"d":"1,871.6"},{"$f":"(U18-U19)*-1","v":{"v":-13.400000000000091,"d":"-13.4"}}]
[4,{"$f":"'Übersicht Schützen'!A5","v":"Dirk Thunert"},{"$f":"'Übersicht Schützen'!B5","v":"Neuvrees II"},{"$f":"'Übersicht Schützen'!C5","v":{"v":310,"d":"310.0"}},{"$f":"'Übersicht Schützen'!D5","v":310.9},{"$f":"'Übersicht Schützen'!E5","v":311.7},{"$f":"'Übersicht Schützen'!F5","v":310.9},{"$f":"'Übersicht Schützen'!G5","v":312.5},{"$f":"'Übersicht Schützen'!H5","v":{"v":313,"d":"313.0"}},{"$f":"'Übersicht Schützen'!I5","v":{"v":311.5,"d":"311.50"}},{"v":1869,"d":"1,869.0"},{"$f":"'Übersicht Schützen'!L5","v":{"v":0,"d":"0.0"}},{"$f":"'Übersicht Schützen'!M5","v":{"v":0,"d":"0.0"}},{"$f":"'Übersicht Schützen'!N5","v":{"v":0,"d":"0.0"}},{"$f":"'Übersicht Schützen'!O5","v":{"v":0,"d":"0.0"}},{"$f":"'Übersicht Schützen'!P5","v":{"v":0,"d":"0.0"}},{"$f":"'Übersicht Schützen'!Q5","v":{"v":0,"d":"0.0"}},{"$f":"'Übersicht Schützen'!R5","v":{"v":0,"d":"0.00"}},{"v":0,"d":"0.0"},{"$f":"'Übersicht Schützen'!U5","v":{"v":311.5,"d":"311.50"}},{"v":1869,"d":"1,869.0"},{"v":-2.599999999999909,"d":"-2.6"}]
[5,{"$f":"'Übersicht Schützen'!A6","v":"Simon Schutenbrock"},{"$f":"'Übersicht Schützen'!B6","v":"Börger III"},{"$f":"'Übersicht Schützen'!C6","v":313.8},{"$f":"'Übersicht Schützen'!D6","v":311.1},{"$f":"'Übersicht Schützen'!E6","v":307.6},{"$f":"'Übersicht Schützen'!F6","v":314.4},{"$f":"'Übersicht Schützen'!G6","v":309.6},{"$f":"'Übersicht Schützen'!H6","v":{"v":311,"d":"311.0"}},{"$f":"'Übersicht Schützen'!I6","v":311.25},{"v":1867.5,"d":"1,867.5"},{"$f":"'Übersicht Schützen'!L6","v":{"v":0,"d":"0.0"}},{"$f":"'Übersicht Schützen'!M6","v":{"v":0,"d":"0.0"}},{"$f":"'Übersicht Schützen'!N6","v":{"v":0,"d":"0.0"}},{"$f":"'Übersicht Schützen'!O6","v":{"v":0,"d":"0.0"}},{"$f":"'Übersicht Schützen'!P6","v":{"v":0,"d":"0.0"}},{"$f":"'Übersicht Schützen'!Q6","v":{"v":0,"d":"0.0"}},{"$f":"'Übersicht Schützen'!R6","v":{"v":0,"d":"0.00"}},{"v":0,"d":"0.0"},{"$f":"'Übersicht Schützen'!U6","v":311.25},{"v":1867.5,"d":"1,867.5"},-1.5]
[6,{"$f":"'Übersicht Schützen'!A7","v":"Willi Rolfes"},{"$f":"'Übersicht Schützen'!B7","v":"Neuvrees I"},{"$f":"'Übersicht Schützen'!C7","v":310.7},{"$f":"'Übersicht Schützen'!D7","v":312.8},{"$f":"'Übersicht Schützen'!E7","v":308.5},{"$f":"'Übersicht Schützen'!F7","v":311.1},{"$f":"'Übersicht Schützen'!G7","v":309.9},{"$f":"'Übersicht Schützen'!H7","v":313.8},{"$f":"'Übersicht Schützen'!I7","v":{"v":311.1333333333333,"d":"311.13"}},{"v":1866.8,"d":"1,866.8"},{"$f":"'Übersicht Schützen'!L7","v":{"v":0,"d":"0.0"}},{"$f":"'Übersicht Schützen'!M7","v":{"v":0,"d":"0.0"}},{"$f":"'Übersicht Schützen'!N7","v":{"v":0,"d":"0.0"}},{"$f":"'Übersicht Schützen'!O7","v":{"v":0,"d":"0.0"}},{"$f":"'Übersicht Schützen'!P7","v":{"v":0,"d":"0.0"}},{"$f":"'Übersicht Schützen'!Q7","v":{"v":0,"d":"0.0"}},{"$f":"'Übersicht Schützen'!R7","v":{"v":0,"d":"0.00"}},{"v":0,"d":"0.0"},{"$f":"'Übersicht Schützen'!U7","v":{"v":311.1333333333333,"d":"311.13"}},{"v":1866.8,"d":"1,866.8"},{"v":-0.7000000000000455,"d":"-0.7"}]
[7,{"$f":"'Übersicht Schützen'!A8","v":"Andre Hanenkamp"},{"$f":"'Übersicht Schützen'!B8","v":"Börgerwald II"},{"$f":"'Übersicht Schützen'!C8","v":306.5},{"$f":"'Übersicht Schützen'!D8","v":311.8},{"$f":"'Übersicht Schützen'!E8","v":307.1},{"$f":"'Übersicht Schützen'!F8","v":311.4},{"$f":"'Übersicht Schützen'!G8","v":314.9},{"$f":"'Übersicht Schützen'!H8","v":310.8},{"$f":"'Übersicht Schützen'!I8","v":{"v":310.41666666666663,"d":"310.42"}},{"v":1862.4999999999998,"d":"1,862.5"},{"$f":"'Übersicht Schützen'!L8","v":{"v":0,"d":"0.0"}},{"$f":"'Übersicht Schützen'!M8","v":{"v":0,"d":"0.0"}},{"$f":"'Übersicht Schützen'!N8","v":{"v":0,"d":"0.0"}},{"$f":"'Übersicht Schützen'!O8","v":{"v":0,"d":"0.0"}},{"$f":"'Übersicht Schützen'!P8","v":{"v":0,"d":"0.0"}},{"$f":"'Übersicht Schützen'!Q8","v":{"v":0,"d":"0.0"}},{"$f":"'Übersicht Schützen'!R8","v":{"v":0,"d":"0.00"}},{"v":0,"d":"0.0"},{"$f":"'Übersicht Schützen'!U8","v":{"v":310.41666666666663,"d":"310.42"}},{"v":1862.4999999999998,"d":"1,862.5"},{"v":-4.300000000000182,"d":"-4.3"}]
[8,{"$f":"'Übersicht Schützen'!A9","v":"Horst Sabel"},{"$f":"'Übersicht Schützen'!B9","v":"Börgerwald II"},{"$f":"'Übersicht Schützen'!C9","v":311.8},{"$f":"'Übersicht Schützen'!D9","v":314.7},{"$f":"'Übersicht Schützen'!E9","v":308.9},{"$f":"'Übersicht Schützen'!F9","v":{"v":309,"d":"309.0"}},{"$f":"'Übersicht Schützen'!G9","v":309.4},{"$f":"'Übersicht Schützen'!H9","v":{"v":308,"d":"308.0"}},{"$f":"'Übersicht Schützen'!I9","v":{"v":310.3,"d":"310.30"}},{"v":1861.8000000000002,"d":"1,861.8"},{"$f":"'Übersicht Schützen'!L9","v":{"v":0,"d":"0.0"}},{"$f":"'Übersicht Schützen'!M9","v":{"v":0,"d":"0.0"}},{"$f":"'Übersicht Schützen'!N9","v":{"v":0,"d":"0.0"}},{"$f":"'Übersicht Schützen'!O9","v":{"v":0,"d":"0.0"}},{"$f":"'Übersicht Schützen'!P9","v":{"v":0,"d":"0.0"}},{"$f":"'Übersicht Schützen'!Q9","v":{"v":0,"d":"0.0"}},{"$f":"'Übersicht Schützen'!R9","v":{"v":0,"d":"0.00"}},{"v":0,"d":"0.0"},{"$f":"'Übersicht Schützen'!U9","v":{"v":310.3,"d":"310.30"}},{"v":1861.8000000000002,"d":"1,861.8"},{"v":-0.6999999999995907,"d":"-0.7"}]
[9,{"$f":"'Übersicht Schützen'!A10","v":"Markus Janßen"},{"$f":"'Übersicht Schützen'!B10","v":"Neuvrees I"},{"$f":"'Übersicht Schützen'!C10","v":{"v":310,"d":"310.0"}},{"$f":"'Übersicht Schützen'!D10","v":311.6},{"$f":"'Übersicht Schützen'!E10","v":{"v":308,"d":"308.0"}},{"$f":"'Übersicht Schützen'!F10","v":309.9},{"$f":"'Übersicht Schützen'!G10","v":310.2},{"$f":"'Übersicht Schützen'!H10","v":310.9},{"$f":"'Übersicht Schützen'!I10","v":{"v":310.09999999999997,"d":"310.10"}},{"v":1860.6,"d":"1,860.6"},{"$f":"'Übersicht Schützen'!L10","v":{"v":0,"d":"0.0"}},{"$f":"'Übersicht Schützen'!M10","v":{"v":0,"d":"0.0"}},{"$f":"'Übersicht Schützen'!N10","v":{"v":0,"d":"0.0"}},{"$f":"'Übersicht Schützen'!O10","v":{"v":0,"d":"0.0"}},{"$f":"'Übersicht Schützen'!P10","v":{"v":0,"d":"0.0"}},{"$f":"'Übersicht Schützen'!Q10","v":{"v":0,"d":"0.0"}},{"$f":"'Übersicht Schützen'!R10","v":{"v":0,"d":"0.00"}},{"v":0,"d":"0.0"},{"$f":"'Übersicht Schützen'!U10","v":{"v":310.09999999999997,"d":"310.10"}},{"v":1860.6,"d":"1,860.6"},{"v":-1.2000000000002728,"d":"-1.2"}]
[10,{"$f":"'Übersicht Schützen'!A11","v":"Karl-Heinz Schrand"},{"$f":"'Übersicht Schützen'!B11","v":"Neuvrees II"},{"$f":"'Übersicht Schützen'!C11","v":307.5},{"$f":"'Übersicht Schützen'!D11","v":308.7},{"$f":"'Übersicht Schützen'!E11","v":312.5},{"$f":"'Übersicht Schützen'!F11","v":311.1},{"$f":"'Übersicht Schützen'!G11","v":313.1},{"$f":"'Übersicht Schützen'!H11","v":307.6},{"$f":"'Übersicht Schützen'!I11","v":{"v":310.0833333333333,"d":"310.08"}},{"v":1860.5,"d":"1,860.5"},{"$f":"'Übersicht Schützen'!L11","v":{"v":0,"d":"0.0"}},{"$f":"'Übersicht Schützen'!M11","v":{"v":0,"d":"0.0"}},{"$f":"'Übersicht Schützen'!N11","v":{"v":0,"d":"0.0"}},{"$f":"'Übersicht Schützen'!O11","v":{"v":0,"d":"0.0"}},{"$f":"'Übersicht Schützen'!P11","v":{"v":0,"d":"0.0"}},{"$f":"'Übersicht Schützen'!Q11","v":{"v":0,"d":"0.0"}},{"$f":"'Übersicht Schützen'!R11","v":{"v":0,"d":"0.00"}},{"v":0,"d":"0.0"},{"$f":"'Übersicht Schützen'!U11","v":{"v":310.0833333333333,"d":"310.08"}},{"v":1860.5,"d":"1,860.5"},{"v":-0.09999999999990905,"d":"-0.1"}]
[11,{"$f":"'Übersicht Schützen'!A12","v":"Vitalij Schmidt"},{"$f":"'Übersicht Schützen'!B12","v":"Lahn IV"},{"$f":"'Übersicht Schützen'!C12","v":308.8},{"$f":"'Übersicht Schützen'!D12","v":307.8},{"$f":"'Übersicht Schützen'!E12","v":310.4},{"$f":"'Übersicht Schützen'!F12","v":314.5},{"$f":"'Übersicht Schützen'!G12","v":306.7},{"$f":"'Übersicht Schützen'!H12","v":311.8},{"$f":"'Übersicht Schützen'!I12","v":{"v":310,"d":"310.00"}},{"v":1860,"d":"1,860.0"},{"$f":"'Übersicht Schützen'!L12","v":{"v":0,"d":"0.0"}},{"$f":"'Übersicht Schützen'!M12","v":{"v":0,"d":"0.0"}},{"$f":"'Übersicht Schützen'!N12","v":{"v":0,"d":"0.0"}},{"$f":"'Übersicht Schützen'!O12","v":{"v":0,"d":"0.0"}},{"$f":"'Übersicht Schützen'!P12","v":{"v":0,"d":"0.0"}},{"$f":"'Übersicht Schützen'!Q12","v":{"v":0,"d":"0.0"}},{"$f":"'Übersicht Schützen'!R12","v":{"v":0,"d":"0.00"}},{"v":0,"d":"0.0"},{"$f":"'Übersicht Schützen'!U12","v":{"v":310,"d":"310.00"}},{"v":1860,"d":"1,860.0"},-0.5]
[12,{"$f":"'Übersicht Schützen'!A13","v":"Jens Henzen"},{"$f":"'Übersicht Schützen'!B13","v":"Börger III"},{"$f":"'Übersicht Schützen'!C13","v":305.6},{"$f":"'Übersicht Schützen'!D13","v":304.2},{"$f":"'Übersicht Schützen'!E13","v":309.7},{"$f":"'Übersicht Schützen'!F13","v":308.3},{"$f":"'Übersicht Schützen'!G13","v":313.1},{"$f":"'Übersicht Schützen'!H13","v":313.6},{"$f":"'Übersicht Schützen'!I13","v":{"v":309.0833333333333,"d":"309.08"}},{"v":1854.5,"d":"1,854.5"},{"$f":"'Übersicht Schützen'!L13","v":{"v":0,"d":"0.0"}},{"$f":"'Übersicht Schützen'!M13","v":{"v":0,"d":"0.0"}},{"$f":"'Übersicht Schützen'!N13","v":{"v":0,"d":"0.0"}},{"$f":"'Übersicht Schützen'!O13","v":{"v":0,"d":"0.0"}},{"$f":"'Übersicht Schützen'!P13","v":{"v":0,"d":"0.0"}},{"$f":"'Übersicht Schützen'!Q13","v":{"v":0,"d":"0.0"}},{"$f":"'Übersicht Schützen'!R13","v":{"v":0,"d":"0.00"}},{"v":0,"d":"0.0"},{"$f":"'Übersicht Schützen'!U13","v":{"v":309.0833333333333,"d":"309.08"}},{"v":1854.5,"d":"1,854.5"},-5.5]
[13,{"$f":"'Übersicht Schützen'!A14","v":"Hermann Benten"},{"$f":"'Übersicht Schützen'!B14","v":"Lahn IV"},{"$f":"'Übersicht Schützen'!C14","v":307.6},{"$f":"'Übersicht Schützen'!D14","v":311.2},{"$f":"'Übersicht Schützen'!E14","v":310.1},{"$f":"'Übersicht Schützen'!F14","v":309.4},{"$f":"'Übersicht Schützen'!G14","v":309.4},{"$f":"'Übersicht Schützen'!H14","v":304.1},{"$f":"'Übersicht Schützen'!I14","v":{"v":308.63333333333327,"d":"308.63"}},{"v":1851.7999999999997,"d":"1,851.8"},{"$f":"'Übersicht Schützen'!L14","v":{"v":0,"d":"0.0"}},{"$f":"'Übersicht Schützen'!M14","v":{"v":0,"d":"0.0"}},{"$f":"'Übersicht Schützen'!N14","v":{"v":0,"d":"0.0"}},{"$f":"'Übersicht Schützen'!O14","v":{"v":0,"d":"0.0"}},{"$f":"'Übersicht Schützen'!P14","v":{"v":0,"d":"0.0"}},{"$f":"'Übersicht Schützen'!Q14","v":{"v":0,"d":"0.0"}},{"$f":"'Übersicht Schützen'!R14","v":{"v":0,"d":"0.00"}},{"v":0,"d":"0.0"},{"$f":"'Übersicht Schützen'!U14","v":{"v":308.63333333333327,"d":"308.63"}},{"v":1851.7999999999997,"d":"1,851.8"},{"v":-2.700000000000273,"d":"-2.7"}]
[14,{"$f":"'Übersicht Schützen'!A15","v":"Friedhelm Schroer"},{"$f":"'Übersicht Schützen'!B15","v":"Börgerwald II"},{"$f":"'Übersicht Schützen'!C15","v":{"v":307,"d":"307.0"}},{"$f":"'Übersicht Schützen'!D15","v":307.4},{"$f":"'Übersicht Schützen'!E15","v":311.3},{"$f":"'Übersicht Schützen'!F15","v":310.7},{"$f":"'Übersicht Schützen'!G15","v":305.4},{"$f":"'Übersicht Schützen'!H15","v":{"v":309,"d":"309.0"}},{"$f":"'Übersicht Schützen'!I15","v":{"v":308.4666666666667,"d":"308.47"}},{"v":1850.8000000000002,"d":"1,850.8"},{"$f":"'Übersicht Schützen'!L15","v":{"v":0,"d":"0.0"}},{"$f":"'Übersicht Schützen'!M15","v":{"v":0,"d":"0.0"}},{"$f":"'Übersicht Schützen'!N15","v":{"v":0,"d":"0.0"}},{"$f":"'Übersicht Schützen'!O15","v":{"v":0,"d":"0.0"}},{"$f":"'Übersicht Schützen'!P15","v":{"v":0,"d":"0.0"}},{"$f":"'Übersicht Schützen'!Q15","v":{"v":0,"d":"0.0"}},{"$f":"'Übersicht Schützen'!R15","v":{"v":0,"d":"0.00"}},{"v":0,"d":"0.0"},{"$f":"'Übersicht Schützen'!U15","v":{"v":308.4666666666667,"d":"308.47"}},{"v":1850.8000000000002,"d":"1,850.8"},{"v":-0.9999999999995453,"d":"-1.0"}]
[15,{"$f":"'Übersicht Schützen'!A16","v":"Holger Szczepanski"},{"$f":"'Übersicht Schützen'!B16","v":"Neuvrees II"},{"$f":"'Übersicht Schützen'!C16","v":303.2},{"$f":"'Übersicht Schützen'!D16","v":311.6},{"$f":"'Übersicht Schützen'!E16","v":305.9},{"$f":"'Übersicht Schützen'!F16","v":309.2},{"$f":"'Übersicht Schützen'!G16","v":310.2},{"$f":"'Übersicht Schützen'!H16","v":309.6},{"$f":"'Übersicht Schützen'!I16","v":{"v":308.2833333333333,"d":"308.28"}},{"v":1849.6999999999998,"d":"1,849.7"},{"$f":"'Übersicht Schützen'!L16","v":{"v":0,"d":"0.0"}},{"$f":"'Übersicht Schützen'!M16","v":{"v":0,"d":"0.0"}},{"$f":"'Übersicht Schützen'!N16","v":{"v":0,"d":"0.0"}},{"$f":"'Übersicht Schützen'!O16","v":{"v":0,"d":"0.0"}},{"$f":"'Übersicht Schützen'!P16","v":{"v":0,"d":"0.0"}},{"$f":"'Übersicht Schützen'!Q16","v":{"v":0,"d":"0.0"}},{"$f":"'Übersicht Schützen'!R16","v":{"v":0,"d":"0.00"}},{"v":0,"d":"0.0"},{"$f":"'Übersicht Schützen'!U16","v":{"v":308.2833333333333,"d":"308.28"}},{"v":1849.6999999999998,"d":"1,849.7"},{"v":-1.1000000000003638,"d":"-1.1"}]
[16,{"$f":"'Übersicht Schützen'!A17","v":"Jürgen Schroer"},{"$f":"'Übersicht Schützen'!B17","v":"Börger III"},{"$f":"'Übersicht Schützen'!C17","v":307.2},{"$f":"'Übersicht Schützen'!D17","v":310.3},{"$f":"'Übersicht Schützen'!E17","v":307.6},{"$f":"'Übersicht Schützen'!F17","v":307.1},{"$f":"'Übersicht Schützen'!G17","v":314.1},{"$f":"'Übersicht Schützen'!H17","v":303.3},{"$f":"'Übersicht Schützen'!I17","v":{"v":308.2666666666667,"d":"308.27"}},{"v":1849.6000000000001,"d":"1,849.6"},{"$f":"'Übersicht Schützen'!L17","v":{"v":0,"d":"0.0"}},{"$f":"'Übersicht Schützen'!M17","v":{"v":0,"d":"0.0"}},{"$f":"'Übersicht Schützen'!N17","v":{"v":0,"d":"0.0"}},{"$f":"'Übersicht Schützen'!O17","v":{"v":0,"d":"0.0"}},{"$f":"'Übersicht Schützen'!P17","v":{"v":0,"d":"0.0"}},{"$f":"'Übersicht Schützen'!Q17","v":{"v":0,"d":"0.0"}},{"$f":"'Übersicht Schützen'!R17","v":{"v":0,"d":"0.00"}},{"v":0,"d":"0.0"},{"$f":"'Übersicht Schützen'!U17","v":{"v":308.2666666666667,"d":"308.27"}},{"v":1849.6000000000001,"d":"1,849.6"},{"v":-0.09999999999968168,"d":"-0.1"}]
[17,{"$f":"'Übersicht Schützen'!A18","v":"Klaus Steenken"},{"$f":"'Übersicht Schützen'!B18","v":"Neuvrees I"},{"$f":"'Übersicht Schützen'!C18","v":308.9},{"$f":"'Übersicht Schützen'!D18","v":{"v":305,"d":"305.0"}},{"$f":"'Übersicht Schützen'!E18","v":308.3},{"$f":"'Übersicht Schützen'!F18","v":309.2},{"$f":"'Übersicht Schützen'!G18","v":309.4},{"$f":"'Übersicht Schützen'!H18","v":308.2},{"$f":"'Übersicht Schützen'!I18","v":{"v":308.1666666666667,"d":"308.17"}},{"v":1849.0000000000002,"d":"1,849.0"},{"$f":"'Übersicht Schützen'!L18","v":{"v":0,"d":"0.0"}},{"$f":"'Übersicht Schützen'!M18","v":{"v":0,"d":"0.0"}},{"$f":"'Übersicht Schützen'!N18","v":{"v":0,"d":"0.0"}},{"$f":"'Übersicht Schützen'!O18","v":{"v":0,"d":"0.0"}},{"$f":"'Übersicht Schützen'!P18","v":{"v":0,"d":"0.0"}},{"$f":"'Übersicht Schützen'!Q18","v":{"v":0,"d":"0.0"}},{"$f":"'Übersicht Schützen'!R18","v":{"v":0,"d":"0.00"}},{"v":0,"d":"0.0"},{"$f":"'Übersicht Schützen'!U18","v":{"v":308.1666666666667,"d":"308.17"}},{"v":1849.0000000000002,"d":"1,849.0"},{"v":-0.599999999999909,"d":"-0.6"}]
[18,{"$f":"'Übersicht Schützen'!A19","v":"Wilfried Breyer"},{"$f":"'Übersicht Schützen'!B19","v":"Neuvrees I"},{"$f":"'Übersicht Schützen'!C19","v":311.3},{"$f":"'Übersicht Schützen'!D19","v":302.6},{"$f":"'Übersicht Schützen'!E19","v":308.6},{"$f":"'Übersicht Schützen'!F19","v":310.7},{"$f":"'Übersicht Schützen'!G19","v":312.1},{"$f":"'Übersicht Schützen'!H19","v":302.6},{"$f":"'Übersicht Schützen'!I19","v":{"v":307.98333333333335,"d":"307.98"}},{"v":1847.9,"d":"1,847.9"},{"$f":"'Übersicht Schützen'!L19","v":{"v":0,"d":"0.0"}},{"$f":"'Übersicht Schützen'!M19","v":{"v":0,"d":"0.0"}},{"$f":"'Übersicht Schützen'!N19","v":{"v":0,"d":"0.0"}},{"$f":"'Übersicht Schützen'!O19","v":{"v":0,"d":"0.0"}},{"$f":"'Übersicht Schützen'!P19","v":{"v":0,"d":"0.0"}},{"$f":"'Übersicht Schützen'!Q19","v":{"v":0,"d":"0.0"}},{"$f":"'Übersicht Schützen'!R19","v":{"v":0,"d":"0.00"}},{"v":0,"d":"0.0"},{"$f":"'Übersicht Schützen'!U19","v":{"v":307.98333333333335,"d":"307.98"}},{"v":1847.9,"d":"1,847.9"},{"v":-1.1000000000001364,"d":"-1.1"}]
[19,{"$f":"'Übersicht Schützen'!A20","v":"Markus Jungsthöfel"},{"$f":"'Übersicht Schützen'!B20","v":"Börger II"},{"$f":"'Übersicht Schützen'!C20","v":312.5},{"$f":"'Übersicht Schützen'!D20","v":307.3},{"$f":"'Übersicht Schützen'!E20","v":308.1},{"$f":"'Übersicht Schützen'!F20","v":306.7},{"$f":"'Übersicht Schützen'!G20","v":305.4},{"$f":"'Übersicht Schützen'!H20","v":306.9},{"$f":"'Übersicht Schützen'!I20","v":{"v":307.81666666666666,"d":"307.82"}},{"v":1846.9,"d":"1,846.9"},{"$f":"'Übersicht Schützen'!L20","v":{"v":0,"d":"0.0"}},{"$f":"'Übersicht Schützen'!M20","v":{"v":0,"d":"0.0"}},{"$f":"'Übersicht Schützen'!N20","v":{"v":0,"d":"0.0"}},{"$f":"'Übersicht Schützen'!O20","v":{"v":0,"d":"0.0"}},{"$f":"'Übersicht Schützen'!P20","v":{"v":0,"d":"0.0"}},{"$f":"'Übersicht Schützen'!Q20","v":{"v":0,"d":"0.0"}},{"$f":"'Übersicht Schützen'!R20","v":{"v":0,"d":"0.00"}},{"v":0,"d":"0.0"},{"$f":"'Übersicht Schützen'!U20","v":{"v":307.81666666666666,"d":"307.82"}},{"v":1846.9,"d":"1,846.9"},{"v":-1,"d":"-1.0"}]
[20,{"$f":"'Übersicht Schützen'!A21","v":"Daniel Sebers"},{"$f":"'Übersicht Schützen'!B21","v":"Börger III"},{"$f":"'Übersicht Schützen'!C21","v":303.3},{"$f":"'Übersicht Schützen'!D21","v":307.4},{"$f":"'Übersicht Schützen'!E21","v":309.5},{"$f":"'Übersicht Schützen'!F21","v":{"v":312,"d":"312.0"}},{"$f":"'Übersicht Schützen'!G21","v":307.2},{"$f":"'Übersicht Schützen'!H21","v":306.4},{"$f":"'Übersicht Schützen'!I21","v":{"v":307.6333333333334,"d":"307.63"}},{"v":1845.8000000000002,"d":"1,845.8"},{"$f":"'Übersicht Schützen'!L21","v":{"v":0,"d":"0.0"}},{"$f":"'Übersicht Schützen'!M21","v":{"v":0,"d":"0.0"}},{"$f":"'Übersicht Schützen'!N21","v":{"v":0,"d":"0.0"}},{"$f":"'Übersicht Schützen'!O21","v":{"v":0,"d":"0.0"}},{"$f":"'Übersicht Schützen'!P21","v":{"v":0,"d":"0.0"}},{"$f":"'Übersicht Schützen'!Q21","v":{"v":0,"d":"0.0"}},{"$f":"'Übersicht Schützen'!R21","v":{"v":0,"d":"0.00"}},{"v":0,"d":"0.0"},{"$f":"'Übersicht Schützen'!U21","v":{"v":307.6333333333334,"d":"307.63"}},{"v":1845.8000000000002,"d":"1,845.8"},{"v":-1.099999999999909,"d":"-1.1"}]
[21,{"$f":"'Übersicht Schützen'!A22","v":"Bernd Rode"},{"$f":"'Übersicht Schützen'!B22","v":"Börger III"},{"$f":"'Übersicht Schützen'!C22","v":304.2},{"$f":"'Übersicht Schützen'!D22","v":304.9},{"$f":"'Übersicht Schützen'!E22","v":{"v":308,"d":"308.0"}},{"$f":"'Übersicht Schützen'!F22","v":308.2},{"$f":"'Übersicht Schützen'!G22","v":309.2},{"$f":"'Übersicht Schützen'!H22","v":308.7},{"$f":"'Übersicht Schützen'!I22","v":{"v":307.2,"d":"307.20"}},{"v":1843.2,"d":"1,843.2"},{"$f":"'Übersicht Schützen'!L22","v":{"v":0,"d":"0.0"}},{"$f":"'Übersicht Schützen'!M22","v":{"v":0,"d":"0.0"}},{"$f":"'Übersicht Schützen'!N22","v":{"v":0,"d":"0.0"}},{"$f":"'Übersicht Schützen'!O22","v":{"v":0,"d":"0.0"}},{"$f":"'Übersicht Schützen'!P22","v":{"v":0,"d":"0.0"}},{"$f":"'Übersicht Schützen'!Q22","v":{"v":0,"d":"0.0"}},{"$f":"'Übersicht Schützen'!R22","v":{"v":0,"d":"0.00"}},{"v":0,"d":"0.0"},{"$f":"'Übersicht Schützen'!U22","v":{"v":307.2,"d":"307.20"}},{"v":1843.2,"d":"1,843.2"},{"v":-2.6000000000001364,"d":"-2.6"}]
[22,{"$f":"'Übersicht Schützen'!A23","v":"Werner Thyen"},{"$f":"'Übersicht Schützen'!B23","v":"Neuvrees I"},{"$f":"'Übersicht Schützen'!C23","v":311.2},{"$f":"'Übersicht Schützen'!D23","v":304.7},{"$f":"'Übersicht Schützen'!E23","v":309.1},{"$f":"'Übersicht Schützen'!F23","v":302.1},{"$f":"'Übersicht Schützen'!G23","v":308.9},{"$f":"'Übersicht Schützen'!H23","v":302.4},{"$f":"'Übersicht Schützen'!I23","v":{"v":306.40000000000003,"d":"306.40"}},{"v":1838.4,"d":"1,838.4"},{"$f":"'Übersicht Schützen'!L23","v":{"v":0,"d":"0.0"}},{"$f":"'Übersicht Schützen'!M23","v":{"v":0,"d":"0.0"}},{"$f":"'Übersicht Schützen'!N23","v":{"v":0,"d":"0.0"}},{"$f":"'Übersicht Schützen'!O23","v":{"v":0,"d":"0.0"}},{"$f":"'Übersicht Schützen'!P23","v":{"v":0,"d":"0.0"}},{"$f":"'Übersicht Schützen'!Q23","v":{"v":0,"d":"0.0"}},{"$f":"'Übersicht Schützen'!R23","v":{"v":0,"d":"0.00"}},{"v":0,"d":"0.0"},{"$f":"'Übersicht Schützen'!U23","v":{"v":306.40000000000003,"d":"306.40"}},{"v":1838.4,"d":"1,838.4"},{"v":-4.7999999999999545,"d":"-4.8"}]
[23,{"$f":"'Übersicht Schützen'!A24","v":"Oliver Reinelt"},{"$f":"'Übersicht Schützen'!B24","v":"Lahn IV"},{"$f":"'Übersicht Schützen'!C24","v":302.3},{"$f":"'Übersicht Schützen'!D24","v":310.3},{"$f":"'Übersicht Schützen'!E24","v":307.2},{"$f":"'Übersicht Schützen'!F24","v":305.2},{"$f":"'Übersicht Schützen'!G24","v":304.6},{"$f":"'Übersicht Schützen'!H24","v":304.6},{"$f":"'Übersicht Schützen'!I24","v":{"v":305.7,"d":"305.70"}},{"v":1834.1999999999998,"d":"1,834.2"},{"$f":"'Übersicht Schützen'!L24","v":{"v":0,"d":"0.0"}},{"$f":"'Übersicht Schützen'!M24","v":{"v":0,"d":"0.0"}},{"$f":"'Übersicht Schützen'!N24","v":{"v":0,"d":"0.0"}},{"$f":"'Übersicht Schützen'!O24","v":{"v":0,"d":"0.0"}},{"$f":"'Übersicht Schützen'!P24","v":{"v":0,"d":"0.0"}},{"$f":"'Übersicht Schützen'!Q24","v":{"v":0,"d":"0.0"}},{"$f":"'Übersicht Schützen'!R24","v":{"v":0,"d":"0.00"}},{"v":0,"d":"0.0"},{"$f":"'Übersicht Schützen'!U24","v":{"v":305.7,"d":"305.70"}},{"v":1834.1999999999998,"d":"1,834.2"},{"v":-4.200000000000273,"d":"-4.2"}]
[24,{"$f":"'Übersicht Schützen'!A25","v":"Uwe Goldenstein"},{"$f":"'Übersicht Schützen'!B25","v":"Börger II"},{"$f":"'Übersicht Schützen'!C25","v":304.5},{"$f":"'Übersicht Schützen'!D25","v":{"v":304,"d":"304.0"}},{"$f":"'Übersicht Schützen'!E25","v":304.6},{"$f":"'Übersicht Schützen'!F25","v":302.8},{"$f":"'Übersicht Schützen'!G25","v":306.2},{"$f":"'Übersicht Schützen'!H25","v":{"v":299,"d":"299.0"}},{"$f":"'Übersicht Schützen'!I25","v":{"v":303.5166666666667,"d":"303.52"}},{"v":1821.1000000000001,"d":"1,821.1"},{"$f":"'Übersicht Schützen'!L25","v":{"v":0,"d":"0.0"}},{"$f":"'Übersicht Schützen'!M25","v":{"v":0,"d":"0.0"}},{"$f":"'Übersicht Schützen'!N25","v":{"v":0,"d":"0.0"}},{"$f":"'Übersicht Schützen'!O25","v":{"v":0,"d":"0.0"}},{"$f":"'Übersicht Schützen'!P25","v":{"v":0,"d":"0.0"}},{"$f":"'Übersicht Schützen'!Q25","v":{"v":0,"d":"0.0"}},{"$f":"'Übersicht Schützen'!R25","v":{"v":0,"d":"0.00"}},{"v":0,"d":"0.0"},{"$f":"'Übersicht Schützen'!U25","v":{"v":303.5166666666667,"d":"303.52"}},{"v":1821.1000000000001,"d":"1,821.1"},{"v":-13.099999999999682,"d":"-13.1"}]
[25,{"$f":"'Übersicht Schützen'!A26","v":"Mathis Antons"},{"$f":"'Übersicht Schützen'!B26","v":"Börgerwald II"},{"$f":"'Übersicht Schützen'!C26","v":314.1},{"$f":"'Übersicht Schützen'!D26","v":308.6},{"$f":"'Übersicht Schützen'!E26","v":310.9},{"$f":"'Übersicht Schützen'!F26","v":314.6},{"$f":"'Übersicht Schützen'!G26","v":310.8},{"$f":"'Übersicht Schützen'!H26","v":{"v":0,"d":"0.0"}},{"$f":"'Übersicht Schützen'!I26","v":{"v":311.8,"d":"311.80"}},{"v":1559,"d":"1,559.0"},{"$f":"'Übersicht Schützen'!L26","v":{"v":0,"d":"0.0"}},{"$f":"'Übersicht Schützen'!M26","v":{"v":0,"d":"0.0"}},{"$f":"'Übersicht Schützen'!N26","v":{"v":0,"d":"0.0"}},{"$f":"'Übersicht Schützen'!O26","v":{"v":0,"d":"0.0"}},{"$f":"'Übersicht Schützen'!P26","v":{"v":0,"d":"0.0"}},{"$f":"'Übersicht Schützen'!Q26","v":{"v":0,"d":"0.0"}},{"$f":"'Übersicht Schützen'!R26","v":{"v":0,"d":"0.00"}},{"v":0,"d":"0.0"},{"$f":"'Übersicht Schützen'!U26","v":{"v":311.8,"d":"311.80"}},{"v":1559,"d":"1,559.0"},{"v":-262.10000000000014,"d":"-262.1"}]
[26,{"$f":"'Übersicht Schützen'!A27","v":"Hermann Schwarte"},{"$f":"'Übersicht Schützen'!B27","v":"Börger II"},{"$f":"'Übersicht Schützen'!C27","v":305.8},{"$f":"'Übersicht Schützen'!D27","v":310.7},{"$f":"'Übersicht Schützen'!E27","v":304.4},{"$f":"'Übersicht Schützen'!F27","v":310.7},{"$f":"'Übersicht Schützen'!G27","v":302.1},{"$f":"'Übersicht Schützen'!H27","v":{"v":0,"d":"0.0"}},{"$f":"'Übersicht Schützen'!I27","v":{"v":306.73999999999995,"d":"306.74"}},{"v":1533.6999999999998,"d":"1,533.7"},{"$f":"'Übersicht Schützen'!L27","v":{"v":0,"d":"0.0"}},{"$f":"'Übersicht Schützen'!M27","v":{"v":0,"d":"0.0"}},{"$f":"'Übersicht Schützen'!N27","v":{"v":0,"d":"0.0"}},{"$f":"'Übersicht Schützen'!O27","v":{"v":0,"d":"0.0"}},{"$f":"'Übersicht Schützen'!P27","v":{"v":0,"d":"0.0"}},{"$f":"'Übersicht Schützen'!Q27","v":{"v":0,"d":"0.0"}},{"$f":"'Übersicht Schützen'!R27","v":{"v":0,"d":"0.00"}},{"v":0,"d":"0.0"},{"$f":"'Übersicht Schützen'!U27","v":{"v":306.73999999999995,"d":"306.74"}},{"v":1533.6999999999998,"d":"1,533.7"},{"v":-25.300000000000182,"d":"-25.3"}]
[27,{"$f":"'Übersicht Schützen'!A28","v":"Marc Eckmann"},{"$f":"'Übersicht Schützen'!B28","v":"Börger II"},{"$f":"'Übersicht Schützen'!C28","v":290.2},{"$f":"'Übersicht Schützen'!D28","v":303.8},{"$f":"'Übersicht Schützen'!E28","v":{"v":0,"d":"0.0"}},{"$f":"'Übersicht Schützen'!F28","v":304.4},{"$f":"'Übersicht Schützen'!G28","v":299.4},{"$f":"'Übersicht Schützen'!H28","v":304.5},{"$f":"'Übersicht Schützen'!I28","v":300.46},{"v":1502.3,"d":"1,502.3"},{"$f":"'Übersicht Schützen'!L28","v":{"v":0,"d":"0.0"}},{"$f":"'Übersicht Schützen'!M28","v":{"v":0,"d":"0.0"}},{"$f":"'Übersicht Schützen'!N28","v":{"v":0,"d":"0.0"}},{"$f":"'Übersicht Schützen'!O28","v":{"v":0,"d":"0.0"}},{"$f":"'Übersicht Schützen'!P28","v":{"v":0,"d":"0.0"}},{"$f":"'Übersicht Schützen'!Q28","v":{"v":0,"d":"0.0"}},{"$f":"'Übersicht Schützen'!R28","v":{"v":0,"d":"0.00"}},{"v":0,"d":"0.0"},{"$f":"'Übersicht Schützen'!U28","v":300.46},{"v":1502.3,"d":"1,502.3"},{"v":-31.399999999999864,"d":"-31.4"}]
[28,{"$f":"'Übersicht Schützen'!A29","v":"Toni Stahl"},{"$f":"'Übersicht Schützen'!B29","v":"Börgerwald II"},{"$f":"'Übersicht Schützen'!C29","v":296.7},{"$f":"'Übersicht Schützen'!D29","v":291.6},{"$f":"'Übersicht Schützen'!E29","v":277.7},{"$f":"'Übersicht Schützen'!F29","v":295.9},{"$f":"'Übersicht Schützen'!G29","v":{"v":0,"d":"0.0"}},{"$f":"'Übersicht Schützen'!H29","v":296.3},{"$f":"'Übersicht Schützen'!I29","v":291.64},{"v":1458.2,"d":"1,458.2"},{"$f":"'Übersicht Schützen'!L29","v":{"v":0,"d":"0.0"}},{"$f":"'Übersicht Schützen'!M29","v":{"v":0,"d":"0.0"}},{"$f":"'Übersicht Schützen'!N29","v":{"v":0,"d":"0.0"}},{"$f":"'Übersicht Schützen'!O29","v":{"v":0,"d":"0.0"}},{"$f":"'Übersicht Schützen'!P29","v":{"v":0,"d":"0.0"}},{"$f":"'Übersicht Schützen'!Q29","v":{"v":0,"d":"0.0"}},{"$f":"'Übersicht Schützen'!R29","v":{"v":0,"d":"0.00"}},{"v":0,"d":"0.0"},{"$f":"'Übersicht Schützen'!U29","v":291.64},{"v":1458.2,"d":"1,458.2"},{"v":-44.09999999999991,"d":"-44.1"}]
[29,{"$f":"'Übersicht Schützen'!A30","v":"Carsten Peters"},{"$f":"'Übersicht Schützen'!B30","v":"Neuvrees I"},{"$f":"'Übersicht Schützen'!C30","v":{"v":0,"d":"0.0"}},{"$f":"'Übersicht Schützen'!D30","v":307.9},{"$f":"'Übersicht Schützen'!E30","v":{"v":0,"d":"0.0"}},{"$f":"'Übersicht Schützen'!F30","v":308.3},{"$f":"'Übersicht Schützen'!G30","v":304.1},{"$f":"'Übersicht Schützen'!H30","v":299.1},{"$f":"'Übersicht Schützen'!I30","v":304.85},{"v":1219.4,"d":"1,219.4"},{"$f":"'Übersicht Schützen'!L30","v":{"v":0,"d":"0.0"}},{"$f":"'Übersicht Schützen'!M30","v":{"v":0,"d":"0.0"}},{"$f":"'Übersicht Schützen'!N30","v":{"v":0,"d":"0.0"}},{"$f":"'Übersicht Schützen'!O30","v":{"v":0,"d":"0.0"}},{"$f":"'Übersicht Schützen'!P30","v":{"v":0,"d":"0.0"}},{"$f":"'Übersicht Schützen'!Q30","v":{"v":0,"d":"0.0"}},{"$f":"'Übersicht Schützen'!R30","v":{"v":0,"d":"0.00"}},{"v":0,"d":"0.0"},{"$f":"'Übersicht Schützen'!U30","v":304.85},{"v":1219.4,"d":"1,219.4"},{"v":0,"d":"0.0"}]
[30,{"$f":"'Übersicht Schützen'!A31","v":"Tobias Sebers"},{"$f":"'Übersicht Schützen'!B31","v":"Börgerwald II"},{"$f":"'Übersicht Schützen'!C31","v":{"v":0,"d":"0.0"}},{"$f":"'Übersicht Schützen'!D31","v":300.8},{"$f":"'Übersicht Schützen'!E31","v":{"v":295,"d":"295.0"}},{"$f":"'Übersicht Schützen'!F31","v":{"v":0,"d":"0.0"}},{"$f":"'Übersicht Schützen'!G31","v":304.6},{"$f":"'Übersicht Schützen'!H31","v":298.6},{"$f":"'Übersicht Schützen'!I31","v":299.75},{"v":1199,"d":"1,199.0"},{"$f":"'Übersicht Schützen'!L31","v":{"v":0,"d":"0.0"}},{"$f":"'Übersicht Schützen'!M31","v":{"v":0,"d":"0.0"}},{"$f":"'Übersicht Schützen'!N31","v":{"v":0,"d":"0.0"}},{"$f":"'Übersicht Schützen'!O31","v":{"v":0,"d":"0.0"}},{"$f":"'Übersicht Schützen'!P31","v":{"v":0,"d":"0.0"}},{"$f":"'Übersicht Schützen'!Q31","v":{"v":0,"d":"0.0"}},{"$f":"'Übersicht Schützen'!R31","v":{"v":0,"d":"0.00"}},{"v":0,"d":"0.0"},{"$f":"'Übersicht Schützen'!U31","v":299.75},{"v":1199,"d":"1,199.0"},{"v":-20.40000000000009,"d":"-20.4"}]
[31,{"$f":"'Übersicht Schützen'!A32","v":"Christian Robben"},{"$f":"'Übersicht Schützen'!B32","v":"Börgerwald II"},{"$f":"'Übersicht Schützen'!C32","v":282.8},{"$f":"'Übersicht Schützen'!D32","v":{"v":0,"d":"0.0"}},{"$f":"'Übersicht Schützen'!E32","v":{"v":0,"d":"0.0"}},{"$f":"'Übersicht Schützen'!F32","v":296.8},{"$f":"'Übersicht Schützen'!G32","v":296.6},{"$f":"'Übersicht Schützen'!H32","v":301.6},{"$f":"'Übersicht Schützen'!I32","v":{"v":294.45000000000005,"d":"294.45"}},{"v":1177.8000000000002,"d":"1,177.8"},{"$f":"'Übersicht Schützen'!L32","v":{"v":0,"d":"0.0"}},{"$f":"'Übersicht Schützen'!M32","v":{"v":0,"d":"0.0"}},{"$f":"'Übersicht Schützen'!N32","v":{"v":0,"d":"0.0"}},{"$f":"'Übersicht Schützen'!O32","v":{"v":0,"d":"0.0"}},{"$f":"'Übersicht Schützen'!P32","v":{"v":0,"d":"0.0"}},{"$f":"'Übersicht Schützen'!Q32","v":{"v":0,"d":"0.0"}},{"$f":"'Übersicht Schützen'!R32","v":{"v":0,"d":"0.00"}},{"v":0,"d":"0.0"},{"$f":"'Übersicht Schützen'!U32","v":{"v":294.45000000000005,"d":"294.45"}},{"v":1177.8000000000002,"d":"1,177.8"},{"$f":"(U46-U47)*-1","v":{"v":-21.199999999999818,"d":"-21.2"}}]
[32,{"$f":"'Übersicht Schützen'!A33","v":"Hans Preuth"},{"$f":"'Übersicht Schützen'!B33","v":"Neuvrees II"},{"$f":"'Übersicht Schützen'!C33","v":307.6},{"$f":"'Übersicht Schützen'!D33","v":308.1},{"$f":"'Übersicht Schützen'!E33","v":{"v":0,"d":"0.0"}},{"$f":"'Übersicht Schützen'!F33","v":{"v":0,"d":"0.0"}},{"$f":"'Übersicht Schützen'!G33","v":{"v":0,"d":"0.0"}},{"$f":"'Übersicht Schützen'!H33","v":{"v":0,"d":"0.0"}},{"$f":"'Übersicht Schützen'!I33","v":307.85},615.7,{"$f":"'Übersicht Schützen'!L33","v":{"v":0,"d":"0.0"}},{"$f":"'Übersicht Schützen'!M33","v":{"v":0,"d":"0.0"}},{"$f":"'Übersicht Schützen'!N33","v":{"v":0,"d":"0.0"}},{"$f":"'Übersicht Schützen'!O33","v":{"v":0,"d":"0.0"}},{"$f":"'Übersicht Schützen'!P33","v":{"v":0,"d":"0.0"}},{"$f":"'Übersicht Schützen'!Q33","v":{"v":0,"d":"0.0"}},{"$f":"'Übersicht Schützen'!R33","v":{"v":0,"d":"0.00"}},{"v":0,"d":"0.0"},{"$f":"'Übersicht Schützen'!U33","v":307.85},615.7,{"v":-562.1000000000001,"d":"-562.1"}]
[33,{"$f":"'Übersicht Schützen'!A34","v":"Dietmar Spekker"},{"$f":"'Übersicht Schützen'!B34","v":"Neuvrees I"},{"$f":"'Übersicht Schützen'!C34","v":{"v":0,"d":"0.0"}},{"$f":"'Übersicht Schützen'!D34","v":{"v":0,"d":"0.0"}},{"$f":"'Übersicht Schützen'!E34","v":293.4},{"$f":"'Übersicht Schützen'!F34","v":300.4},{"$f":"'Übersicht Schützen'!G34","v":{"v":0,"d":"0.0"}},{"$f":"'Übersicht Schützen'!H34","v":{"v":0,"d":"0.0"}},{"$f":"'Übersicht Schützen'!I34","v":{"v":296.9,"d":"296.90"}},593.8,{"$f":"'Übersicht Schützen'!L34","v":{"v":0,"d":"0.0"}},{"$f":"'Übersicht Schützen'!M34","v":{"v":0,"d":"0.0"}},{"$f":"'Übersicht Schützen'!N34","v":{"v":0,"d":"0.0"}},{"$f":"'Übersicht Schützen'!O34","v":{"v":0,"d":"0.0"}},{"$f":"'Übersicht Schützen'!P34","v":{"v":0,"d":"0.0"}},{"$f":"'Übersicht Schützen'!Q34","v":{"v":0,"d":"0.0"}},{"$f":"'Übersicht Schützen'!R34","v":{"v":0,"d":"0.00"}},{"v":0,"d":"0.0"},{"$f":"'Übersicht Schützen'!U34","v":{"v":296.9,"d":"296.90"}},593.8,{"v":-21.90000000000009,"d":"-21.9"}]
[34,{"$f":"'Übersicht Schützen'!A35","v":"Martin Hinrichs"},{"$f":"'Übersicht Schützen'!B35","v":"Börgerwald II"},{"$f":"'Übersicht Schützen'!C35","v":270.5},{"$f":"'Übersicht Schützen'!D35","v":{"v":0,"d":"0.0"}},{"$f":"'Übersicht Schützen'!E35","v":{"v":0,"d":"0.0"}},{"$f":"'Übersicht Schützen'!F35","v":{"v":0,"d":"0.0"}},{"$f":"'Übersicht Schützen'!G35","v":{"v":0,"d":"0.0"}},{"$f":"'Übersicht Schützen'!H35","v":{"v":0,"d":"0.0"}},{"$f":"'Übersicht Schützen'!I35","v":{"v":270.5,"d":"270.50"}},270.5,{"$f":"'Übersicht Schützen'!L35","v":{"v":0,"d":"0.0"}},{"$f":"'Übersicht Schützen'!M35","v":{"v":0,"d":"0.0"}},{"$f":"'Übersicht Schützen'!N35","v":{"v":0,"d":"0.0"}},{"$f":"'Übersicht Schützen'!O35","v":{"v":0,"d":"0.0"}},{"$f":"'Übersicht Schützen'!P35","v":{"v":0,"d":"0.0"}},{"$f":"'Übersicht Schützen'!Q35","v":{"v":0,"d":"0.0"}},{"$f":"'Übersicht Schützen'!R35","v":{"v":0,"d":"0.00"}},{"v":0,"d":"0.0"},{"$f":"'Übersicht Schützen'!U35","v":{"v":270.5,"d":"270.50"}},270.5,{"v":-323.29999999999995,"d":"-323.3"}]
[35,{"$f":"'Übersicht Schützen'!A36","v":"Schütze 24"},{"$f":"'Übersicht Schützen'!B36","v":"Börger II"},{"$f":"'Übersicht Schützen'!C36","v":{"v":0,"d":"0.0"}},{"$f":"'Übersicht Schützen'!D36","v":{"v":0,"d":"0.0"}},{"$f":"'Übersicht Schützen'!E36","v":{"v":0,"d":"0.0"}},{"$f":"'Übersicht Schützen'!F36","v":{"v":0,"d":"0.0"}},{"$f":"'Übersicht Schützen'!G36","v":{"v":0,"d":"0.0"}},{"$f":"'Übersicht Schützen'!H36","v":{"v":0,"d":"0.0"}},{"$f":"'Übersicht Schützen'!I36","v":{"v":0,"d":"0.00"}},{"v":0,"d":"0.0"},{"$f":"'Übersicht Schützen'!L36","v":{"v":0,"d":"0.0"}},{"$f":"'Übersicht Schützen'!M36","v":{"v":0,"d":"0.0"}},{"$f":"'Übersicht Schützen'!N36","v":{"v":0,"d":"0.0"}},{"$f":"'Übersicht Schützen'!O36","v":{"v":0,"d":"0.0"}},{"$f":"'Übersicht Schützen'!P36","v":{"v":0,"d":"0.0"}},{"$f":"'Übersicht Schützen'!Q36","v":{"v":0,"d":"0.0"}},{"$f":"'Übersicht Schützen'!R36","v":{"v":0,"d":"0.00"}},{"v":0,"d":"0.0"},{"$f":"'Übersicht Schützen'!U36","v":{"v":0,"d":"0.00"}},{"v":0,"d":"0.0"},{"$f":"(U50-U51)*-1","v":-270.5}]
[36,{"$f":"'Übersicht Schützen'!A37","v":"Schütze 29"},{"$f":"'Übersicht Schützen'!B37","v":"Lahn IV"},{"$f":"'Übersicht Schützen'!C37","v":{"v":0,"d":"0.0"}},{"$f":"'Übersicht Schützen'!D37","v":{"v":0,"d":"0.0"}},{"$f":"'Übersicht Schützen'!E37","v":{"v":0,"d":"0.0"}},{"$f":"'Übersicht Schützen'!F37","v":{"v":0,"d":"0.0"}},{"$f":"'Übersicht Schützen'!G37","v":{"v":0,"d":"0.0"}},{"$f":"'Übersicht Schützen'!H37","v":{"v":0,"d":"0.0"}},{"$f":"'Übersicht Schützen'!I37","v":{"v":0,"d":"0.00"}},{"v":0,"d":"0.0"},{"$f":"'Übersicht Schützen'!L37","v":{"v":0,"d":"0.0"}},{"$f":"'Übersicht Schützen'!M37","v":{"v":0,"d":"0.0"}},{"$f":"'Übersicht Schützen'!N37","v":{"v":0,"d":"0.0"}},{"$f":"'Übersicht Schützen'!O37","v":{"v":0,"d":"0.0"}},{"$f":"'Übersicht Schützen'!P37","v":{"v":0,"d":"0.0"}},{"$f":"'Übersicht Schützen'!Q37","v":{"v":0,"d":"0.0"}},{"$f":"'Übersicht Schützen'!R37","v":{"v":0,"d":"0.00"}},{"v":0,"d":"0.0"},{"$f":"'Übersicht Schützen'!U37","v":{"v":0,"d":"0.00"}},{"v":0,"d":"0.0"},{"v":0,"d":"0.0"}]
[]
[null,null,"Schnitt:",{"$f":"IF(Formelhilfe!B45 > 0, SUM(D17:D52)/Formelhilfe!B45, 0)","v":305.8},{"$f":"IF(Formelhilfe!C45 > 0, SUM(E17:E52)/Formelhilfe!C45, 0)","v":{"v":308.1806451612903,"d":"308.2"}},{"$f":"IF(Formelhilfe!D45 > 0, SUM(F17:F52)/Formelhilfe!D45, 0)","v":{"v":307.01034482758627,"d":"307.0"}},{"$f":"IF(Formelhilfe!E45 > 0, SUM(G17:G52)/Formelhilfe!E45, 0)","v":{"v":308.62580645161285,"d":"308.6"}},{"$f":"IF(Formelhilfe!F45 > 0, SUM(H17:H52)/Formelhilfe!F45, 0)","v":{"v":308.6933333333334,"d":"308.7"}},{"$f":"IF(Formelhilfe!G45 > 0, SUM(I17:I52)/Formelhilfe!G45, 0)","v":{"v":307.11724137931037,"d":"307.1"}},{"$f":"IF(SUM(J17:J52)<>0,AVERAGEIF(J17:J52,\"<>0\"),0)","v":{"v":306.135,"d":"306.14"}},{"$f":"IF(SUM(K17:K52)<>0,AVERAGEIF(K17:K52,\"<>0\"),0)","v":{"v":1637.391176470588,"d":"1637.39"}},{"$f":"IF(Formelhilfe!I45 > 0, SUM(L17:L52)/Formelhilfe!I45, 0)","v":{"v":0,"d":"0.0"}},{"$f":"IF(Formelhilfe!J45 > 0, SUM(M17:M52)/Formelhilfe!J45, 0)","v":{"v":0,"d":"0.0"}},{"$f":"IF(Formelhilfe!K45 > 0, SUM(N17:N52)/Formelhilfe!K45, 0)","v":{"v":0,"d":"0.0"}},{"$f":"IF(Formelhilfe!L45 > 0, SUM(O17:O52)/Formelhilfe!L45, 0)","v":{"v":0,"d":"0.0"}},{"$f":"IF(Formelhilfe!M45 > 0, SUM(P17:P52)/Formelhilfe!M45, 0)","v":{"v":0,"d":"0.0"}},{"$f":"IF(Formelhilfe!N45 > 0, SUM(Q17:Q52)/Formelhilfe!N45, 0)","v":{"v":0,"d":"0.0"}},{"$f":"IF(SUM(R17:R52)<>0,AVERAGEIF(R17:R52,\"<>0\"),0)","v":{"v":0,"d":"0.00"}},{"$f":"IF(SUM(S17:S52)<>0,AVERAGEIF(S17:S52,\"<>0\"),0)","v":{"v":0,"d":"0.00"}},{"v":306.135,"d":"306.14"},{"$f":"(K54+S54)","v":{"v":1637.391176470588,"d":"1,637.39 "}}]

{"sheet":"Wettkampf 1","index":1,"n_rows":47,"n_cols":29,"rows_kept":47,"merged":[[0,24,0,25],[1,24,1,25],[4,24,4,25],[5,24,5,25],[6,24,6,25],[8,22,8,25]]}
[null,"Verein / Gruppe",null,"Ergebnisse",{"$nulls":19},"Austragungsort:",{"$f":"Übersicht!D4","v":"Börgerwald"}]
[1,"Börgerwald II",null,{"$f":"G46","v":{"v":932.9000000000001,"d":"932.9"}},{"$f":"IF(H46>4,\"Es sind zu viele Schützen in Wertung!\",\" \")","v":" "},{"$nulls":18},"Wettkampftag:",{"$f":"Übersicht!D3","v":"03.09."}]
[2,"Neuvrees II",null,{"$f":"I46","v":932.5},{"$f":"IF(J46>4,\"Es sind zu viele Schützen in Wertung!\",\" \")","v":" "}]
[3,"Börger III",null,{"$f":"K46","v":{"v":923.6000000000001,"d":"923.6"}},{"$f":"IF(L46>4,\"Es sind zu viele Schützen in Wertung!\",\" \")","v":" "},{"$nulls":20},"Ansprechpartner für Rückfragen:"]
[4,"Börger II",null,{"$f":"M46","v":{"v":934.4000000000001,"d":"934.4"}},{"$f":"IF(N46>4,\"Es sind zu viele Schützen in Wertung!\",\" \")","v":"Es sind zu viele Schützen in Wertung!"},{"$nulls":18},"Name:","Horst Sabel"]
[5,"Lahn IV",null,{"$f":"O46","v":{"v":929.5000000000001,"d":"929.5"}},{"$f":"IF(P46>4,\"Es sind zu viele Schützen in Wertung!\",\" \")","v":"Es sind zu viele Schützen in Wertung!"},{"$nulls":18},"Tel:","04965-1697"]
[6,"Neuvrees I",null,{"$f":"Q46","v":933.2},{"$f":"IF(R46>4,\"Es sind zu viele Schützen in Wertung!\",\" \")","v":"Es sind zu viele Schützen in Wertung!"},{"$nulls":18},"Standaufsicht:","Horst Sabel"]
[]
[null,"Einzelergebnisse:","Verein/Gruppe (per Dropdown-Feld einzutragen)","Ergebnisse","AW? Dann x eintippen",null,"Verein 1",null,"Verein 2",null,"Verein 3",null,"Verein 4",null,"Verein 5",null,"Verein 6",{"$nulls":3},"Geburtsdatum",null,"Proberechnung bei Streifen:"]
[1,"Andre Hanenkamp",{"$f":"B2","v":"Börgerwald II"},306.5,null,{"$f":"IF(E10=\"x\",\"0\",D10)","v":306.5},{"$f":"IF(C10=$B$2,F10,0)","v":306.5},{"$f":"(IF(AND($E10=\"\",$C10=$B$2),1,0))","v":1},{"$f":"IF($C10=$B$3,F10,0)","v":0},{"$f":"(IF(AND($E10=\"\",$C10=$B$3),1,0))","v":0},{"$f":"IF($C10=$B$4,F10,0)","v":0},{"$f":"(IF(AND($E10=\"\",$C10=$B$4),1,0))","v":0},{"$f":"IF($C10=$B$5,F10,0)","v":0},{"$f":"(IF(AND($E10=\"\",$C10=$B$5),1,0))","v":0},{"$f":"IF($C10=$B$6,F10,0)","v":0},{"$f":"(IF(AND($E10=\"\",$C10=$B$6),1,0))","v":0},{"$f":"IF($C10=$B$7,F10,0)","v":0},{"$f":"(IF(AND($E10=\"\",$C10=$B$7),1,0))","v":0},{"$nulls":4},102.2,102.8,101.5,{"$f":"W10+X10+Y10","v":306.5},{"$f":"IF(Z10=D10,1,0)","v":1},{"$f":"IF(Z10=0,0,1)","v":1},{"$f":"IF(AA10+AB10=2,\"Korrekt\",\"\")","v":"Korrekt"}]
[2,"Horst Sabel",{"$f":"B2","v":"Börgerwald II"},311.8,null,{"$f":"IF(E11=\"x\",\"0\",D11)","v":311.8},{"$f":"IF(C11=$B$2,F11,0)","v":311.8},{"$f":"(IF(AND($E11=\"\",$C11=$B$2),1,0))","v":1},{"$f":"IF($C11=$B$3,F11,0)","v":0},{"$f":"(IF(AND($E11=\"\",$C11=$B$3),1,0))","v":0},{"$f":"IF($C11=$B$4,F11,0)","v":0},{"$f":"(IF(AND($E11=\"\",$C11=$B$4),1,0))","v":0},{"$f":"IF($C11=$B$5,F11,0)","v":0},{"$f":"(IF(AND($E11=\"\",$C11=$B$5),1,0))","v":0},{"$f":"IF($C11=$B$6,F11,0)","v":0},{"$f":"(IF(AND($E11=\"\",$C11=$B$6),1,0))","v":0},{"$f":"IF($C11=$B$7,F11,0)","v":0},{"$f":"(IF(AND($E11=\"\",$C11=$B$7),1,0))","v":0},{"$nulls":4},103.5,102.4,105.9,{"$f":"W11+X11+Y11","v":311.8},{"$f":"IF(Z11=D11,1,0)","v":1},{"$f":"IF(Z11=0,0,1)","v":1},{"$f":"IF(AA11+AB11=2,\"Korrekt\",\"\")","v":"Korrekt"}]
[3,"Christian Robben",{"$f":"B2","v":"Börgerwald II"},282.8,"x","0","0",0,0,0,0,0,0,0,0,0,0,0,{"$nulls":4},94.9,91.6,96.3,282.8,1,1,"Korrekt"]
[4,"Mathis Antons",{"$f":"B2","v":"Börgerwald II"},314.1,null,314.1,314.1,1,0,0,0,0,0,0,0,0,0,0,{"$nulls":4},103.9,106.2,{"v":104,"d":"104.0"},314.1,1,1,"Korrekt"]
[5,"Tobias Sebers",{"$f":"B2","v":"Börgerwald II"},null,"x","0","0",0,0,0,0,0,0,0,0,0,0,0,{"$nulls":4},{"v":0,"d":"0.0"},{"v":0,"d":"0.0"},{"v":0,"d":"0.0"},{"v":0,"d":"0.0"},1,0,""]
[6,"Friedhelm Schroer",{"$f":"B2","v":"Börgerwald II"},{"v":307,"d":"307.0"},null,307,307,1,0,0,0,0,0,0,0,0,0,0,{"$nulls":4},99.9,{"v":104,"d":"104.0"},103.1,{"v":307,"d":"307.0"},1,1,"Korrekt"]
[7,"Toni Stahl","Börgerwald II",296.7,"x","0","0",0,0,0,0,0,0,0,0,0,0,0,{"$nulls":4},96.7,100.1,99.9,{"v":296.70000000000005,"d":"296.7"},1,1,"Korrekt"]
[8,"Martin Hinrichs","Börgerwald II",270.5,"x","0","0",0,0,0,0,0,0,0,0,0,0,0,{"$nulls":4},90.4,90.6,89.5,270.5,1,1,"Korrekt"]
[9,"Dirk Thunert",{"$f":"B3","v":"Neuvrees II"},{"v":310,"d":"310.0"},null,310,0,0,310,1,0,0,0,0,0,0,0,0,{"$nulls":4},104.2,101.4,104.4,{"v":310,"d":"310.0"},1,1,"Korrekt"]
[10,"Hans Preuth",{"$f":"B3","v":"Neuvrees II"},307.6,"x","0",0,0,"0",0,0,0,0,0,0,0,0,0,{"$nulls":4},102.9,100.9,103.8,307.6,1,1,"Korrekt"]
[11,"Karl-Heinz Schrand",{"$f":"B3","v":"Neuvrees II"},307.5,null,307.5,0,0,307.5,1,0,0,0,0,0,0,0,0,{"$nulls":4},99.4,104.7,103.4,307.5,1,1,"Korrekt"]
[12,"Holger Szczepanski",{"$f":"B3","v":"Neuvrees II"},303.2,null,303.2,0,0,303.2,1,0,0,0,0,0,0,0,0,{"$nulls":4},{"v":101,"d":"101.0"},102.4,99.8,303.2,1,1,"Korrekt"]
[13,"Bernd Witting","Neuvrees II",{"v":315,"d":"315.0"},null,315,0,0,315,1,0,0,0,0,0,0,0,0,{"$nulls":4},103.8,105.4,105.8,{"v":315,"d":"315.0"},1,1,"Korrekt"]
[14,"Hermann Schwarte","Börger II",305.8,null,305.8,0,0,0,0,0,0,305.8,1,0,0,0,0,{"$nulls":4},103.8,100.9,101.1,{"v":305.79999999999995,"d":"305.8"},1,1,"Korrekt"]
[15,"Bernd Rode",{"$f":"B4","v":"Börger III"},304.2,null,304.2,0,0,0,0,304.2,1,0,0,0,0,0,0,{"$nulls":4},99.9,101.3,{"v":103,"d":"103.0"},304.2,1,1,"Korrekt"]
[16,"Daniel Sebers",{"$f":"B4","v":"Börger III"},303.3,null,303.3,0,0,0,0,303.3,1,0,0,0,0,0,0,{"$nulls":4},98.3,102.5,102.5,303.3,1,1,"Korrekt"]
[17,"Simon Schutenbrock",{"$f":"B4","v":"Börger III"},313.8,null,313.8,0,0,0,0,313.8,1,0,0,0,0,0,0,{"$nulls":4},{"v":105,"d":"105.0"},104.5,104.3,313.8,1,1,"Korrekt"]
[18,"Jürgen Schroer",{"$f":"B4","v":"Börger III"},307.2,"x","0",0,0,0,0,"0",0,0,0,0,0,0,0,{"$nulls":4},100.8,101.7,104.7,307.2,1,1,"Korrekt"]
[19,"Marc Eckmann",{"$f":"B5","v":"Börger II"},290.2,"x","0",0,0,0,0,0,0,"0",0,0,0,0,0,{"$nulls":4},101.1,97.9,91.2,290.2,1,1,"Korrekt"]
[20,"Markus Jungsthöfel",{"$f":"B5","v":"Börger II"},312.5,null,312.5,0,0,0,0,0,0,312.5,1,0,0,0,0,{"$nulls":4},{"v":103,"d":"103.0"},104.1,105.4,312.5,1,1,"Korrekt"]
[21,"Jens Henzen","Börger III",305.6,null,305.6,0,0,0,0,305.6,1,0,0,0,0,0,0,{"$nulls":4},101.5,100.3,103.8,305.6,1,1,"Korrekt"]
[22,"Uwe Goldenstein",{"$f":"B5","v":"Börger II"},304.5,null,304.5,0,0,0,0,0,0,304.5,1,0,0,0,0,{"$nulls":4},102.3,101.1,101.1,304.5,1,1,"Korrekt"]
[23,"Ingo Zdralik",{"$f":"B5","v":"Börger II"},316.1,null,316.1,0,0,0,0,0,0,316.1,1,0,0,0,0,{"$nulls":4},104.8,104.7,106.6,316.1,1,1,"Korrekt"]
[24,"Schütze 24",{"$f":"B5","v":"Börger II"},null,null,0,0,0,0,0,0,0,0,1,0,0,0,0,{"$nulls":7},{"v":0,"d":"0.0"},1,0,""]
[25,"Oliver Reinelt",{"$f":"B6","v":"Lahn IV"},302.3,null,302.3,0,0,0,0,0,0,0,0,302.3,1,0,0,{"$nulls":4},100.6,100.4,101.3,302.3,1,1,"Korrekt"]
[26,"Vitalij Schmidt",{"$f":"B6","v":"Lahn IV"},308.8,null,308.8,0,0,0,0,0,0,0,0,308.8,1,0,0,{"$nulls":4},103.9,{"v":101,"d":"101.0"},103.9,308.8,1,1,"Korrekt"]
[27,"Hermann Benten",{"$f":"B6","v":"Lahn IV"},307.6,null,307.6,0,0,0,0,0,0,0,0,307.6,1,0,0,{"$nulls":4},103.1,100.5,{"v":104,"d":"104.0"},307.6,1,1,"Korrekt"]
[28,"Johannes Thesing",{"$f":"B6","v":"Lahn IV"},313.1,null,313.1,0,0,0,0,0,0,0,0,313.1,1,0,0,{"$nulls":4},104.8,103.9,104.4,313.1,1,1,"Korrekt"]
[29,"Schütze 29",{"$f":"B6","v":"Lahn IV"},null,null,0,0,0,0,0,0,0,0,0,0,1,0,0,{"$nulls":7},{"v":0,"d":"0.0"},1,0,""]
[30,"Willi Rolfes","Neuvrees I",310.7,null,310.7,0,0,0,0,0,0,0,0,0,0,310.7,1,{"$nulls":4},104.2,102.3,104.2,310.7,1,1,"Korrekt"]
[31,"Werner Thyen",{"$f":"B7","v":"Neuvrees I"},311.2,null,311.2,0,0,0,0,0,0,0,0,0,0,311.2,1,{"$nulls":4},104.2,103.8,103.2,{"$f":"W40+X40+Y40","v":311.2},{"$f":"IF(Z40=D40,1,0)","v":1},{"$f":"IF(Z40=0,0,1)","v":1},{"$f":"IF(AA40+AB40=2,\"Korrekt\",\"\")","v":"Korrekt"}]
[32,"Wilfried Breyer",{"$f":"B7","v":"Neuvrees I"},311.3,null,311.3,0,0,0,0,0,0,0,0,0,0,311.3,1,{"$nulls":4},102.8,104.8,103.7,311.3,1,1,"Korrekt"]
[33,"Klaus Steenken",{"$f":"B7","v":"Neuvrees I"},308.9,"x","0",0,0,0,0,0,0,0,0,0,0,"0",0,{"$nulls":4},103.7,102.4,102.8,{"v":308.90000000000003,"d":"308.9"},1,1,"Korrekt"]
[34,"Markus Janßen",{"$f":"B7","v":"Neuvrees I"},{"v":310,"d":"310.0"},null,310,0,0,0,0,0,0,0,0,0,0,310,1,{"$nulls":4},103.6,103.6,102.8,{"v":310,"d":"310.0"},1,1,"Korrekt"]
[35,"Carsten Peters",{"$f":"B7","v":"Neuvrees I"},null,null,0,0,0,0,0,0,0,0,0,0,0,0,1,{"$nulls":7},{"v":0,"d":"0.0"},1,0,""]
[36,"Dietmar Spekker",{"$f":"B7","v":"Neuvrees I"},null,null,0,0,0,0,0,0,0,0,0,0,0,0,1,{"$nulls":7},{"$f":"W45+X45+Y45","v":{"v":0,"d":"0.0"}},{"$f":"IF(Z45=D45,1,0)","v":1},{"$f":"IF(Z45=0,0,1)","v":0},{"$f":"IF(AA45+AB45=2,\"Korrekt\",\"\")","v":""}]
[{"$nulls":6},{"$f":"LARGE(G10:G45,1)+LARGE(G10:G45,2)+LARGE(G10:G45,3)","v":932.9000000000001},{"$f":"SUM(H10:H45)","v":4},{"$f":"LARGE(I10:I45,1)+LARGE(I10:I45,2)+LARGE(I10:I45,3)","v":932.5},{"$f":"SUM(J10:J45)","v":4},{"$f":"LARGE(K10:K45,1)+LARGE(K10:K45,2)+LARGE(K10:K45,3)","v":923.6000000000001},{"$f":"SUM(L10:L45)","v":4},{"$f":"LARGE(M10:M45,1)+LARGE(M10:M45,2)+LARGE(M10:M45,3)","v":934.4000000000001},{"$f":"SUM(N10:N45)","v":5},{"$f":"LARGE(O10:O45,1)+LARGE(O10:O45,2)+LARGE(O10:O45,3)","v":929.5000000000001},{"$f":"SUM(P10:P45)","v":5},{"$f":"LARGE(Q10:Q45,1)+LARGE(Q10:Q45,2)+LARGE(Q10:Q45,3)","v":933.2},{"$f":"SUM(R10:S45)","v":6}]
[null,null,"per Email an: sk-huemmling@gmx.de"]

{"sheet":"2","index":2,"n_rows":47,"n_cols":27,"rows_kept":47,"merged":[[0,22,0,23],[1,22,1,23],[4,22,4,23],[5,22,5,23],[6,22,6,23],[8,20,8,23]]}
[null,"Verein / Gruppe",null,"Ergebnisse",{"$nulls":17},"Austragungsort:",{"$f":"Übersicht!E4","v":"Neuvrees"}]
[1,{"$f":"'Wettkampf 1'!B2","v":"Börgerwald II"},null,{"$f":"G46","v":935.1},{"$f":"IF(H46>4,\"Es sind zu viele Schützen in Wertung!\",\" \")","v":" "},{"$nulls":16},"Wettkampftag:",{"$f":"Übersicht!E3","v":"17.09."}]
[2,{"$f":"'Wettkampf 1'!B3","v":"Neuvrees II"},null,{"$f":"I46","v":{"v":931.4000000000001,"d":"931.4"}},{"$f":"IF(J46>4,\"Es sind zu viele Schützen in Wertung!\",\" \")","v":" "}]
[3,{"$f":"'Wettkampf 1'!B4","v":"Börger III"},null,{"$f":"K46","v":{"v":926.3000000000001,"d":"926.3"}},{"$f":"IF(L46>4,\"Es sind zu viele Schützen in Wertung!\",\" \")","v":" "},{"$nulls":18},"Ansprechpartner für Rückfragen:"]
[4,{"$f":"'Wettkampf 1'!B5","v":"Börger II"},null,{"$f":"M46","v":934.2},{"$f":"IF(N46>4,\"Es sind zu viele Schützen in Wertung!\",\" \")","v":" "},{"$nulls":16},"Name:","Dirk Thunert"]
[5,{"$f":"'Wettkampf 1'!B6","v":"Lahn IV"},null,{"$f":"O46","v":935.3},{"$f":"IF(P46>4,\"Es sind zu viele Schützen in Wertung!\",\" \")","v":" "},{"$nulls":16},"Tel:","04493-998686"]
[6,{"$f":"'Wettkampf 1'!B7","v":"Neuvrees I"},null,{"$f":"Q46","v":{"v":929.1000000000001,"d":"929.1"}},{"$f":"IF(R46>4,\"Es sind zu viele Schützen in Wertung!\",\" \")","v":" "},{"$nulls":16},"Standaufsicht:","Dirk Thunert"]
[]
[null,"Einzelergebnisse:","Verein / Gruppe","Ergebnisse (mindestens 0 eintragen)","AW? Dann x eintippen",null,"Verein 1",null,"Verein 2",null,"Verein 3",null,"Verein 4",null,"Verein 5",null,"Verein 6",{"$nulls":3},"Proberechnung bei Streifen:"]
[1,{"$f":"'Wettkampf 1'!B10","v":"Andre Hanenkamp"},{"$f":"'Wettkampf 1'!C10","v":"Börgerwald II"},311.8,null,{"$f":"IF(E10=\"x\",\"0\",D10)","v":311.8},{"$f":"IF(C10=$B$2,F10,0)","v":311.8},{"$f":"(IF(AND($E10=\"\",$C10=$B$2),1,0))","v":1},{"$f":"IF($C10=$B$3,F10,0)","v":0},{"$f":"(IF(AND($E10=\"\",$C10=$B$3),1,0))","v":0},{"$f":"IF($C10=$B$4,F10,0)","v":0},{"$f":"(IF(AND($E10=\"\",$C10=$B$4),1,0))","v":0},{"$f":"IF($C10=$B$5,F10,0)","v":0},{"$f":"(IF(AND($E10=\"\",$C10=$B$5),1,0))","v":0},{"$f":"IF($C10=$B$6,F10,0)","v":0},{"$f":"(IF(AND($E10=\"\",$C10=$B$6),1,0))","v":0},{"$f":"IF($C10=$B$7,F10,0)","v":0},{"$f":"(IF(AND($E10=\"\",$C10=$B$7),1,0))","v":0},null,null,103.6,{"v":104,"d":"104.0"},104.2,{"$f":"U10+V10+W10","v":311.8},{"$f":"IF(X10=D10,1,0)","v":1},{"$f":"IF(X10=0,0,1)","v":1},{"$f":"IF(Y10+Z10=2,\"Korrekt\",\"\")","v":"Korrekt"}]
[2,{"$f":"'Wettkampf 1'!B11","v":"Horst Sabel"},{"$f":"'Wettkampf 1'!C11","v":"Börgerwald II"},314.7,null,{"$f":"IF(E11=\"x\",\"0\",D11)","v":314.7},{"$f":"IF(C11=$B$2,F11,0)","v":314.7},{"$f":"(IF(AND($E11=\"\",$C11=$B$2),1,0))","v":1},{"$f":"IF($C11=$B$3,F11,0)","v":0},{"$f":"(IF(AND($E11=\"\",$C11=$B$3),1,0))","v":0},{"$f":"IF($C11=$B$4,F11,0)","v":0},{"$f":"(IF(AND($E11=\"\",$C11=$B$4),1,0))","v":0},{"$f":"IF($C11=$B$5,F11,0)","v":0},{"$f":"(IF(AND($E11=\"\",$C11=$B$5),1,0))","v":0},{"$f":"IF($C11=$B$6,F11,0)","v":0},{"$f":"(IF(AND($E11=\"\",$C11=$B$6),1,0))","v":0},{"$f":"IF($C11=$B$7,F11,0)","v":0},{"$f":"(IF(AND($E11=\"\",$C11=$B$7),1,0))","v":0},null,null,{"v":104,"d":"104.0"},105.1,105.6,{"$f":"U11+V11+W11","v":314.7},{"$f":"IF(X11=D11,1,0)","v":1},{"$f":"IF(X11=0,0,1)","v":1},{"$f":"IF(Y11+Z11=2,\"Korrekt\",\"\")","v":"Korrekt"}]
[3,{"$f":"'Wettkampf 1'!B12","v":"Christian Robben"},{"$f":"'Wettkampf 1'!C12","v":"Börgerwald II"},{"v":0,"d":"0.0"},"x","0","0",0,0,0,0,0,0,0,0,0,0,0,null,null,{"v":0,"d":"0.0"},{"v":0,"d":"0.0"},{"v":0,"d":"0.0"},{"v":0,"d":"0.0"},1,0,""]
[4,{"$f":"'Wettkampf 1'!B13","v":"Mathis Antons"},{"$f":"'Wettkampf 1'!C13","v":"Börgerwald II"},308.6,null,308.6,308.6,1,0,0,0,0,0,0,0,0,0,0,null,null,104.6,103.5,100.5,308.6,1,1,"Korrekt"]
[5,{"$f":"'Wettkampf 1'!B14","v":"Tobias Sebers"},{"$f":"'Wettkampf 1'!C14","v":"Börgerwald II"},300.8,"x","0","0",0,0,0,0,0,0,0,0,0,0,0,null,null,102.2,99.6,{"v":99,"d":"99.0"},300.8,1,1,"Korrekt"]
[6,{"$f":"'Wettkampf 1'!B15","v":"Friedhelm Schroer"},{"$f":"'Wettkampf 1'!C15","v":"Börgerwald II"},307.4,null,307.4,307.4,1,0,0,0,0,0,0,0,0,0,0,null,null,102.9,102.3,102.2,307.4,1,1,"Korrekt"]
[7,{"$f":"'Wettkampf 1'!B16","v":"Toni Stahl"},{"$f":"'Wettkampf 1'!C16","v":"Börgerwald II"},291.6,"x","0","0",0,0,0,0,0,0,0,0,0,0,0,null,null,95.1,95.3,101.2,{"v":291.59999999999997,"d":"291.6"},1,1,"Korrekt"]
[8,{"$f":"'Wettkampf 1'!B17","v":"Martin Hinrichs"},{"$f":"'Wettkampf 1'!C17","v":"Börgerwald II"},{"v":0,"d":"0.0"},"x","0","0",0,0,0,0,0,0,0,0,0,0,0,null,null,{"v":0,"d":"0.0"},{"v":0,"d":"0.0"},{"v":0,"d":"0.0"},{"v":0,"d":"0.0"},1,0,""]
[9,{"$f":"'Wettkampf 1'!B18","v":"Dirk Thunert"},{"$f":"'Wettkampf 1'!C18","v":"Neuvrees II"},310.9,null,310.9,0,0,310.9,1,0,0,0,0,0,0,0,0,null,null,103.8,102.6,104.5,310.9,1,1,"Korrekt"]
[10,{"$f":"'Wettkampf 1'!B19","v":"Hans Preuth"},{"$f":"'Wettkampf 1'!C19","v":"Neuvrees II"},308.1,null,308.1,0,0,308.1,1,0,0,0,0,0,0,0,0,null,null,102.6,102.3,103.2,{"v":308.09999999999997,"d":"308.1"},1,1,"Korrekt"]
[11,{"$f":"'Wettkampf 1'!B20","v":"Karl-Heinz Schrand"},{"$f":"'Wettkampf 1'!C20","v":"Neuvrees II"},308.7,null,308.7,0,0,308.7,1,0,0,0,0,0,0,0,0,null,null,104.3,100.3,104.1,308.7,1,1,"Korrekt"]
[12,{"$f":"'Wettkampf 1'!B21","v":"Holger Szczepanski"},{"$f":"'Wettkampf 1'!C21","v":"Neuvrees II"},311.6,"x","0",0,0,"0",0,0,0,0,0,0,0,0,0,null,null,104.4,102.6,104.6,311.6,1,1,"Korrekt"]
[13,{"$f":"'Wettkampf 1'!B22","v":"Bernd Witting"},{"$f":"'Wettkampf 1'!C22","v":"Neuvrees II"},311.8,null,311.8,0,0,311.8,1,0,0,0,0,0,0,0,0,null,null,101.9,104.8,105.1,{"v":311.79999999999995,"d":"311.8"},1,1,"Korrekt"]
[14,{"$f":"'Wettkampf 1'!B23","v":"Hermann Schwarte"},{"$f":"'Wettkampf 1'!C23","v":"Börger II"},310.7,null,310.7,0,0,0,0,0,0,310.7,1,0,0,0,0,null,null,105.3,103.2,102.2,310.7,1,1,"Korrekt"]
[15,{"$f":"'Wettkampf 1'!B24","v":"Bernd Rode"},{"$f":"'Wettkampf 1'!C24","v":"Börger III"},304.9,null,304.9,0,0,0,0,304.9,1,0,0,0,0,0,0,null,null,100.4,102.8,101.7,304.9,1,1,"Korrekt"]
[16,{"$f":"'Wettkampf 1'!B25","v":"Daniel Sebers"},{"$f":"'Wettkampf 1'!C25","v":"Börger III"},307.4,"x","0",0,0,0,0,"0",0,0,0,0,0,0,0,null,null,103.5,102.6,101.3,307.4,1,1,"Korrekt"]
[17,{"$f":"'Wettkampf 1'!B26","v":"Simon Schutenbrock"},{"$f":"'Wettkampf 1'!C26","v":"Börger III"},311.1,null,311.1,0,0,0,0,311.1,1,0,0,0,0,0,0,null,null,{"v":104,"d":"104.0"},101.9,105.2,311.1,1,1,"Korrekt"]
[18,{"$f":"'Wettkampf 1'!B27","v":"Jürgen Schroer"},{"$f":"'Wettkampf 1'!C27","v":"Börger III"},310.3,null,310.3,0,0,0,0,310.3,1,0,0,0,0,0,0,null,null,104.2,103.8,102.3,310.3,1,1,"Korrekt"]
[19,{"$f":"'Wettkampf 1'!B28","v":"Marc Eckmann"},{"$f":"'Wettkampf 1'!C28","v":"Börger II"},303.8,"x","0",0,0,0,0,0,0,"0",0,0,0,0,0,null,null,100.1,101.5,102.2,303.8,1,1,"Korrekt"]
[20,{"$f":"'Wettkampf 1'!B29","v":"Markus Jungsthöfel"},{"$f":"'Wettkampf 1'!C29","v":"Börger II"},307.3,null,307.3,0,0,0,0,0,0,307.3,1,0,0,0,0,null,null,100.4,103.7,103.2,307.3,1,1,"Korrekt"]
[21,{"$f":"'Wettkampf 1'!B30","v":"Jens Henzen"},{"$f":"'Wettkampf 1'!C30","v":"Börger III"},304.2,null,304.2,0,0,0,0,304.2,1,0,0,0,0,0,0,null,null,{"v":103,"d":"103.0"},100.9,100.3,304.2,1,1,"Korrekt"]
[22,{"$f":"'Wettkampf 1'!B31","v":"Uwe Goldenstein"},{"$f":"'Wettkampf 1'!C31","v":"Börger II"},{"v":304,"d":"304.0"},null,{"v":304,"d":"304.0"},0,0,0,0,0,0,304,1,0,0,0,0,null,null,102.1,100.5,101.4,{"v":304,"d":"304.0"},1,1,"Korrekt"]
[23,{"$f":"'Wettkampf 1'!B32","v":"Ingo Zdralik"},{"$f":"'Wettkampf 1'!C32","v":"Börger II"},316.2,null,316.2,0,0,0,0,0,0,316.2,1,0,0,0,0,null,null,104.8,106.6,104.8,316.2,1,1,"Korrekt"]
[24,{"$f":"'Wettkampf 1'!B33","v":"Schütze 24"},{"$f":"'Wettkampf 1'!C33","v":"Börger II"},null,"x","0",0,0,0,0,0,0,"0",0,0,0,0,0,{"$nulls":5},{"v":0,"d":"0.0"},1,0,""]
[25,{"$f":"'Wettkampf 1'!B34","v":"Oliver Reinelt"},{"$f":"'Wettkampf 1'!C34","v":"Lahn IV"},310.3,null,310.3,0,0,0,0,0,0,0,0,310.3,1,0,0,null,null,101.8,{"v":104,"d":"104.0"},104.5,310.3,1,1,"Korrekt"]
[26,{"$f":"'Wettkampf 1'!B35","v":"Vitalij Schmidt"},{"$f":"'Wettkampf 1'!C35","v":"Lahn IV"},307.8,null,307.8,0,0,0,0,0,0,0,0,307.8,1,0,0,null,null,103.4,102.7,101.7,307.8,1,1,"Korrekt"]
[27,{"$f":"'Wettkampf 1'!B36","v":"Hermann Benten"},{"$f":"'Wettkampf 1'!C36","v":"Lahn IV"},311.2,null,311.2,0,0,0,0,0,0,0,0,311.2,1,0,0,null,null,103.7,102.8,104.7,311.2,1,1,"Korrekt"]
[28,{"$f":"'Wettkampf 1'!B37","v":"Johannes Thesing"},{"$f":"'Wettkampf 1'!C37","v":"Lahn IV"},313.8,null,313.8,0,0,0,0,0,0,0,0,313.8,1,0,0,null,null,103.8,103.9,106.1,{"v":313.79999999999995,"d":"313.8"},1,1,"Korrekt"]
[29,{"$f":"'Wettkampf 1'!B38","v":"Schütze 29"},{"$f":"'Wettkampf 1'!C38","v":"Lahn IV"},null,"x","0",0,0,0,0,0,0,0,0,"0",0,0,0,{"$nulls":5},{"v":0,"d":"0.0"},1,0,""]
[30,{"$f":"'Wettkampf 1'!B39","v":"Willi Rolfes"},{"$f":"'Wettkampf 1'!C39","v":"Neuvrees I"},312.8,null,312.8,0,0,0,0,0,0,0,0,0,0,312.8,1,null,null,103.7,104.2,104.9,312.8,1,1,"Korrekt"]
[31,{"$f":"'Wettkampf 1'!B40","v":"Werner Thyen"},{"$f":"'Wettkampf 1'!C40","v":"Neuvrees I"},304.7,null,304.7,0,0,0,0,0,0,0,0,0,0,304.7,1,null,null,101.6,99.8,103.3,{"$f":"U40+V40+W40","v":304.7},{"$f":"IF(X40=D40,1,0)","v":1},{"$f":"IF(X40=0,0,1)","v":1},{"$f":"IF(Y40+Z40=2,\"Korrekt\",\"\")","v":"Korrekt"}]
[32,{"$f":"'Wettkampf 1'!B41","v":"Wilfried Breyer"},{"$f":"'Wettkampf 1'!C41","v":"Neuvrees I"},302.6,null,302.6,0,0,0,0,0,0,0,0,0,0,302.6,1,null,null,98.9,101.7,{"v":102,"d":"102.0"},302.6,1,1,"Korrekt"]
[33,{"$f":"'Wettkampf 1'!B42","v":"Klaus Steenken"},{"$f":"'Wettkampf 1'!C42","v":"Neuvrees I"},{"v":305,"d":"305.0"},"x","0",0,0,0,0,0,0,0,0,0,0,"0",0,null,null,101.9,100.5,102.6,{"v":305,"d":"305.0"},1,1,"Korrekt"]
[34,{"$f":"'Wettkampf 1'!B43","v":"Markus Janßen"},{"$f":"'Wettkampf 1'!C43","v":"Neuvrees I"},311.6,null,311.6,0,0,0,0,0,0,0,0,0,0,311.6,1,null,null,103.3,104.2,104.1,311.6,1,1,"Korrekt"]
[35,{"$f":"'Wettkampf 1'!B44","v":"Carsten Peters"},{"$f":"'Wettkampf 1'!C44","v":"Neuvrees I"},307.9,"x","0",0,0,0,0,0,0,0,0,0,0,"0",0,null,null,103.5,102.9,101.5,307.9,1,1,"Korrekt"]
[36,{"$f":"'Wettkampf 1'!B45","v":"Dietmar Spekker"},{"$f":"'Wettkampf 1'!C45","v":"Neuvrees I"},null,"x","0",0,0,0,0,0,0,0,0,0,0,"0",0,{"$nulls":5},{"$f":"U45+V45+W45","v":{"v":0,"d":"0.0"}},{"$f":"IF(X45=D45,1,0)","v":1},{"$f":"IF(X45=0,0,1)","v":0},{"$f":"IF(Y45+Z45=2,\"Korrekt\",\"\")","v":""}]
[{"$nulls":6},{"$f":"LARGE(G10:G45,1)+LARGE(G10:G45,2)+LARGE(G10:G45,3)","v":935.1},{"$f":"SUM(H10:H45)","v":4},{"$f":"LARGE(I10:I45,1)+LARGE(I10:I45,2)+LARGE(I10:I45,3)","v":931.4000000000001},{"$f":"SUM(J10:J45)","v":4},{"$f":"LARGE(K10:K45,1)+LARGE(K10:K45,2)+LARGE(K10:K45,3)","v":926.3000000000001},{"$f":"SUM(L10:L45)","v":4},{"$f":"LARGE(M10:M45,1)+LARGE(M10:M45,2)+LARGE(M10:M45,3)","v":934.2},{"$f":"SUM(N10:N45)","v":4},{"$f":"LARGE(O10:O45,1)+LARGE(O10:O45,2)+LARGE(O10:O45,3)","v":935.3},{"$f":"SUM(P10:P45)","v":4},{"$f":"LARGE(Q10:Q45,1)+LARGE(Q10:Q45,2)+LARGE(Q10:Q45,3)","v":929.1000000000001},{"$f":"SUM(R10:S45)","v":4}]
[null,null,"per Email an: sk-huemmling@gmx.de"]

{"sheet":"3","index":3,"n_rows":47,"n_cols":27,"rows_kept":47,"merged":[[0,22,0,23],[1,22,1,23],[4,22,4,23],[5,22,5,23],[6,22,6,23],[8,20,8,23]]}
[null,"Verein / Gruppe",null,"Ergebnisse",{"$nulls":17},"Austragungsort:",{"$f":"Übersicht!F4","v":"Börger"}]
[1,{"$f":"'Wettkampf 1'!B2","v":"Börgerwald II"},null,{"$f":"G46","v":931.1},{"$f":"IF(H46>4,\"Es sind zu viele Schützen in Wertung!\",\" \")","v":" "},{"$nulls":16},"Wettkampftag:",{"$f":"Übersicht!F3","v":"01.10."}]
[2,{"$f":"'Wettkampf 1'!B3","v":"Neuvrees II"},null,{"$f":"I46","v":{"v":938,"d":"938.0"}},{"$f":"IF(J46>4,\"Es sind zu viele Schützen in Wertung!\",\" \")","v":" "}]
[3,{"$f":"'Wettkampf 1'!B4","v":"Börger III"},null,{"$f":"K46","v":927.2},{"$f":"IF(L46>4,\"Es sind zu viele Schützen in Wertung!\",\" \")","v":" "},{"$nulls":18},"Ansprechpartner für Rückfragen:"]
[4,{"$f":"'Wettkampf 1'!B5","v":"Börger II"},null,{"$f":"M46","v":925.6},{"$f":"IF(N46>4,\"Es sind zu viele Schützen in Wertung!\",\" \")","v":" "},{"$nulls":16},"Name:","Simon Schuckenbrock"]
[5,{"$f":"'Wettkampf 1'!B6","v":"Lahn IV"},null,{"$f":"O46","v":{"v":933,"d":"933.0"}},{"$f":"IF(P46>4,\"Es sind zu viele Schützen in Wertung!\",\" \")","v":" "},{"$nulls":16},"Tel:","0174-9528559"]
[6,{"$f":"'Wettkampf 1'!B7","v":"Neuvrees I"},null,{"$f":"Q46","v":926.2},{"$f":"IF(R46>4,\"Es sind zu viele Schützen in Wertung!\",\" \")","v":" "},{"$nulls":16},"Standaufsicht:","Jens Henzen"]
[]
[null,"Einzelergebnisse:","Verein / Gruppe","Ergebnisse (mindestens 0 eintragen)","AW? Dann x eintippen",null,"Verein 1",null,"Verein 2",null,"Verein 3",null,"Verein 4",null,"Verein 5",null,"Verein 6",{"$nulls":3},"Proberechnung bei Streifen:"]
[1,{"$f":"'Wettkampf 1'!B10","v":"Andre Hanenkamp"},{"$f":"'Wettkampf 1'!C10","v":"Börgerwald II"},307.1,null,{"$f":"IF(E10=\"x\",\"0\",D10)","v":307.1},{"$f":"IF(C10=$B$2,F10,0)","v":307.1},{"$f":"(IF(AND($E10=\"\",$C10=$B$2),1,0))","v":1},{"$f":"IF($C10=$B$3,F10,0)","v":0},{"$f":"(IF(AND($E10=\"\",$C10=$B$3),1,0))","v":0},{"$f":"IF($C10=$B$4,F10,0)","v":0},{"$f":"(IF(AND($E10=\"\",$C10=$B$4),1,0))","v":0},{"$f":"IF($C10=$B$5,F10,0)","v":0},{"$f":"(IF(AND($E10=\"\",$C10=$B$5),1,0))","v":0},{"$f":"IF($C10=$B$6,F10,0)","v":0},{"$f":"(IF(AND($E10=\"\",$C10=$B$6),1,0))","v":0},{"$f":"IF($C10=$B$7,F10,0)","v":0},{"$f":"(IF(AND($E10=\"\",$C10=$B$7),1,0))","v":0},null,null,103.6,100.8,102.7,{"$f":"U10+V10+W10","v":{"v":307.09999999999997,"d":"307.1"}},{"$f":"IF(X10=D10,1,0)","v":1},{"$f":"IF(X10=0,0,1)","v":1},{"$f":"IF(Y10+Z10=2,\"Korrekt\",\"\")","v":"Korrekt"}]
[2,{"$f":"'Wettkampf 1'!B11","v":"Horst Sabel"},{"$f":"'Wettkampf 1'!C11","v":"Börgerwald II"},308.9,null,{"$f":"IF(E11=\"x\",\"0\",D11)","v":308.9},{"$f":"IF(C11=$B$2,F11,0)","v":308.9},{"$f":"(IF(AND($E11=\"\",$C11=$B$2),1,0))","v":1},{"$f":"IF($C11=$B$3,F11,0)","v":0},{"$f":"(IF(AND($E11=\"\",$C11=$B$3),1,0))","v":0},{"$f":"IF($C11=$B$4,F11,0)","v":0},{"$f":"(IF(AND($E11=\"\",$C11=$B$4),1,0))","v":0},{"$f":"IF($C11=$B$5,F11,0)","v":0},{"$f":"(IF(AND($E11=\"\",$C11=$B$5),1,0))","v":0},{"$f":"IF($C11=$B$6,F11,0)","v":0},{"$f":"(IF(AND($E11=\"\",$C11=$B$6),1,0))","v":0},{"$f":"IF($C11=$B$7,F11,0)","v":0},{"$f":"(IF(AND($E11=\"\",$C11=$B$7),1,0))","v":0},null,null,104.1,102.4,102.4,{"$f":"U11+V11+W11","v":308.9},{"$f":"IF(X11=D11,1,0)","v":1},{"$f":"IF(X11=0,0,1)","v":1},{"$f":"IF(Y11+Z11=2,\"Korrekt\",\"\")","v":"Korrekt"}]
[3,{"$f":"'Wettkampf 1'!B12","v":"Christian Robben"},{"$f":"'Wettkampf 1'!C12","v":"Börgerwald II"},{"v":0,"d":"0.0"},"x","0","0",0,0,0,0,0,0,0,0,0,0,0,{"$nulls":5},{"v":0,"d":"0.0"},1,0,""]
[4,{"$f":"'Wettkampf 1'!B13","v":"Mathis Antons"},{"$f":"'Wettkampf 1'!C13","v":"Börgerwald II"},310.9,null,310.9,310.9,1,0,0,0,0,0,0,0,0,0,0,null,null,103.7,103.5,103.7,310.9,1,1,"Korrekt"]
[5,{"$f":"'Wettkampf 1'!B14","v":"Tobias Sebers"},{"$f":"'Wettkampf 1'!C14","v":"Börgerwald II"},{"v":295,"d":"295.0"},"x","0","0",0,0,0,0,0,0,0,0,0,0,0,null,null,96.9,98.1,{"v":100,"d":"100.0"},{"v":295,"d":"295.0"},1,1,"Korrekt"]
[6,{"$f":"'Wettkampf 1'!B15","v":"Friedhelm Schroer"},{"$f":"'Wettkampf 1'!C15","v":"Börgerwald II"},311.3,null,311.3,311.3,1,0,0,0,0,0,0,0,0,0,0,null,null,104.1,103.2,{"v":104,"d":"104.0"},311.3,1,1,"Korrekt"]
[7,{"$f":"'Wettkampf 1'!B16","v":"Toni Stahl"},{"$f":"'Wettkampf 1'!C16","v":"Börgerwald II"},277.7,"x","0","0",0,0,0,0,0,0,0,0,0,0,0,null,null,95.7,89.2,92.8,277.7,1,1,"Korrekt"]
[8,{"$f":"'Wettkampf 1'!B17","v":"Martin Hinrichs"},{"$f":"'Wettkampf 1'!C17","v":"Börgerwald II"},{"v":0,"d":"0.0"},"x","0","0",0,0,0,0,0,0,0,0,0,0,0,{"$nulls":5},{"v":0,"d":"0.0"},1,0,""]
[9,{"$f":"'Wettkampf 1'!B18","v":"Dirk Thunert"},{"$f":"'Wettkampf 1'!C18","v":"Neuvrees II"},311.7,null,311.7,0,0,311.7,1,0,0,0,0,0,0,0,0,null,null,102.9,105.2,103.6,{"v":311.70000000000005,"d":"311.7"},1,1,"Korrekt"]
[10,{"$f":"'Wettkampf 1'!B19","v":"Hans Preuth"},{"$f":"'Wettkampf 1'!C19","v":"Neuvrees II"},{"v":0,"d":"0.0"},"x","0",0,0,"0",0,0,0,0,0,0,0,0,0,{"$nulls":5},{"v":0,"d":"0.0"},1,0,""]
[11,{"$f":"'Wettkampf 1'!B20","v":"Karl-Heinz Schrand"},{"$f":"'Wettkampf 1'!C20","v":"Neuvrees II"},312.5,null,312.5,0,0,312.5,1,0,0,0,0,0,0,0,0,null,null,104.3,104.4,103.8,312.5,1,1,"Korrekt"]
[12,{"$f":"'Wettkampf 1'!B21","v":"Holger Szczepanski"},{"$f":"'Wettkampf 1'!C21","v":"Neuvrees II"},305.9,null,305.9,0,0,305.9,1,0,0,0,0,0,0,0,0,null,null,100.9,103.5,101.5,305.9,1,1,"Korrekt"]
[13,{"$f":"'Wettkampf 1'!B22","v":"Bernd Witting"},{"$f":"'Wettkampf 1'!C22","v":"Neuvrees II"},313.8,null,313.8,0,0,313.8,1,0,0,0,0,0,0,0,0,null,null,104.9,{"v":105,"d":"105.0"},103.9,313.8,1,1,"Korrekt"]
[14,{"$f":"'Wettkampf 1'!B23","v":"Hermann Schwarte"},{"$f":"'Wettkampf 1'!C23","v":"Börger II"},304.4,null,304.4,0,0,0,0,0,0,304.4,1,0,0,0,0,null,null,98.5,104.5,101.4,304.4,1,1,"Korrekt"]
[15,{"$f":"'Wettkampf 1'!B24","v":"Bernd Rode"},{"$f":"'Wettkampf 1'!C24","v":"Börger III"},{"v":308,"d":"308.0"},null,{"v":308,"d":"308.0"},0,0,0,0,308,1,0,0,0,0,0,0,null,null,102.4,102.4,103.2,{"v":308,"d":"308.0"},1,1,"Korrekt"]
[16,{"$f":"'Wettkampf 1'!B25","v":"Daniel Sebers"},{"$f":"'Wettkampf 1'!C25","v":"Börger III"},309.5,null,309.5,0,0,0,0,309.5,1,0,0,0,0,0,0,null,null,103.2,101.8,104.5,309.5,1,1,"Korrekt"]
[17,{"$f":"'Wettkampf 1'!B26","v":"Simon Schutenbrock"},{"$f":"'Wettkampf 1'!C26","v":"Börger III"},307.6,null,307.6,0,0,0,0,307.6,1,0,0,0,0,0,0,null,null,{"v":103,"d":"103.0"},100.6,{"v":104,"d":"104.0"},307.6,1,1,"Korrekt"]
[18,{"$f":"'Wettkampf 1'!B27","v":"Jürgen Schroer"},{"$f":"'Wettkampf 1'!C27","v":"Börger III"},307.6,"x","0",0,0,0,0,"0",0,0,0,0,0,0,0,null,null,102.6,102.6,102.4,307.6,1,1,"Korrekt"]
[19,{"$f":"'Wettkampf 1'!B28","v":"Marc Eckmann"},{"$f":"'Wettkampf 1'!C28","v":"Börger II"},{"v":0,"d":"0.0"},"x","0",0,0,0,0,0,0,"0",0,0,0,0,0,{"$nulls":5},{"v":0,"d":"0.0"},1,0,""]
[20,{"$f":"'Wettkampf 1'!B29","v":"Markus Jungsthöfel"},{"$f":"'Wettkampf 1'!C29","v":"Börger II"},308.1,null,308.1,0,0,0,0,0,0,308.1,1,0,0,0,0,null,null,102.1,102.2,103.8,308.1,1,1,"Korrekt"]
[21,{"$f":"'Wettkampf 1'!B30","v":"Jens Henzen"},{"$f":"'Wettkampf 1'!C30","v":"Börger III"},309.7,null,309.7,0,0,0,0,309.7,1,0,0,0,0,0,0,null,null,103.7,{"v":104,"d":"104.0"},{"v":102,"d":"102.0"},309.7,1,1,"Korrekt"]
[22,{"$f":"'Wettkampf 1'!B31","v":"Uwe Goldenstein"},{"$f":"'Wettkampf 1'!C31","v":"Börger II"},304.6,null,304.6,0,0,0,0,0,0,304.6,1,0,0,0,0,null,null,{"v":100,"d":"100.0"},102.8,101.8,304.6,1,1,"Korrekt"]
[23,{"$f":"'Wettkampf 1'!B32","v":"Ingo Zdralik"},{"$f":"'Wettkampf 1'!C32","v":"Börger II"},312.9,null,312.9,0,0,0,0,0,0,312.9,1,0,0,0,0,null,null,104.4,104.2,104.3,{"v":312.90000000000003,"d":"312.9"},1,1,"Korrekt"]
[24,{"$f":"'Wettkampf 1'!B33","v":"Schütze 24"},{"$f":"'Wettkampf 1'!C33","v":"Börger II"},{"v":0,"d":"0.0"},"x","0",0,0,0,0,0,0,"0",0,0,0,0,0,{"$nulls":5},{"v":0,"d":"0.0"},1,0,""]
[25,{"$f":"'Wettkampf 1'!B34","v":"Oliver Reinelt"},{"$f":"'Wettkampf 1'!C34","v":"Lahn IV"},307.2,null,307.2,0,0,0,0,0,0,0,0,307.2,1,0,0,null,null,101.7,102.7,102.8,307.2,1,1,"Korrekt"]
[26,{"$f":"'Wettkampf 1'!B35","v":"Vitalij Schmidt"},{"$f":"'Wettkampf 1'!C35","v":"Lahn IV"},310.4,null,310.4,0,0,0,0,0,0,0,0,310.4,1,0,0,null,null,104.3,102.8,103.3,310.4,1,1,"Korrekt"]
[27,{"$f":"'Wettkampf 1'!B36","v":"Hermann Benten"},{"$f":"'Wettkampf 1'!C36","v":"Lahn IV"},310.1,null,310.1,0,0,0,0,0,0,0,0,310.1,1,0,0,null,null,102.5,104.1,103.5,310.1,1,1,"Korrekt"]
[28,{"$f":"'Wettkampf 1'!B37","v":"Johannes Thesing"},{"$f":"'Wettkampf 1'!C37","v":"Lahn IV"},312.5,null,312.5,0,0,0,0,0,0,0,0,312.5,1,0,0,null,null,103.3,105.3,103.9,312.5,1,1,"Korrekt"]
[29,{"$f":"'Wettkampf 1'!B38","v":"Schütze 29"},{"$f":"'Wettkampf 1'!C38","v":"Lahn IV"},{"v":0,"d":"0.0"},"x","0",0,0,0,0,0,0,0,0,"0",0,0,0,{"$nulls":5},{"v":0,"d":"0.0"},1,0,""]
[30,{"$f":"'Wettkampf 1'!B39","v":"Willi Rolfes"},{"$f":"'Wettkampf 1'!C39","v":"Neuvrees I"},308.5,null,308.5,0,0,0,0,0,0,0,0,0,0,308.5,1,null,null,103.4,102.8,102.3,308.5,1,1,"Korrekt"]
[31,{"$f":"'Wettkampf 1'!B40","v":"Werner Thyen"},{"$f":"'Wettkampf 1'!C40","v":"Neuvrees I"},309.1,null,309.1,0,0,0,0,0,0,0,0,0,0,309.1,1,null,null,102.6,103.2,103.3,309.1,1,1,"Korrekt"]
[32,{"$f":"'Wettkampf 1'!B41","v":"Wilfried Breyer"},{"$f":"'Wettkampf 1'!C41","v":"Neuvrees I"},308.6,null,308.6,0,0,0,0,0,0,0,0,0,0,308.6,1,null,null,{"v":103,"d":"103.0"},102.6,{"v":103,"d":"103.0"},308.6,1,1,"Korrekt"]
[33,{"$f":"'Wettkampf 1'!B42","v":"Klaus Steenken"},{"$f":"'Wettkampf 1'!C42","v":"Neuvrees I"},308.3,null,308.3,0,0,0,0,0,0,0,0,0,0,308.3,1,null,null,102.3,103.5,102.5,308.3,1,1,"Korrekt"]
[34,{"$f":"'Wettkampf 1'!B43","v":"Markus Janßen"},{"$f":"'Wettkampf 1'!C43","v":"Neuvrees I"},{"v":308,"d":"308.0"},"x","0",0,0,0,0,0,0,0,0,0,0,"0",0,null,null,102.8,102.5,102.7,{"v":308,"d":"308.0"},1,1,"Korrekt"]
[35,{"$f":"'Wettkampf 1'!B44","v":"Carsten Peters"},{"$f":"'Wettkampf 1'!C44","v":"Neuvrees I"},{"v":0,"d":"0.0"},"x","0",0,0,0,0,0,0,0,0,0,0,"0",0,{"$nulls":5},{"v":0,"d":"0.0"},1,0,""]
[36,{"$f":"'Wettkampf 1'!B45","v":"Dietmar Spekker"},{"$f":"'Wettkampf 1'!C45","v":"Neuvrees I"},293.4,"x","0",0,0,0,0,0,0,0,0,0,0,"0",0,null,null,99.9,98.7,94.8,{"v":293.40000000000003,"d":"293.4"},1,1,"Korrekt"]
[{"$nulls":6},{"$f":"LARGE(G10:G45,1)+LARGE(G10:G45,2)+LARGE(G10:G45,3)","v":931.1},{"$f":"SUM(H10:H45)","v":4},{"$f":"LARGE(I10:I45,1)+LARGE(I10:I45,2)+LARGE(I10:I45,3)","v":938},{"$f":"SUM(J10:J45)","v":4},{"$f":"LARGE(K10:K45,1)+LARGE(K10:K45,2)+LARGE(K10:K45,3)","v":927.2},{"$f":"SUM(L10:L45)","v":4},{"$f":"LARGE(M10:M45,1)+LARGE(M10:M45,2)+LARGE(M10:M45,3)","v":925.6},{"$f":"SUM(N10:N45)","v":4},{"$f":"LARGE(O10:O45,1)+LARGE(O10:O45,2)+LARGE(O10:O45,3)","v":933},{"$f":"SUM(P10:P45)","v":4},{"$f":"LARGE(Q10:Q45,1)+LARGE(Q10:Q45,2)+LARGE(Q10:Q45,3)","v":926.2},{"$f":"SUM(R10:S45)","v":4}]
[null,null,"per Email an: sk-huemmling@gmx.de"]

{"sheet":"4","index":4,"n_rows":47,"n_cols":27,"rows_kept":47,"merged":[[0,22,0,23],[1,22,1,23],[4,22,4,23],[5,22,5,23],[6,22,6,23],[8,20,8,23]]}
[null,"Verein / Gruppe",null,"Ergebnisse",{"$nulls":17},"Austragungsort:",{"$f":"Übersicht!G4","v":"Börger"}]
[1,{"$f":"'Wettkampf 1'!B2","v":"Börgerwald II"},null,{"$f":"G46","v":936.7},{"$f":"IF(H46>4,\"Es sind zu viele Schützen in Wertung!\",\" \")","v":"Es sind zu viele Schützen in Wertung!"},{"$nulls":16},"Wettkampftag:",{"$f":"Übersicht!G3","v":"15.10."}]
[2,{"$f":"'Wettkampf 1'!B3","v":"Neuvrees II"},null,{"$f":"I46","v":931.6},{"$f":"IF(J46>4,\"Es sind zu viele Schützen in Wertung!\",\" \")","v":"Es sind zu viele Schützen in Wertung!"}]
[3,{"$f":"'Wettkampf 1'!B4","v":"Börger III"},null,{"$f":"K46","v":934.7},{"$f":"IF(L46>4,\"Es sind zu viele Schützen in Wertung!\",\" \")","v":" "},{"$nulls":18},"Ansprechpartner für Rückfragen:"]
[4,{"$f":"'Wettkampf 1'!B5","v":"Börger II"},null,{"$f":"M46","v":{"v":934,"d":"934.0"}},{"$f":"IF(N46>4,\"Es sind zu viele Schützen in Wertung!\",\" \")","v":"Es sind zu viele Schützen in Wertung!"},{"$nulls":16},"Name:","Zdralik"]
[5,{"$f":"'Wettkampf 1'!B6","v":"Lahn IV"},null,{"$f":"O46","v":940.1},{"$f":"IF(P46>4,\"Es sind zu viele Schützen in Wertung!\",\" \")","v":"Es sind zu viele Schützen in Wertung!"},{"$nulls":16},"Tel:","01713283862"]
[6,{"$f":"'Wettkampf 1'!B7","v":"Neuvrees I"},null,{"$f":"Q46","v":{"v":931.6999999999999,"d":"931.7"}},{"$f":"IF(R46>4,\"Es sind zu viele Schützen in Wertung!\",\" \")","v":" "},{"$nulls":16},"Standaufsicht:","Zdralik"]
[]
[null,"Einzelergebnisse:","Verein / Gruppe","Ergebnisse (mindestens 0 eintragen)","AW? Dann x eintippen",null,"Verein 1",null,"Verein 2",null,"Verein 3",null,"Verein 4",null,"Verein 5",null,"Verein 6",{"$nulls":3},"Proberechnung bei Streifen:"]
[1,{"$f":"'Wettkampf 1'!B10","v":"Andre Hanenkamp"},{"$f":"'Wettkampf 1'!C10","v":"Börgerwald II"},311.4,null,{"$f":"IF(E10=\"x\",\"0\",D10)","v":311.4},{"$f":"IF(C10=$B$2,F10,0)","v":311.4},{"$f":"(IF(AND($E10=\"\",$C10=$B$2),1,0))","v":1},{"$f":"IF($C10=$B$3,F10,0)","v":0},{"$f":"(IF(AND($E10=\"\",$C10=$B$3),1,0))","v":0},{"$f":"IF($C10=$B$4,F10,0)","v":0},{"$f":"(IF(AND($E10=\"\",$C10=$B$4),1,0))","v":0},{"$f":"IF($C10=$B$5,F10,0)","v":0},{"$f":"(IF(AND($E10=\"\",$C10=$B$5),1,0))","v":0},{"$f":"IF($C10=$B$6,F10,0)","v":0},{"$f":"(IF(AND($E10=\"\",$C10=$B$6),1,0))","v":0},{"$f":"IF($C10=$B$7,F10,0)","v":0},{"$f":"(IF(AND($E10=\"\",$C10=$B$7),1,0))","v":0},{"$nulls":5},{"$f":"U10+V10+W10","v":{"v":0,"d":"0.0"}},{"$f":"IF(X10=D10,1,0)","v":0},{"$f":"IF(X10=0,0,1)","v":0},{"$f":"IF(Y10+Z10=2,\"Korrekt\",\"\")","v":""}]
[2,{"$f":"'Wettkampf 1'!B11","v":"Horst Sabel"},{"$f":"'Wettkampf 1'!C11","v":"Börgerwald II"},{"v":309,"d":"309.0"},null,{"$f":"IF(E11=\"x\",\"0\",D11)","v":{"v":309,"d":"309.0"}},{"$f":"IF(C11=$B$2,F11,0)","v":309},{"$f":"(IF(AND($E11=\"\",$C11=$B$2),1,0))","v":1},{"$f":"IF($C11=$B$3,F11,0)","v":0},{"$f":"(IF(AND($E11=\"\",$C11=$B$3),1,0))","v":0},{"$f":"IF($C11=$B$4,F11,0)","v":0},{"$f":"(IF(AND($E11=\"\",$C11=$B$4),1,0))","v":0},{"$f":"IF($C11=$B$5,F11,0)","v":0},{"$f":"(IF(AND($E11=\"\",$C11=$B$5),1,0))","v":0},{"$f":"IF($C11=$B$6,F11,0)","v":0},{"$f":"(IF(AND($E11=\"\",$C11=$B$6),1,0))","v":0},{"$f":"IF($C11=$B$7,F11,0)","v":0},{"$f":"(IF(AND($E11=\"\",$C11=$B$7),1,0))","v":0},{"$nulls":5},{"$f":"U11+V11+W11","v":{"v":0,"d":"0.0"}},{"$f":"IF(X11=D11,1,0)","v":0},{"$f":"IF(X11=0,0,1)","v":0},{"$f":"IF(Y11+Z11=2,\"Korrekt\",\"\")","v":""}]
[3,{"$f":"'Wettkampf 1'!B12","v":"Christian Robben"},{"$f":"'Wettkampf 1'!C12","v":"Börgerwald II"},296.8,"x","0","0",0,0,0,0,0,0,0,0,0,0,0,{"$nulls":5},{"v":0,"d":"0.0"},0,0,""]
[4,{"$f":"'Wettkampf 1'!B13","v":"Mathis Antons"},{"$f":"'Wettkampf 1'!C13","v":"Börgerwald II"},314.6,null,314.6,314.6,1,0,0,0,0,0,0,0,0,0,0,{"$nulls":5},{"v":0,"d":"0.0"},0,0,""]
[5,{"$f":"'Wettkampf 1'!B14","v":"Tobias Sebers"},{"$f":"'Wettkampf 1'!C14","v":"Börgerwald II"},null,null,{"v":0,"d":"0.0"},0,1,0,0,0,0,0,0,0,0,0,0,{"$nulls":5},{"v":0,"d":"0.0"},1,0,""]
[6,{"$f":"'Wettkampf 1'!B15","v":"Friedhelm Schroer"},{"$f":"'Wettkampf 1'!C15","v":"Börgerwald II"},310.7,null,310.7,310.7,1,0,0,0,0,0,0,0,0,0,0,{"$nulls":5},{"v":0,"d":"0.0"},0,0,""]
[7,{"$f":"'Wettkampf 1'!B16","v":"Toni Stahl"},{"$f":"'Wettkampf 1'!C16","v":"Börgerwald II"},295.9,"x","0","0",0,0,0,0,0,0,0,0,0,0,0,{"$nulls":5},{"v":0,"d":"0.0"},0,0,""]
[8,{"$f":"'Wettkampf 1'!B17","v":"Martin Hinrichs"},{"$f":"'Wettkampf 1'!C17","v":"Börgerwald II"},null,"x","0","0",0,0,0,0,0,0,0,0,0,0,0,{"$nulls":5},{"v":0,"d":"0.0"},1,0,""]
[9,{"$f":"'Wettkampf 1'!B18","v":"Dirk Thunert"},{"$f":"'Wettkampf 1'!C18","v":"Neuvrees II"},310.9,null,310.9,0,0,310.9,1,0,0,0,0,0,0,0,0,{"$nulls":5},{"v":0,"d":"0.0"},0,0,""]
[10,{"$f":"'Wettkampf 1'!B19","v":"Hans Preuth"},{"$f":"'Wettkampf 1'!C19","v":"Neuvrees II"},null,null,{"v":0,"d":"0.0"},0,0,0,1,0,0,0,0,0,0,0,0,{"$nulls":5},{"v":0,"d":"0.0"},1,0,""]
[11,{"$f":"'Wettkampf 1'!B20","v":"Karl-Heinz Schrand"},{"$f":"'Wettkampf 1'!C20","v":"Neuvrees II"},311.1,null,311.1,0,0,311.1,1,0,0,0,0,0,0,0,0,{"$nulls":5},{"v":0,"d":"0.0"},0,0,""]
[12,{"$f":"'Wettkampf 1'!B21","v":"Holger Szczepanski"},{"$f":"'Wettkampf 1'!C21","v":"Neuvrees II"},309.2,null,309.2,0,0,309.2,1,0,0,0,0,0,0,0,0,{"$nulls":5},{"v":0,"d":"0.0"},0,0,""]
[13,{"$f":"'Wettkampf 1'!B22","v":"Bernd Witting"},{"$f":"'Wettkampf 1'!C22","v":"Neuvrees II"},309.6,null,309.6,0,0,309.6,1,0,0,0,0,0,0,0,0,{"$nulls":5},{"v":0,"d":"0.0"},0,0,""]
[14,{"$f":"'Wettkampf 1'!B23","v":"Hermann Schwarte"},{"$f":"'Wettkampf 1'!C23","v":"Börger II"},310.7,null,310.7,0,0,0,0,0,0,310.7,1,0,0,0,0,{"$nulls":5},{"v":0,"d":"0.0"},0,0,""]
[15,{"$f":"'Wettkampf 1'!B24","v":"Bernd Rode"},{"$f":"'Wettkampf 1'!C24","v":"Börger III"},308.2,"x","0",0,0,0,0,"0",0,0,0,0,0,0,0,{"$nulls":5},{"v":0,"d":"0.0"},0,0,""]
[16,{"$f":"'Wettkampf 1'!B25","v":"Daniel Sebers"},{"$f":"'Wettkampf 1'!C25","v":"Börger III"},{"v":312,"d":"312.0"},null,{"v":312,"d":"312.0"},0,0,0,0,312,1,0,0,0,0,0,0,{"$nulls":5},{"v":0,"d":"0.0"},0,0,""]
[17,{"$f":"'Wettkampf 1'!B26","v":"Simon Schutenbrock"},{"$f":"'Wettkampf 1'!C26","v":"Börger III"},314.4,null,314.4,0,0,0,0,314.4,1,0,0,0,0,0,0,{"$nulls":5},{"v":0,"d":"0.0"},0,0,""]
[18,{"$f":"'Wettkampf 1'!B27","v":"Jürgen Schroer"},{"$f":"'Wettkampf 1'!C27","v":"Börger III"},307.1,null,307.1,0,0,0,0,307.1,1,0,0,0,0,0,0,{"$nulls":5},{"v":0,"d":"0.0"},0,0,""]
[19,{"$f":"'Wettkampf 1'!B28","v":"Marc Eckmann"},{"$f":"'Wettkampf 1'!C28","v":"Börger II"},304.4,"x","0",0,0,0,0,0,0,"0",0,0,0,0,0,{"$nulls":5},{"v":0,"d":"0.0"},0,0,""]
[20,{"$f":"'Wettkampf 1'!B29","v":"Markus Jungsthöfel"},{"$f":"'Wettkampf 1'!C29","v":"Börger II"},306.7,null,306.7,0,0,0,0,0,0,306.7,1,0,0,0,0,{"$nulls":5},{"v":0,"d":"0.0"},0,0,""]
[21,{"$f":"'Wettkampf 1'!B30","v":"Jens Henzen"},{"$f":"'Wettkampf 1'!C30","v":"Börger III"},308.3,null,308.3,0,0,0,0,308.3,1,0,0,0,0,0,0,{"$nulls":5},{"v":0,"d":"0.0"},0,0,""]
[22,{"$f":"'Wettkampf 1'!B31","v":"Uwe Goldenstein"},{"$f":"'Wettkampf 1'!C31","v":"Börger II"},302.8,null,302.8,0,0,0,0,0,0,302.8,1,0,0,0,0,{"$nulls":5},{"v":0,"d":"0.0"},0,0,""]
[23,{"$f":"'Wettkampf 1'!B32","v":"Ingo Zdralik"},{"$f":"'Wettkampf 1'!C32","v":"Börger II"},316.6,null,316.6,0,0,0,0,0,0,316.6,1,0,0,0,0,{"$nulls":5},{"v":0,"d":"0.0"},0,0,""]
[24,{"$f":"'Wettkampf 1'!B33","v":"Schütze 24"},{"$f":"'Wettkampf 1'!C33","v":"Börger II"},null,null,{"v":0,"d":"0.0"},0,0,0,0,0,0,0,1,0,0,0,0,{"$nulls":5},{"v":0,"d":"0.0"},1,0,""]
[25,{"$f":"'Wettkampf 1'!B34","v":"Oliver Reinelt"},{"$f":"'Wettkampf 1'!C34","v":"Lahn IV"},305.2,null,305.2,0,0,0,0,0,0,0,0,305.2,1,0,0,{"$nulls":5},{"v":0,"d":"0.0"},0,0,""]
[26,{"$f":"'Wettkampf 1'!B35","v":"Vitalij Schmidt"},{"$f":"'Wettkampf 1'!C35","v":"Lahn IV"},314.5,null,314.5,0,0,0,0,0,0,0,0,314.5,1,0,0,{"$nulls":5},{"v":0,"d":"0.0"},0,0,""]
[27,{"$f":"'Wettkampf 1'!B36","v":"Hermann Benten"},{"$f":"'Wettkampf 1'!C36","v":"Lahn IV"},309.4,null,309.4,0,0,0,0,0,0,0,0,309.4,1,0,0,{"$nulls":5},{"v":0,"d":"0.0"},0,0,""]
[28,{"$f":"'Wettkampf 1'!B37","v":"Johannes Thesing"},{"$f":"'Wettkampf 1'!C37","v":"Lahn IV"},316.2,null,316.2,0,0,0,0,0,0,0,0,316.2,1,0,0,{"$nulls":5},{"v":0,"d":"0.0"},0,0,""]
[29,{"$f":"'Wettkampf 1'!B38","v":"Schütze 29"},{"$f":"'Wettkampf 1'!C38","v":"Lahn IV"},null,null,{"v":0,"d":"0.0"},0,0,0,0,0,0,0,0,0,1,0,0,{"$nulls":5},{"v":0,"d":"0.0"},1,0,""]
[30,{"$f":"'Wettkampf 1'!B39","v":"Willi Rolfes"},{"$f":"'Wettkampf 1'!C39","v":"Neuvrees I"},311.1,null,311.1,0,0,0,0,0,0,0,0,0,0,311.1,1,{"$nulls":5},{"v":0,"d":"0.0"},0,0,""]
[31,{"$f":"'Wettkampf 1'!B40","v":"Werner Thyen"},{"$f":"'Wettkampf 1'!C40","v":"Neuvrees I"},302.1,"x","0",0,0,0,0,0,0,0,0,0,0,"0",0,{"$nulls":5},{"v":0,"d":"0.0"},0,0,""]
[32,{"$f":"'Wettkampf 1'!B41","v":"Wilfried Breyer"},{"$f":"'Wettkampf 1'!C41","v":"Neuvrees I"},310.7,null,310.7,0,0,0,0,0,0,0,0,0,0,310.7,1,{"$nulls":5},{"v":0,"d":"0.0"},0,0,""]
[33,{"$f":"'Wettkampf 1'!B42","v":"Klaus Steenken"},{"$f":"'Wettkampf 1'!C42","v":"Neuvrees I"},309.2,"x","0",0,0,0,0,0,0,0,0,0,0,"0",0,{"$nulls":5},{"v":0,"d":"0.0"},0,0,""]
[34,{"$f":"'Wettkampf 1'!B43","v":"Markus Janßen"},{"$f":"'Wettkampf 1'!C43","v":"Neuvrees I"},309.9,null,309.9,0,0,0,0,0,0,0,0,0,0,309.9,1,{"$nulls":5},{"v":0,"d":"0.0"},0,0,""]
[35,{"$f":"'Wettkampf 1'!B44","v":"Carsten Peters"},{"$f":"'Wettkampf 1'!C44","v":"Neuvrees I"},308.3,null,308.3,0,0,0,0,0,0,0,0,0,0,308.3,1,{"$nulls":5},{"v":0,"d":"0.0"},0,0,""]
[36,{"$f":"'Wettkampf 1'!B45","v":"Dietmar Spekker"},{"$f":"'Wettkampf 1'!C45","v":"Neuvrees I"},300.4,"x","0",0,0,0,0,0,0,0,0,0,0,"0",0,{"$nulls":5},{"v":0,"d":"0.0"},0,0,""]
[{"$nulls":6},{"$f":"LARGE(G10:G45,1)+LARGE(G10:G45,2)+LARGE(G10:G45,3)","v":936.7},{"$f":"SUM(H10:H45)","v":5},{"$f":"LARGE(I10:I45,1)+LARGE(I10:I45,2)+LARGE(I10:I45,3)","v":931.6},{"$f":"SUM(J10:J45)","v":5},{"$f":"LARGE(K10:K45,1)+LARGE(K10:K45,2)+LARGE(K10:K45,3)","v":934.7},{"$f":"SUM(L10:L45)","v":4},{"$f":"LARGE(M10:M45,1)+LARGE(M10:M45,2)+LARGE(M10:M45,3)","v":934},{"$f":"SUM(N10:N45)","v":5},{"$f":"LARGE(O10:O45,1)+LARGE(O10:O45,2)+LARGE(O10:O45,3)","v":940.1},{"$f":"SUM(P10:P45)","v":5},{"$f":"LARGE(Q10:Q45,1)+LARGE(Q10:Q45,2)+LARGE(Q10:Q45,3)","v":931.6999999999999},{"$f":"SUM(R10:S45)","v":4}]
[null,null,"per Email an: sk-huemmling@gmx.de"]

{"sheet":"5","index":5,"n_rows":47,"n_cols":27,"rows_kept":47,"merged":[[0,22,0,23],[1,22,1,23],[4,22,4,23],[5,22,5,23],[6,22,6,23],[8,20,8,23]]}
[null,"Verein / Gruppe",null,"Ergebnisse",{"$nulls":17},"Austragungsort:",{"$f":"Übersicht!H4","v":"Lahn"}]
[1,{"$f":"'Wettkampf 1'!B2","v":"Börgerwald II"},null,{"$f":"G46","v":935.1},{"$f":"IF(H46>4,\"Es sind zu viele Schützen in Wertung!\",\" \")","v":" "},{"$nulls":16},"Wettkampftag:",{"$f":"Übersicht!H3","v":"29.10."}]
[2,{"$f":"'Wettkampf 1'!B3","v":"Neuvrees II"},null,{"$f":"I46","v":{"v":935.9000000000001,"d":"935.9"}},{"$f":"IF(J46>4,\"Es sind zu viele Schützen in Wertung!\",\" \")","v":" "}]
[3,{"$f":"'Wettkampf 1'!B4","v":"Börger III"},null,{"$f":"K46","v":{"v":931.9000000000001,"d":"931.9"}},{"$f":"IF(L46>4,\"Es sind zu viele Schützen in Wertung!\",\" \")","v":" "},{"$nulls":18},"Ansprechpartner für Rückfragen:"]
[4,{"$f":"'Wettkampf 1'!B5","v":"Börger II"},null,{"$f":"M46","v":921.6},{"$f":"IF(N46>4,\"Es sind zu viele Schützen in Wertung!\",\" \")","v":" "},{"$nulls":16},"Name:","Johannes Thesing"]
[5,{"$f":"'Wettkampf 1'!B6","v":"Lahn IV"},null,{"$f":"O46","v":{"v":933.4000000000001,"d":"933.4"}},{"$f":"IF(P46>4,\"Es sind zu viele Schützen in Wertung!\",\" \")","v":" "},{"$nulls":16},"Tel:","0151/21065967"]
[6,{"$f":"'Wettkampf 1'!B7","v":"Neuvrees I"},null,{"$f":"Q46","v":{"v":932.1999999999999,"d":"932.2"}},{"$f":"IF(R46>4,\"Es sind zu viele Schützen in Wertung!\",\" \")","v":" "},{"$nulls":16},"Standaufsicht:","eintragen"]
[]
[null,"Einzelergebnisse:","Verein / Gruppe","Ergebnisse (mindestens 0 eintragen)","AW? Dann x eintippen",null,"Verein 1",null,"Verein 2",null,"Verein 3",null,"Verein 4",null,"Verein 5",null,"Verein 6",{"$nulls":3},"Proberechnung bei Streifen:"]
[1,{"$f":"'Wettkampf 1'!B10","v":"Andre Hanenkamp"},{"$f":"'Wettkampf 1'!C10","v":"Börgerwald II"},314.9,null,{"$f":"IF(E10=\"x\",\"0\",D10)","v":314.9},{"$f":"IF(C10=$B$2,F10,0)","v":314.9},{"$f":"(IF(AND($E10=\"\",$C10=$B$2),1,0))","v":1},{"$f":"IF($C10=$B$3,F10,0)","v":0},{"$f":"(IF(AND($E10=\"\",$C10=$B$3),1,0))","v":0},{"$f":"IF($C10=$B$4,F10,0)","v":0},{"$f":"(IF(AND($E10=\"\",$C10=$B$4),1,0))","v":0},{"$f":"IF($C10=$B$5,F10,0)","v":0},{"$f":"(IF(AND($E10=\"\",$C10=$B$5),1,0))","v":0},{"$f":"IF($C10=$B$6,F10,0)","v":0},{"$f":"(IF(AND($E10=\"\",$C10=$B$6),1,0))","v":0},{"$f":"IF($C10=$B$7,F10,0)","v":0},{"$f":"(IF(AND($E10=\"\",$C10=$B$7),1,0))","v":0},null,null,104.7,104.9,105.3,{"$f":"U10+V10+W10","v":{"v":314.90000000000003,"d":"314.9"}},{"$f":"IF(X10=D10,1,0)","v":1},{"$f":"IF(X10=0,0,1)","v":1},{"$f":"IF(Y10+Z10=2,\"Korrekt\",\"\")","v":"Korrekt"}]
[2,{"$f":"'Wettkampf 1'!B11","v":"Horst Sabel"},{"$f":"'Wettkampf 1'!C11","v":"Börgerwald II"},309.4,null,{"$f":"IF(E11=\"x\",\"0\",D11)","v":309.4},{"$f":"IF(C11=$B$2,F11,0)","v":309.4},{"$f":"(IF(AND($E11=\"\",$C11=$B$2),1,0))","v":1},{"$f":"IF($C11=$B$3,F11,0)","v":0},{"$f":"(IF(AND($E11=\"\",$C11=$B$3),1,0))","v":0},{"$f":"IF($C11=$B$4,F11,0)","v":0},{"$f":"(IF(AND($E11=\"\",$C11=$B$4),1,0))","v":0},{"$f":"IF($C11=$B$5,F11,0)","v":0},{"$f":"(IF(AND($E11=\"\",$C11=$B$5),1,0))","v":0},{"$f":"IF($C11=$B$6,F11,0)","v":0},{"$f":"(IF(AND($E11=\"\",$C11=$B$6),1,0))","v":0},{"$f":"IF($C11=$B$7,F11,0)","v":0},{"$f":"(IF(AND($E11=\"\",$C11=$B$7),1,0))","v":0},null,null,103.8,103.5,102.1,{"$f":"U11+V11+W11","v":309.4},{"$f":"IF(X11=D11,1,0)","v":1},{"$f":"IF(X11=0,0,1)","v":1},{"$f":"IF(Y11+Z11=2,\"Korrekt\",\"\")","v":"Korrekt"}]
[3,{"$f":"'Wettkampf 1'!B12","v":"Christian Robben"},{"$f":"'Wettkampf 1'!C12","v":"Börgerwald II"},296.6,"X","0","0",0,0,0,0,0,0,0,0,0,0,0,null,null,99.4,98.9,98.3,296.6,1,1,"Korrekt"]
[4,{"$f":"'Wettkampf 1'!B13","v":"Mathis Antons"},{"$f":"'Wettkampf 1'!C13","v":"Börgerwald II"},310.8,null,310.8,310.8,1,0,0,0,0,0,0,0,0,0,0,null,null,103.3,104.4,103.1,{"v":310.79999999999995,"d":"310.8"},1,1,"Korrekt"]
[5,{"$f":"'Wettkampf 1'!B14","v":"Tobias Sebers"},{"$f":"'Wettkampf 1'!C14","v":"Börgerwald II"},304.6,"X","0","0",0,0,0,0,0,0,0,0,0,0,0,null,null,102.5,101.9,100.2,304.6,1,1,"Korrekt"]
[6,{"$f":"'Wettkampf 1'!B15","v":"Friedhelm Schroer"},{"$f":"'Wettkampf 1'!C15","v":"Börgerwald II"},305.4,null,305.4,305.4,1,0,0,0,0,0,0,0,0,0,0,null,null,{"v":104,"d":"104.0"},101.1,100.3,305.4,1,1,"Korrekt"]
[7,{"$f":"'Wettkampf 1'!B16","v":"Toni Stahl"},{"$f":"'Wettkampf 1'!C16","v":"Börgerwald II"},null,"X","0","0",0,0,0,0,0,0,0,0,0,0,0,{"$nulls":5},{"v":0,"d":"0.0"},1,0,""]
[8,{"$f":"'Wettkampf 1'!B17","v":"Martin Hinrichs"},{"$f":"'Wettkampf 1'!C17","v":"Börgerwald II"},null,"X","0","0",0,0,0,0,0,0,0,0,0,0,0,{"$nulls":5},{"v":0,"d":"0.0"},1,0,""]
[9,{"$f":"'Wettkampf 1'!B18","v":"Dirk Thunert"},{"$f":"'Wettkampf 1'!C18","v":"Neuvrees II"},312.5,null,312.5,0,0,312.5,1,0,0,0,0,0,0,0,0,null,null,104.3,104.6,103.6,312.5,1,1,"Korrekt"]
[10,{"$f":"'Wettkampf 1'!B19","v":"Hans Preuth"},{"$f":"'Wettkampf 1'!C19","v":"Neuvrees II"},null,"X","0",0,0,"0",0,0,0,0,0,0,0,0,0,{"$nulls":5},{"v":0,"d":"0.0"},1,0,""]
[11,{"$f":"'Wettkampf 1'!B20","v":"Karl-Heinz Schrand"},{"$f":"'Wettkampf 1'!C20","v":"Neuvrees II"},313.1,null,313.1,0,0,313.1,1,0,0,0,0,0,0,0,0,null,null,104.4,104.1,104.6,313.1,1,1,"Korrekt"]
[12,{"$f":"'Wettkampf 1'!B21","v":"Holger Szczepanski"},{"$f":"'Wettkampf 1'!C21","v":"Neuvrees II"},310.2,null,310.2,0,0,310.2,1,0,0,0,0,0,0,0,0,null,null,103.1,104.2,102.9,{"v":310.20000000000005,"d":"310.2"},1,1,"Korrekt"]
[13,{"$f":"'Wettkampf 1'!B22","v":"Bernd Witting"},{"$f":"'Wettkampf 1'!C22","v":"Neuvrees II"},310.3,null,310.3,0,0,310.3,1,0,0,0,0,0,0,0,0,null,null,105.1,102.1,103.1,{"v":310.29999999999995,"d":"310.3"},1,1,"Korrekt"]
[14,{"$f":"'Wettkampf 1'!B23","v":"Hermann Schwarte"},{"$f":"'Wettkampf 1'!C23","v":"Börger II"},302.1,null,302.1,0,0,0,0,0,0,302.1,1,0,0,0,0,null,null,101.2,102.3,98.6,302.1,1,1,"Korrekt"]
[15,{"$f":"'Wettkampf 1'!B24","v":"Bernd Rode"},{"$f":"'Wettkampf 1'!C24","v":"Börger III"},309.2,null,309.2,0,0,0,0,309.2,1,0,0,0,0,0,0,null,null,103.9,102.1,103.2,309.2,1,1,"Korrekt"]
[16,{"$f":"'Wettkampf 1'!B25","v":"Daniel Sebers"},{"$f":"'Wettkampf 1'!C25","v":"Börger III"},307.2,null,307.2,0,0,0,0,307.2,1,0,0,0,0,0,0,null,null,101.9,{"v":103,"d":"103.0"},102.3,307.2,1,1,"Korrekt"]
[17,{"$f":"'Wettkampf 1'!B26","v":"Simon Schutenbrock"},{"$f":"'Wettkampf 1'!C26","v":"Börger III"},309.6,null,309.6,0,0,0,0,309.6,1,0,0,0,0,0,0,null,null,101.6,104.3,103.7,{"v":309.59999999999997,"d":"309.6"},1,1,"Korrekt"]
[18,{"$f":"'Wettkampf 1'!B27","v":"Jürgen Schroer"},{"$f":"'Wettkampf 1'!C27","v":"Börger III"},314.1,"X","0",0,0,0,0,"0",0,0,0,0,0,0,0,null,null,104.9,103.8,105.4,314.1,1,1,"Korrekt"]
[19,{"$f":"'Wettkampf 1'!B28","v":"Marc Eckmann"},{"$f":"'Wettkampf 1'!C28","v":"Börger II"},299.4,null,299.4,0,0,0,0,0,0,299.4,1,0,0,0,0,null,null,99.2,99.7,100.5,299.4,1,1,"Korrekt"]
[20,{"$f":"'Wettkampf 1'!B29","v":"Markus Jungsthöfel"},{"$f":"'Wettkampf 1'!C29","v":"Börger II"},305.4,null,305.4,0,0,0,0,0,0,305.4,1,0,0,0,0,null,null,102.3,101.2,101.9,305.4,1,1,"Korrekt"]
[21,{"$f":"'Wettkampf 1'!B30","v":"Jens Henzen"},{"$f":"'Wettkampf 1'!C30","v":"Börger III"},313.1,null,313.1,0,0,0,0,313.1,1,0,0,0,0,0,0,null,null,104.3,105.2,103.6,313.1,1,1,"Korrekt"]
[22,{"$f":"'Wettkampf 1'!B31","v":"Uwe Goldenstein"},{"$f":"'Wettkampf 1'!C31","v":"Börger II"},306.2,"X","0",0,0,0,0,0,0,"0",0,0,0,0,0,null,null,102.3,100.4,103.5,306.2,1,1,"Korrekt"]
[23,{"$f":"'Wettkampf 1'!B32","v":"Ingo Zdralik"},{"$f":"'Wettkampf 1'!C32","v":"Börger II"},314.1,null,314.1,0,0,0,0,0,0,314.1,1,0,0,0,0,null,null,104.3,105.6,104.2,{"v":314.09999999999997,"d":"314.1"},1,1,"Korrekt"]
[24,{"$f":"'Wettkampf 1'!B33","v":"Schütze 24"},{"$f":"'Wettkampf 1'!C33","v":"Börger II"},null,"X","0",0,0,0,0,0,0,"0",0,0,0,0,0,{"$nulls":5},{"v":0,"d":"0.0"},1,0,""]
[25,{"$f":"'Wettkampf 1'!B34","v":"Oliver Reinelt"},{"$f":"'Wettkampf 1'!C34","v":"Lahn IV"},304.6,null,304.6,0,0,0,0,0,0,0,0,304.6,1,0,0,null,null,101.1,101.6,101.9,304.6,1,1,"Korrekt"]
[26,{"$f":"'Wettkampf 1'!B35","v":"Vitalij Schmidt"},{"$f":"'Wettkampf 1'!C35","v":"Lahn IV"},306.7,null,306.7,0,0,0,0,0,0,0,0,306.7,1,0,0,null,null,101.9,103.4,101.4,{"v":306.70000000000005,"d":"306.7"},1,1,"Korrekt"]
[27,{"$f":"'Wettkampf 1'!B36","v":"Hermann Benten"},{"$f":"'Wettkampf 1'!C36","v":"Lahn IV"},309.4,null,309.4,0,0,0,0,0,0,0,0,309.4,1,0,0,null,null,105.4,102.5,101.5,309.4,1,1,"Korrekt"]
[28,{"$f":"'Wettkampf 1'!B37","v":"Johannes Thesing"},{"$f":"'Wettkampf 1'!C37","v":"Lahn IV"},317.3,null,317.3,0,0,0,0,0,0,0,0,317.3,1,0,0,null,null,106.3,105.3,105.7,317.3,1,1,"Korrekt"]
[29,{"$f":"'Wettkampf 1'!B38","v":"Schütze 29"},{"$f":"'Wettkampf 1'!C38","v":"Lahn IV"},null,"X","0",0,0,0,0,0,0,0,0,"0",0,0,0,{"$nulls":5},{"v":0,"d":"0.0"},1,0,""]
[30,{"$f":"'Wettkampf 1'!B39","v":"Willi Rolfes"},{"$f":"'Wettkampf 1'!C39","v":"Neuvrees I"},309.9,null,309.9,0,0,0,0,0,0,0,0,0,0,309.9,1,null,null,102.9,101.8,105.2,309.9,1,1,"Korrekt"]
[31,{"$f":"'Wettkampf 1'!B40","v":"Werner Thyen"},{"$f":"'Wettkampf 1'!C40","v":"Neuvrees I"},308.9,"X","0",0,0,0,0,0,0,0,0,0,0,"0",0,null,null,102.6,102.8,103.5,308.9,1,1,"Korrekt"]
[32,{"$f":"'Wettkampf 1'!B41","v":"Wilfried Breyer"},{"$f":"'Wettkampf 1'!C41","v":"Neuvrees I"},312.1,null,312.1,0,0,0,0,0,0,0,0,0,0,312.1,1,null,null,102.3,105.3,104.5,312.1,1,1,"Korrekt"]
[33,{"$f":"'Wettkampf 1'!B42","v":"Klaus Steenken"},{"$f":"'Wettkampf 1'!C42","v":"Neuvrees I"},309.4,null,309.4,0,0,0,0,0,0,0,0,0,0,309.4,1,null,null,104.6,100.3,104.5,309.4,1,1,"Korrekt"]
[34,{"$f":"'Wettkampf 1'!B43","v":"Markus Janßen"},{"$f":"'Wettkampf 1'!C43","v":"Neuvrees I"},310.2,null,310.2,0,0,0,0,0,0,0,0,0,0,310.2,1,null,null,103.5,103.8,102.9,{"v":310.20000000000005,"d":"310.2"},1,1,"Korrekt"]
[35,{"$f":"'Wettkampf 1'!B44","v":"Carsten Peters"},{"$f":"'Wettkampf 1'!C44","v":"Neuvrees I"},304.1,"X","0",0,0,0,0,0,0,0,0,0,0,"0",0,null,null,{"v":102,"d":"102.0"},{"v":101,"d":"101.0"},101.1,304.1,1,1,"Korrekt"]
[36,{"$f":"'Wettkampf 1'!B45","v":"Dietmar Spekker"},{"$f":"'Wettkampf 1'!C45","v":"Neuvrees I"},null,"X","0",0,0,0,0,0,0,0,0,0,0,"0",0,{"$nulls":5},{"v":0,"d":"0.0"},1,0,""]
[{"$nulls":6},{"$f":"LARGE(G10:G45,1)+LARGE(G10:G45,2)+LARGE(G10:G45,3)","v":935.1},{"$f":"SUM(H10:H45)","v":4},{"$f":"LARGE(I10:I45,1)+LARGE(I10:I45,2)+LARGE(I10:I45,3)","v":935.9000000000001},{"$f":"SUM(J10:J45)","v":4},{"$f":"LARGE(K10:K45,1)+LARGE(K10:K45,2)+LARGE(K10:K45,3)","v":931.9000000000001},{"$f":"SUM(L10:L45)","v":4},{"$f":"LARGE(M10:M45,1)+LARGE(M10:M45,2)+LARGE(M10:M45,3)","v":921.6},{"$f":"SUM(N10:N45)","v":4},{"$f":"LARGE(O10:O45,1)+LARGE(O10:O45,2)+LARGE(O10:O45,3)","v":933.4000000000001},{"$f":"SUM(P10:P45)","v":4},{"$f":"LARGE(Q10:Q45,1)+LARGE(Q10:Q45,2)+LARGE(Q10:Q45,3)","v":932.1999999999999},{"$f":"SUM(R10:S45)","v":4}]
[null,null,"per Email an: sk-huemmling@gmx.de"]

{"sheet":"6","index":6,"n_rows":47,"n_cols":27,"rows_kept":47,"merged":[[0,22,0,23],[1,22,1,23],[4,22,4,23],[5,22,5,23],[6,22,6,23],[8,20,8,23]]}
[null,"Verein / Gruppe",null,"Ergebnisse",{"$nulls":17},"Austragungsort:",{"$f":"Übersicht!I4","v":"Neuvrees"}]
[1,{"$f":"'Wettkampf 1'!B2","v":"Börgerwald II"},null,{"$f":"G46","v":927.8},{"$f":"IF(H46>4,\"Es sind zu viele Schützen in Wertung!\",\" \")","v":" "},{"$nulls":16},"Wettkampftag:",{"$f":"Übersicht!I3","v":"19.11."}]
[2,{"$f":"'Wettkampf 1'!B3","v":"Neuvrees II"},null,{"$f":"I46","v":933.7},{"$f":"IF(J46>4,\"Es sind zu viele Schützen in Wertung!\",\" \")","v":" "}]
[3,{"$f":"'Wettkampf 1'!B4","v":"Börger III"},null,{"$f":"K46","v":933.3},{"$f":"IF(L46>4,\"Es sind zu viele Schützen in Wertung!\",\" \")","v":" "},{"$nulls":18},"Ansprechpartner für Rückfragen:"]
[4,{"$f":"'Wettkampf 1'!B5","v":"Börger II"},null,{"$f":"M46","v":929.2},{"$f":"IF(N46>4,\"Es sind zu viele Schützen in Wertung!\",\" \")","v":" "},{"$nulls":16},"Name:","Werner Thyen"]
[5,{"$f":"'Wettkampf 1'!B6","v":"Lahn IV"},null,{"$f":"O46","v":{"v":928.5000000000001,"d":"928.5"}},{"$f":"IF(P46>4,\"Es sind zu viele Schützen in Wertung!\",\" \")","v":" "},{"$nulls":16},"Tel:","015206834657"]
[6,{"$f":"'Wettkampf 1'!B7","v":"Neuvrees I"},null,{"$f":"Q46","v":{"v":932.9000000000001,"d":"932.9"}},{"$f":"IF(R46>4,\"Es sind zu viele Schützen in Wertung!\",\" \")","v":" "},{"$nulls":16},"Standaufsicht:","Markus Janßen"]
[]
[null,"Einzelergebnisse:","Verein / Gruppe","Ergebnisse (mindestens 0 eintragen)","AW? Dann x eintippen",null,"Verein 1",null,"Verein 2",null,"Verein 3",null,"Verein 4",null,"Verein 5",null,"Verein 6",{"$nulls":3},"Proberechnung bei Streifen:"]
[1,{"$f":"'Wettkampf 1'!B10","v":"Andre Hanenkamp"},{"$f":"'Wettkampf 1'!C10","v":"Börgerwald II"},310.8,null,{"$f":"IF(E10=\"x\",\"0\",D10)","v":310.8},{"$f":"IF(C10=$B$2,F10,0)","v":310.8},{"$f":"(IF(AND($E10=\"\",$C10=$B$2),1,0))","v":1},{"$f":"IF($C10=$B$3,F10,0)","v":0},{"$f":"(IF(AND($E10=\"\",$C10=$B$3),1,0))","v":0},{"$f":"IF($C10=$B$4,F10,0)","v":0},{"$f":"(IF(AND($E10=\"\",$C10=$B$4),1,0))","v":0},{"$f":"IF($C10=$B$5,F10,0)","v":0},{"$f":"(IF(AND($E10=\"\",$C10=$B$5),1,0))","v":0},{"$f":"IF($C10=$B$6,F10,0)","v":0},{"$f":"(IF(AND($E10=\"\",$C10=$B$6),1,0))","v":0},{"$f":"IF($C10=$B$7,F10,0)","v":0},{"$f":"(IF(AND($E10=\"\",$C10=$B$7),1,0))","v":0},null,null,103.3,103.7,103.8,{"$f":"U10+V10+W10","v":310.8},{"$f":"IF(X10=D10,1,0)","v":1},{"$f":"IF(X10=0,0,1)","v":1},{"$f":"IF(Y10+Z10=2,\"Korrekt\",\"\")","v":"Korrekt"}]
[2,{"$f":"'Wettkampf 1'!B11","v":"Horst Sabel"},{"$f":"'Wettkampf 1'!C11","v":"Börgerwald II"},{"v":308,"d":"308.0"},null,{"$f":"IF(E11=\"x\",\"0\",D11)","v":{"v":308,"d":"308.0"}},{"$f":"IF(C11=$B$2,F11,0)","v":308},{"$f":"(IF(AND($E11=\"\",$C11=$B$2),1,0))","v":1},{"$f":"IF($C11=$B$3,F11,0)","v":0},{"$f":"(IF(AND($E11=\"\",$C11=$B$3),1,0))","v":0},{"$f":"IF($C11=$B$4,F11,0)","v":0},{"$f":"(IF(AND($E11=\"\",$C11=$B$4),1,0))","v":0},{"$f":"IF($C11=$B$5,F11,0)","v":0},{"$f":"(IF(AND($E11=\"\",$C11=$B$5),1,0))","v":0},{"$f":"IF($C11=$B$6,F11,0)","v":0},{"$f":"(IF(AND($E11=\"\",$C11=$B$6),1,0))","v":0},{"$f":"IF($C11=$B$7,F11,0)","v":0},{"$f":"(IF(AND($E11=\"\",$C11=$B$7),1,0))","v":0},null,null,100.8,103.5,103.7,{"$f":"U11+V11+W11","v":{"v":308,"d":"308.0"}},{"$f":"IF(X11=D11,1,0)","v":1},{"$f":"IF(X11=0,0,1)","v":1},{"$f":"IF(Y11+Z11=2,\"Korrekt\",\"\")","v":"Korrekt"}]
[3,{"$f":"'Wettkampf 1'!B12","v":"Christian Robben"},{"$f":"'Wettkampf 1'!C12","v":"Börgerwald II"},301.6,"x","0","0",0,0,0,0,0,0,0,0,0,0,0,null,null,101.3,102.5,97.8,301.6,1,1,"Korrekt"]
[4,{"$f":"'Wettkampf 1'!B13","v":"Mathis Antons"},{"$f":"'Wettkampf 1'!C13","v":"Börgerwald II"},{"v":0,"d":"0.0"},"x","0","0",0,0,0,0,0,0,0,0,0,0,0,{"$nulls":5},{"v":0,"d":"0.0"},1,0,""]
[5,{"$f":"'Wettkampf 1'!B14","v":"Tobias Sebers"},{"$f":"'Wettkampf 1'!C14","v":"Börgerwald II"},298.6,null,298.6,298.6,1,0,0,0,0,0,0,0,0,0,0,null,null,100.9,100.7,{"v":97,"d":"97.0"},298.6,1,1,"Korrekt"]
[6,{"$f":"'Wettkampf 1'!B15","v":"Friedhelm Schroer"},{"$f":"'Wettkampf 1'!C15","v":"Börgerwald II"},{"v":309,"d":"309.0"},null,{"v":309,"d":"309.0"},309,1,0,0,0,0,0,0,0,0,0,0,null,null,105.1,100.3,103.6,{"v":309,"d":"309.0"},1,1,"Korrekt"]
[7,{"$f":"'Wettkampf 1'!B16","v":"Toni Stahl"},{"$f":"'Wettkampf 1'!C16","v":"Börgerwald II"},296.3,"x","0","0",0,0,0,0,0,0,0,0,0,0,0,null,null,98.3,98.7,99.3,296.3,1,1,"Korrekt"]
[8,{"$f":"'Wettkampf 1'!B17","v":"Martin Hinrichs"},{"$f":"'Wettkampf 1'!C17","v":"Börgerwald II"},{"v":0,"d":"0.0"},"x","0","0",0,0,0,0,0,0,0,0,0,0,0,{"$nulls":5},{"v":0,"d":"0.0"},1,0,""]
[9,{"$f":"'Wettkampf 1'!B18","v":"Dirk Thunert"},{"$f":"'Wettkampf 1'!C18","v":"Neuvrees II"},{"v":313,"d":"313.0"},null,{"v":313,"d":"313.0"},0,0,313,1,0,0,0,0,0,0,0,0,null,null,104.7,104.4,103.9,{"v":313,"d":"313.0"},1,1,"Korrekt"]
[10,{"$f":"'Wettkampf 1'!B19","v":"Hans Preuth"},{"$f":"'Wettkampf 1'!C19","v":"Neuvrees II"},{"v":0,"d":"0.0"},"x","0",0,0,"0",0,0,0,0,0,0,0,0,0,{"$nulls":5},{"v":0,"d":"0.0"},1,0,""]
[11,{"$f":"'Wettkampf 1'!B20","v":"Karl-Heinz Schrand"},{"$f":"'Wettkampf 1'!C20","v":"Neuvrees II"},307.6,null,307.6,0,0,307.6,1,0,0,0,0,0,0,0,0,null,null,103.8,101.6,102.2,{"v":307.59999999999997,"d":"307.6"},1,1,"Korrekt"]
[12,{"$f":"'Wettkampf 1'!B21","v":"Holger Szczepanski"},{"$f":"'Wettkampf 1'!C21","v":"Neuvrees II"},309.6,null,309.6,0,0,309.6,1,0,0,0,0,0,0,0,0,null,null,101.9,103.5,104.2,309.6,1,1,"Korrekt"]
[13,{"$f":"'Wettkampf 1'!B22","v":"Bernd Witting"},{"$f":"'Wettkampf 1'!C22","v":"Neuvrees II"},311.1,null,311.1,0,0,311.1,1,0,0,0,0,0,0,0,0,null,null,103.6,103.8,103.7,{"v":311.09999999999997,"d":"311.1"},1,1,"Korrekt"]
[14,{"$f":"'Wettkampf 1'!B23","v":"Hermann Schwarte"},{"$f":"'Wettkampf 1'!C23","v":"Börger II"},{"v":0,"d":"0.0"},"x","0",0,0,0,0,0,0,"0",0,0,0,0,0,{"$nulls":5},{"v":0,"d":"0.0"},1,0,""]
[15,{"$f":"'Wettkampf 1'!B24","v":"Bernd Rode"},{"$f":"'Wettkampf 1'!C24","v":"Börger III"},308.7,null,308.7,0,0,0,0,308.7,1,0,0,0,0,0,0,null,null,102.9,101.8,{"v":104,"d":"104.0"},308.7,1,1,"Korrekt"]
[16,{"$f":"'Wettkampf 1'!B25","v":"Daniel Sebers"},{"$f":"'Wettkampf 1'!C25","v":"Börger III"},306.4,null,306.4,0,0,0,0,306.4,1,0,0,0,0,0,0,null,null,103.4,100.9,102.1,306.4,1,1,"Korrekt"]
[17,{"$f":"'Wettkampf 1'!B26","v":"Simon Schutenbrock"},{"$f":"'Wettkampf 1'!C26","v":"Börger III"},{"v":311,"d":"311.0"},null,{"v":311,"d":"311.0"},0,0,0,0,311,1,0,0,0,0,0,0,null,null,{"v":104,"d":"104.0"},102.2,104.8,{"v":311,"d":"311.0"},1,1,"Korrekt"]
[18,{"$f":"'Wettkampf 1'!B27","v":"Jürgen Schroer"},{"$f":"'Wettkampf 1'!C27","v":"Börger III"},303.3,"x","0",0,0,0,0,"0",0,0,0,0,0,0,0,null,null,99.4,100.2,103.7,303.3,1,1,"Korrekt"]
[19,{"$f":"'Wettkampf 1'!B28","v":"Marc Eckmann"},{"$f":"'Wettkampf 1'!C28","v":"Börger II"},304.5,null,304.5,0,0,0,0,0,0,304.5,1,0,0,0,0,null,null,100.6,{"v":102,"d":"102.0"},101.9,304.5,1,1,"Korrekt"]
[20,{"$f":"'Wettkampf 1'!B29","v":"Markus Jungsthöfel"},{"$f":"'Wettkampf 1'!C29","v":"Börger II"},306.9,null,306.9,0,0,0,0,0,0,306.9,1,0,0,0,0,null,null,103.7,100.9,102.3,{"v":306.90000000000003,"d":"306.9"},1,1,"Korrekt"]
[21,{"$f":"'Wettkampf 1'!B30","v":"Jens Henzen"},{"$f":"'Wettkampf 1'!C30","v":"Börger III"},313.6,null,313.6,0,0,0,0,313.6,1,0,0,0,0,0,0,null,null,104.9,105.1,103.6,313.6,1,1,"Korrekt"]
[22,{"$f":"'Wettkampf 1'!B31","v":"Uwe Goldenstein"},{"$f":"'Wettkampf 1'!C31","v":"Börger II"},{"v":299,"d":"299.0"},null,{"v":299,"d":"299.0"},0,0,0,0,0,0,299,1,0,0,0,0,null,null,99.1,101.2,98.7,{"v":299,"d":"299.0"},1,1,"Korrekt"]
[23,{"$f":"'Wettkampf 1'!B32","v":"Ingo Zdralik"},{"$f":"'Wettkampf 1'!C32","v":"Börger II"},317.8,null,317.8,0,0,0,0,0,0,317.8,1,0,0,0,0,null,null,106.5,105.2,106.1,{"v":317.79999999999995,"d":"317.8"},1,1,"Korrekt"]
[24,{"$f":"'Wettkampf 1'!B33","v":"Schütze 24"},{"$f":"'Wettkampf 1'!C33","v":"Börger II"},null,"x","0",0,0,0,0,0,0,"0",0,0,0,0,0,{"$nulls":5},{"v":0,"d":"0.0"},1,0,""]
[25,{"$f":"'Wettkampf 1'!B34","v":"Oliver Reinelt"},{"$f":"'Wettkampf 1'!C34","v":"Lahn IV"},304.6,null,304.6,0,0,0,0,0,0,0,0,304.6,1,0,0,null,null,{"v":100,"d":"100.0"},102.5,102.1,304.6,1,1,"Korrekt"]
[26,{"$f":"'Wettkampf 1'!B35","v":"Vitalij Schmidt"},{"$f":"'Wettkampf 1'!C35","v":"Lahn IV"},311.8,null,311.8,0,0,0,0,0,0,0,0,311.8,1,0,0,null,null,104.8,102.5,104.5,311.8,1,1,"Korrekt"]
[27,{"$f":"'Wettkampf 1'!B36","v":"Hermann Benten"},{"$f":"'Wettkampf 1'!C36","v":"Lahn IV"},304.1,null,304.1,0,0,0,0,0,0,0,0,304.1,1,0,0,null,null,101.8,100.5,101.8,304.1,1,1,"Korrekt"]
[28,{"$f":"'Wettkampf 1'!B37","v":"Johannes Thesing"},{"$f":"'Wettkampf 1'!C37","v":"Lahn IV"},312.1,null,312.1,0,0,0,0,0,0,0,0,312.1,1,0,0,null,null,{"v":103,"d":"103.0"},{"v":106,"d":"106.0"},103.1,312.1,1,1,"Korrekt"]
[29,{"$f":"'Wettkampf 1'!B38","v":"Schütze 29"},{"$f":"'Wettkampf 1'!C38","v":"Lahn IV"},null,"x","0",0,0,0,0,0,0,0,0,"0",0,0,0,{"$nulls":5},{"v":0,"d":"0.0"},1,0,""]
[30,{"$f":"'Wettkampf 1'!B39","v":"Willi Rolfes"},{"$f":"'Wettkampf 1'!C39","v":"Neuvrees I"},313.8,null,313.8,0,0,0,0,0,0,0,0,0,0,313.8,1,null,null,104.9,104.3,104.6,{"v":313.79999999999995,"d":"313.8"},1,1,"Korrekt"]
[31,{"$f":"'Wettkampf 1'!B40","v":"Werner Thyen"},{"$f":"'Wettkampf 1'!C40","v":"Neuvrees I"},302.4,"x","0",0,0,0,0,0,0,0,0,0,0,"0",0,null,null,101.3,99.7,101.4,302.4,1,1,"Korrekt"]
[32,{"$f":"'Wettkampf 1'!B41","v":"Wilfried Breyer"},{"$f":"'Wettkampf 1'!C41","v":"Neuvrees I"},302.6,"x","0",0,0,0,0,0,0,0,0,0,0,"0",0,null,null,99.2,101.6,101.8,302.6,1,1,"Korrekt"]
[33,{"$f":"'Wettkampf 1'!B42","v":"Klaus Steenken"},{"$f":"'Wettkampf 1'!C42","v":"Neuvrees I"},308.2,null,308.2,0,0,0,0,0,0,0,0,0,0,308.2,1,null,null,102.1,102.9,103.2,308.2,1,1,"Korrekt"]
[34,{"$f":"'Wettkampf 1'!B43","v":"Markus Janßen"},{"$f":"'Wettkampf 1'!C43","v":"Neuvrees I"},310.9,null,310.9,0,0,0,0,0,0,0,0,0,0,310.9,1,null,null,104.2,{"v":102,"d":"102.0"},104.7,310.9,1,1,"Korrekt"]
[35,{"$f":"'Wettkampf 1'!B44","v":"Carsten Peters"},{"$f":"'Wettkampf 1'!C44","v":"Neuvrees I"},299.1,"x","0",0,0,0,0,0,0,0,0,0,0,"0",0,null,null,96.4,101.2,101.5,299.1,1,1,"Korrekt"]
[36,{"$f":"'Wettkampf 1'!B45","v":"Dietmar Spekker"},{"$f":"'Wettkampf 1'!C45","v":"Neuvrees I"},null,null,{"v":0,"d":"0.0"},0,0,0,0,0,0,0,0,0,0,0,1,{"$nulls":5},{"v":0,"d":"0.0"},1,0,""]
[{"$nulls":6},{"$f":"LARGE(G10:G45,1)+LARGE(G10:G45,2)+LARGE(G10:G45,3)","v":927.8},{"$f":"SUM(H10:H45)","v":4},{"$f":"LARGE(I10:I45,1)+LARGE(I10:I45,2)+LARGE(I10:I45,3)","v":933.7},{"$f":"SUM(J10:J45)","v":4},{"$f":"LARGE(K10:K45,1)+LARGE(K10:K45,2)+LARGE(K10:K45,3)","v":933.3},{"$f":"SUM(L10:L45)","v":4},{"$f":"LARGE(M10:M45,1)+LARGE(M10:M45,2)+LARGE(M10:M45,3)","v":929.2},{"$f":"SUM(N10:N45)","v":4},{"$f":"LARGE(O10:O45,1)+LARGE(O10:O45,2)+LARGE(O10:O45,3)","v":928.5000000000001},{"$f":"SUM(P10:P45)","v":4},{"$f":"LARGE(Q10:Q45,1)+LARGE(Q10:Q45,2)+LARGE(Q10:Q45,3)","v":932.9000000000001},{"$f":"SUM(R10:S45)","v":4}]
[null,null,"per Email an: sk-huemmling@gmx.de"]

{"sheet":"7","index":7,"n_rows":47,"n_cols":27,"rows_kept":47,"merged":[[0,22,0,23],[1,22,1,23],[4,22,4,23],[5,22,5,23],[6,22,6,23],[8,20,8,23]]}
[null,"Verein / Gruppe",null,"Ergebnisse",{"$nulls":17},"Austragungsort:",{"$f":"Übersicht!L4","v":"Neuvrees"}]
[1,{"$f":"'Wettkampf 1'!B2","v":"Börgerwald II"},null,{"$f":"G46","v":{"v":0,"d":"0.0"}},{"$f":"IF(H46>4,\"Es sind zu viele Schützen in Wertung!\",\" \")","v":"Es sind zu viele Schützen in Wertung!"},{"$nulls":16},"Wettkampftag:",{"$f":"Übersicht!L3","v":"14.01."}]
[2,{"$f":"'Wettkampf 1'!B3","v":"Neuvrees II"},null,{"$f":"I46","v":{"v":0,"d":"0.0"}},{"$f":"IF(J46>4,\"Es sind zu viele Schützen in Wertung!\",\" \")","v":"Es sind zu viele Schützen in Wertung!"}]
[3,{"$f":"'Wettkampf 1'!B4","v":"Börger III"},null,{"$f":"K46","v":{"v":0,"d":"0.0"}},{"$f":"IF(L46>4,\"Es sind zu viele Schützen in Wertung!\",\" \")","v":"Es sind zu viele Schützen in Wertung!"},{"$nulls":18},"Ansprechpartner für Rückfragen:"]
[4,{"$f":"'Wettkampf 1'!B5","v":"Börger II"},null,{"$f":"M46","v":{"v":0,"d":"0.0"}},{"$f":"IF(N46>4,\"Es sind zu viele Schützen in Wertung!\",\" \")","v":"Es sind zu viele Schützen in Wertung!"},{"$nulls":16},"Name:"]
[5,{"$f":"'Wettkampf 1'!B6","v":"Lahn IV"},null,{"$f":"O46","v":{"v":0,"d":"0.0"}},{"$f":"IF(P46>4,\"Es sind zu viele Schützen in Wertung!\",\" \")","v":"Es sind zu viele Schützen in Wertung!"},{"$nulls":16},"Tel:"]
[6,{"$f":"'Wettkampf 1'!B7","v":"Neuvrees I"},null,{"$f":"Q46","v":{"v":0,"d":"0.0"}},{"$f":"IF(R46>4,\"Es sind zu viele Schützen in Wertung!\",\" \")","v":"Es sind zu viele Schützen in Wertung!"},{"$nulls":16},"Standaufsicht:","eintragen"]
[]
[null,"Einzelergebnisse:","Verein / Gruppe","Ergebnisse (mindestens 0 eintragen)","AW? Dann x eintippen",null,"Verein 1",null,"Verein 2",null,"Verein 3",null,"Verein 4",null,"Verein 5",null,"Verein 6",{"$nulls":3},"Proberechnung bei Streifen:"]
[1,{"$f":"'Wettkampf 1'!B10","v":"Andre Hanenkamp"},{"$f":"'Wettkampf 1'!C10","v":"Börgerwald II"},null,null,{"$f":"IF(E10=\"x\",\"0\",D10)","v":{"v":0,"d":"0.0"}},{"$f":"IF(C10=$B$2,F10,0)","v":0},{"$f":"(IF(AND($E10=\"\",$C10=$B$2),1,0))","v":1},{"$f":"IF($C10=$B$3,F10,0)","v":0},{"$f":"(IF(AND($E10=\"\",$C10=$B$3),1,0))","v":0},{"$f":"IF($C10=$B$4,F10,0)","v":0},{"$f":"(IF(AND($E10=\"\",$C10=$B$4),1,0))","v":0},{"$f":"IF($C10=$B$5,F10,0)","v":0},{"$f":"(IF(AND($E10=\"\",$C10=$B$5),1,0))","v":0},{"$f":"IF($C10=$B$6,F10,0)","v":0},{"$f":"(IF(AND($E10=\"\",$C10=$B$6),1,0))","v":0},{"$f":"IF($C10=$B$7,F10,0)","v":0},{"$f":"(IF(AND($E10=\"\",$C10=$B$7),1,0))","v":0},{"$nulls":5},{"$f":"U10+V10+W10","v":{"v":0,"d":"0.0"}},{"$f":"IF(X10=D10,1,0)","v":1},{"$f":"IF(X10=0,0,1)","v":0},{"$f":"IF(Y10+Z10=2,\"Korrekt\",\"\")","v":""}]
[2,{"$f":"'Wettkampf 1'!B11","v":"Horst Sabel"},{"$f":"'Wettkampf 1'!C11","v":"Börgerwald II"},null,null,{"$f":"IF(E11=\"x\",\"0\",D11)","v":{"v":0,"d":"0.0"}},{"$f":"IF(C11=$B$2,F11,0)","v":0},{"$f":"(IF(AND($E11=\"\",$C11=$B$2),1,0))","v":1},{"$f":"IF($C11=$B$3,F11,0)","v":0},{"$f":"(IF(AND($E11=\"\",$C11=$B$3),1,0))","v":0},{"$f":"IF($C11=$B$4,F11,0)","v":0},{"$f":"(IF(AND($E11=\"\",$C11=$B$4),1,0))","v":0},{"$f":"IF($C11=$B$5,F11,0)","v":0},{"$f":"(IF(AND($E11=\"\",$C11=$B$5),1,0))","v":0},{"$f":"IF($C11=$B$6,F11,0)","v":0},{"$f":"(IF(AND($E11=\"\",$C11=$B$6),1,0))","v":0},{"$f":"IF($C11=$B$7,F11,0)","v":0},{"$f":"(IF(AND($E11=\"\",$C11=$B$7),1,0))","v":0},{"$nulls":5},{"$f":"U11+V11+W11","v":{"v":0,"d":"0.0"}},{"$f":"IF(X11=D11,1,0)","v":1},{"$f":"IF(X11=0,0,1)","v":0},{"$f":"IF(Y11+Z11=2,\"Korrekt\",\"\")","v":""}]
[3,{"$f":"'Wettkampf 1'!B12","v":"Christian Robben"},{"$f":"'Wettkampf 1'!C12","v":"Börgerwald II"},null,null,{"v":0,"d":"0.0"},0,1,0,0,0,0,0,0,0,0,0,0,{"$nulls":5},{"v":0,"d":"0.0"},1,0,""]
[4,{"$f":"'Wettkampf 1'!B13","v":"Mathis Antons"},{"$f":"'Wettkampf 1'!C13","v":"Börgerwald II"},null,null,{"v":0,"d":"0.0"},0,1,0,0,0,0,0,0,0,0,0,0,{"$nulls":5},{"v":0,"d":"0.0"},1,0,""]
[5,{"$f":"'Wettkampf 1'!B14","v":"Tobias Sebers"},{"$f":"'Wettkampf 1'!C14","v":"Börgerwald II"},null,null,{"v":0,"d":"0.0"},0,1,0,0,0,0,0,0,0,0,0,0,{"$nulls":5},{"v":0,"d":"0.0"},1,0,""]
[6,{"$f":"'Wettkampf 1'!B15","v":"Friedhelm Schroer"},{"$f":"'Wettkampf 1'!C15","v":"Börgerwald II"},null,null,{"v":0,"d":"0.0"},0,1,0,0,0,0,0,0,0,0,0,0,{"$nulls":5},{"v":0,"d":"0.0"},1,0,""]
[7,{"$f":"'Wettkampf 1'!B16","v":"Toni Stahl"},{"$f":"'Wettkampf 1'!C16","v":"Börgerwald II"},null,null,{"v":0,"d":"0.0"},0,1,0,0,0,0,0,0,0,0,0,0,{"$nulls":5},{"v":0,"d":"0.0"},1,0,""]
[8,{"$f":"'Wettkampf 1'!B17","v":"Martin Hinrichs"},{"$f":"'Wettkampf 1'!C17","v":"Börgerwald II"},null,null,{"v":0,"d":"0.0"},0,1,0,0,0,0,0,0,0,0,0,0,{"$nulls":5},{"v":0,"d":"0.0"},1,0,""]
[9,{"$f":"'Wettkampf 1'!B18","v":"Dirk Thunert"},{"$f":"'Wettkampf 1'!C18","v":"Neuvrees II"},null,null,{"v":0,"d":"0.0"},0,0,0,1,0,0,0,0,0,0,0,0,{"$nulls":5},{"v":0,"d":"0.0"},1,0,""]
[10,{"$f":"'Wettkampf 1'!B19","v":"Hans Preuth"},{"$f":"'Wettkampf 1'!C19","v":"Neuvrees II"},null,null,{"v":0,"d":"0.0"},0,0,0,1,0,0,0,0,0,0,0,0,{"$nulls":5},{"v":0,"d":"0.0"},1,0,""]
[11,{"$f":"'Wettkampf 1'!B20","v":"Karl-Heinz Schrand"},{"$f":"'Wettkampf 1'!C20","v":"Neuvrees II"},null,null,{"v":0,"d":"0.0"},0,0,0,1,0,0,0,0,0,0,0,0,{"$nulls":5},{"v":0,"d":"0.0"},1,0,""]
[12,{"$f":"'Wettkampf 1'!B21","v":"Holger Szczepanski"},{"$f":"'Wettkampf 1'!C21","v":"Neuvrees II"},null,null,{"v":0,"d":"0.0"},0,0,0,1,0,0,0,0,0,0,0,0,{"$nulls":5},{"v":0,"d":"0.0"},1,0,""]
[13,{"$f":"'Wettkampf 1'!B22","v":"Bernd Witting"},{"$f":"'Wettkampf 1'!C22","v":"Neuvrees II"},null,null,{"v":0,"d":"0.0"},0,0,0,1,0,0,0,0,0,0,0,0,{"$nulls":5},{"v":0,"d":"0.0"},1,0,""]
[14,{"$f":"'Wettkampf 1'!B23","v":"Hermann Schwarte"},{"$f":"'Wettkampf 1'!C23","v":"Börger II"},null,null,{"v":0,"d":"0.0"},0,0,0,0,0,0,0,1,0,0,0,0,{"$nulls":5},{"v":0,"d":"0.0"},1,0,""]
[15,{"$f":"'Wettkampf 1'!B24","v":"Bernd Rode"},{"$f":"'Wettkampf 1'!C24","v":"Börger III"},null,null,{"v":0,"d":"0.0"},0,0,0,0,0,1,0,0,0,0,0,0,{"$nulls":5},{"v":0,"d":"0.0"},1,0,""]
[16,{"$f":"'Wettkampf 1'!B25","v":"Daniel Sebers"},{"$f":"'Wettkampf 1'!C25","v":"Börger III"},null,null,{"v":0,"d":"0.0"},0,0,0,0,0,1,0,0,0,0,0,0,{"$nulls":5},{"v":0,"d":"0.0"},1,0,""]
[17,{"$f":"'Wettkampf 1'!B26","v":"Simon Schutenbrock"},{"$f":"'Wettkampf 1'!C26","v":"Börger III"},null,null,{"v":0,"d":"0.0"},0,0,0,0,0,1,0,0,0,0,0,0,{"$nulls":5},{"v":0,"d":"0.0"},1,0,""]
[18,{"$f":"'Wettkampf 1'!B27","v":"Jürgen Schroer"},{"$f":"'Wettkampf 1'!C27","v":"Börger III"},null,null,{"v":0,"d":"0.0"},0,0,0,0,0,1,0,0,0,0,0,0,{"$nulls":5},{"v":0,"d":"0.0"},1,0,""]
[19,{"$f":"'Wettkampf 1'!B28","v":"Marc Eckmann"},{"$f":"'Wettkampf 1'!C28","v":"Börger II"},null,null,{"v":0,"d":"0.0"},0,0,0,0,0,0,0,1,0,0,0,0,{"$nulls":5},{"v":0,"d":"0.0"},1,0,""]
[20,{"$f":"'Wettkampf 1'!B29","v":"Markus Jungsthöfel"},{"$f":"'Wettkampf 1'!C29","v":"Börger II"},null,null,{"v":0,"d":"0.0"},0,0,0,0,0,0,0,1,0,0,0,0,{"$nulls":5},{"v":0,"d":"0.0"},1,0,""]
[21,{"$f":"'Wettkampf 1'!B30","v":"Jens Henzen"},{"$f":"'Wettkampf 1'!C30","v":"Börger III"},null,null,{"v":0,"d":"0.0"},0,0,0,0,0,1,0,0,0,0,0,0,{"$nulls":5},{"v":0,"d":"0.0"},1,0,""]
[22,{"$f":"'Wettkampf 1'!B31","v":"Uwe Goldenstein"},{"$f":"'Wettkampf 1'!C31","v":"Börger II"},null,null,{"v":0,"d":"0.0"},0,0,0,0,0,0,0,1,0,0,0,0,{"$nulls":5},{"v":0,"d":"0.0"},1,0,""]
[23,{"$f":"'Wettkampf 1'!B32","v":"Ingo Zdralik"},{"$f":"'Wettkampf 1'!C32","v":"Börger II"},null,null,{"v":0,"d":"0.0"},0,0,0,0,0,0,0,1,0,0,0,0,{"$nulls":5},{"v":0,"d":"0.0"},1,0,""]
[24,{"$f":"'Wettkampf 1'!B33","v":"Schütze 24"},{"$f":"'Wettkampf 1'!C33","v":"Börger II"},null,null,{"v":0,"d":"0.0"},0,0,0,0,0,0,0,1,0,0,0,0,{"$nulls":5},{"v":0,"d":"0.0"},1,0,""]
[25,{"$f":"'Wettkampf 1'!B34","v":"Oliver Reinelt"},{"$f":"'Wettkampf 1'!C34","v":"Lahn IV"},null,null,{"v":0,"d":"0.0"},0,0,0,0,0,0,0,0,0,1,0,0,{"$nulls":5},{"v":0,"d":"0.0"},1,0,""]
[26,{"$f":"'Wettkampf 1'!B35","v":"Vitalij Schmidt"},{"$f":"'Wettkampf 1'!C35","v":"Lahn IV"},null,null,{"v":0,"d":"0.0"},0,0,0,0,0,0,0,0,0,1,0,0,{"$nulls":5},{"v":0,"d":"0.0"},1,0,""]
[27,{"$f":"'Wettkampf 1'!B36","v":"Hermann Benten"},{"$f":"'Wettkampf 1'!C36","v":"Lahn IV"},null,null,{"v":0,"d":"0.0"},0,0,0,0,0,0,0,0,0,1,0,0,{"$nulls":5},{"v":0,"d":"0.0"},1,0,""]
[28,{"$f":"'Wettkampf 1'!B37","v":"Johannes Thesing"},{"$f":"'Wettkampf 1'!C37","v":"Lahn IV"},null,null,{"v":0,"d":"0.0"},0,0,0,0,0,0,0,0,0,1,0,0,{"$nulls":5},{"v":0,"d":"0.0"},1,0,""]
[29,{"$f":"'Wettkampf 1'!B38","v":"Schütze 29"},{"$f":"'Wettkampf 1'!C38","v":"Lahn IV"},null,null,{"v":0,"d":"0.0"},0,0,0,0,0,0,0,0,0,1,0,0,{"$nulls":5},{"v":0,"d":"0.0"},1,0,""]
[30,{"$f":"'Wettkampf 1'!B39","v":"Willi Rolfes"},{"$f":"'Wettkampf 1'!C39","v":"Neuvrees I"},null,null,{"v":0,"d":"0.0"},0,0,0,0,0,0,0,0,0,0,0,1,{"$nulls":5},{"v":0,"d":"0.0"},1,0,""]
[31,{"$f":"'Wettkampf 1'!B40","v":"Werner Thyen"},{"$f":"'Wettkampf 1'!C40","v":"Neuvrees I"},null,null,{"v":0,"d":"0.0"},0,0,0,0,0,0,0,0,0,0,0,1,{"$nulls":5},{"v":0,"d":"0.0"},1,0,""]
[32,{"$f":"'Wettkampf 1'!B41","v":"Wilfried Breyer"},{"$f":"'Wettkampf 1'!C41","v":"Neuvrees I"},null,null,{"v":0,"d":"0.0"},0,0,0,0,0,0,0,0,0,0,0,1,{"$nulls":5},{"v":0,"d":"0.0"},1,0,""]
[33,{"$f":"'Wettkampf 1'!B42","v":"Klaus Steenken"},{"$f":"'Wettkampf 1'!C42","v":"Neuvrees I"},null,null,{"v":0,"d":"0.0"},0,0,0,0,0,0,0,0,0,0,0,1,{"$nulls":5},{"v":0,"d":"0.0"},1,0,""]
[34,{"$f":"'Wettkampf 1'!B43","v":"Markus Janßen"},{"$f":"'Wettkampf 1'!C43","v":"Neuvrees I"},null,null,{"v":0,"d":"0.0"},0,0,0,0,0,0,0,0,0,0,0,1,{"$nulls":5},{"v":0,"d":"0.0"},1,0,""]
[35,{"$f":"'Wettkampf 1'!B44","v":"Carsten Peters"},{"$f":"'Wettkampf 1'!C44","v":"Neuvrees I"},null,null,{"v":0,"d":"0.0"},0,0,0,0,0,0,0,0,0,0,0,1,{"$nulls":5},{"v":0,"d":"0.0"},1,0,""]
[36,{"$f":"'Wettkampf 1'!B45","v":"Dietmar Spekker"},{"$f":"'Wettkampf 1'!C45","v":"Neuvrees I"},null,null,{"v":0,"d":"0.0"},0,0,0,0,0,0,0,0,0,0,0,1,{"$nulls":5},{"v":0,"d":"0.0"},1,0,""]
[{"$nulls":6},{"$f":"LARGE(G10:G45,1)+LARGE(G10:G45,2)+LARGE(G10:G45,3)","v":0},{"$f":"SUM(H10:H45)","v":8},{"$f":"LARGE(I10:I45,1)+LARGE(I10:I45,2)+LARGE(I10:I45,3)","v":0},{"$f":"SUM(J10:J45)","v":5},{"$f":"LARGE(K10:K45,1)+LARGE(K10:K45,2)+LARGE(K10:K45,3)","v":0},{"$f":"SUM(L10:L45)","v":5},{"$f":"LARGE(M10:M45,1)+LARGE(M10:M45,2)+LARGE(M10:M45,3)","v":0},{"$f":"SUM(N10:N45)","v":6},{"$f":"LARGE(O10:O45,1)+LARGE(O10:O45,2)+LARGE(O10:O45,3)","v":0},{"$f":"SUM(P10:P45)","v":5},{"$f":"LARGE(Q10:Q45,1)+LARGE(Q10:Q45,2)+LARGE(Q10:Q45,3)","v":0},{"$f":"SUM(R10:S45)","v":7}]
[null,null,"per Email an: sk-huemmling@gmx.de"]

{"sheet":"8","index":8,"n_rows":47,"n_cols":27,"rows_kept":47,"merged":[[0,22,0,23],[1,22,1,23],[4,22,4,23],[5,22,5,23],[6,22,6,23],[8,20,8,23]]}
[null,"Verein / Gruppe",null,"Ergebnisse",{"$nulls":17},"Austragungsort:",{"$f":"Übersicht!M4","v":"Neuvrees"}]
[1,{"$f":"'Wettkampf 1'!B2","v":"Börgerwald II"},null,{"$f":"G46","v":{"v":0,"d":"0.0"}},{"$f":"IF(H46>4,\"Es sind zu viele Schützen in Wertung!\",\" \")","v":"Es sind zu viele Schützen in Wertung!"},{"$nulls":16},"Wettkampftag:",{"$f":"Übersicht!M3","v":"28.01."}]
[2,{"$f":"'Wettkampf 1'!B3","v":"Neuvrees II"},null,{"$f":"I46","v":{"v":0,"d":"0.0"}},{"$f":"IF(J46>4,\"Es sind zu viele Schützen in Wertung!\",\" \")","v":"Es sind zu viele Schützen in Wertung!"}]
[3,{"$f":"'Wettkampf 1'!B4","v":"Börger III"},null,{"$f":"K46","v":{"v":0,"d":"0.0"}},{"$f":"IF(L46>4,\"Es sind zu viele Schützen in Wertung!\",\" \")","v":"Es sind zu viele Schützen in Wertung!"},{"$nulls":18},"Ansprechpartner für Rückfragen:"]
[4,{"$f":"'Wettkampf 1'!B5","v":"Börger II"},null,{"$f":"M46","v":{"v":0,"d":"0.0"}},{"$f":"IF(N46>4,\"Es sind zu viele Schützen in Wertung!\",\" \")","v":"Es sind zu viele Schützen in Wertung!"},{"$nulls":16},"Name:"]
[5,{"$f":"'Wettkampf 1'!B6","v":"Lahn IV"},null,{"$f":"O46","v":{"v":0,"d":"0.0"}},{"$f":"IF(P46>4,\"Es sind zu viele Schützen in Wertung!\",\" \")","v":"Es sind zu viele Schützen in Wertung!"},{"$nulls":16},"Tel:"]
[6,{"$f":"'Wettkampf 1'!B7","v":"Neuvrees I"},null,{"$f":"Q46","v":{"v":0,"d":"0.0"}},{"$f":"IF(R46>4,\"Es sind zu viele Schützen in Wertung!\",\" \")","v":"Es sind zu viele Schützen in Wertung!"},{"$nulls":16},"Standaufsicht:","eintragen"]
[]
[null,"Einzelergebnisse:","Verein / Gruppe","Ergebnisse (mindestens 0 eintragen)","AW? Dann x eintippen",null,"Verein 1",null,"Verein 2",null,"Verein 3",null,"Verein 4",null,"Verein 5",null,"Verein 6",{"$nulls":3},"Proberechnung bei Streifen:"]
[1,{"$f":"'Wettkampf 1'!B10","v":"Andre Hanenkamp"},{"$f":"'Wettkampf 1'!C10","v":"Börgerwald II"},null,null,{"$f":"IF(E10=\"x\",\"0\",D10)","v":{"v":0,"d":"0.0"}},{"$f":"IF(C10=$B$2,F10,0)","v":0},{"$f":"(IF(AND($E10=\"\",$C10=$B$2),1,0))","v":1},{"$f":"IF($C10=$B$3,F10,0)","v":0},{"$f":"(IF(AND($E10=\"\",$C10=$B$3),1,0))","v":0},{"$f":"IF($C10=$B$4,F10,0)","v":0},{"$f":"(IF(AND($E10=\"\",$C10=$B$4),1,0))","v":0},{"$f":"IF($C10=$B$5,F10,0)","v":0},{"$f":"(IF(AND($E10=\"\",$C10=$B$5),1,0))","v":0},{"$f":"IF($C10=$B$6,F10,0)","v":0},{"$f":"(IF(AND($E10=\"\",$C10=$B$6),1,0))","v":0},{"$f":"IF($C10=$B$7,F10,0)","v":0},{"$f":"(IF(AND($E10=\"\",$C10=$B$7),1,0))","v":0},{"$nulls":5},{"$f":"U10+V10+W10","v":{"v":0,"d":"0.0"}},{"$f":"IF(X10=D10,1,0)","v":1},{"$f":"IF(X10=0,0,1)","v":0},{"$f":"IF(Y10+Z10=2,\"Korrekt\",\"\")","v":""}]
[2,{"$f":"'Wettkampf 1'!B11","v":"Horst Sabel"},{"$f":"'Wettkampf 1'!C11","v":"Börgerwald II"},null,null,{"$f":"IF(E11=\"x\",\"0\",D11)","v":{"v":0,"d":"0.0"}},{"$f":"IF(C11=$B$2,F11,0)","v":0},{"$f":"(IF(AND($E11=\"\",$C11=$B$2),1,0))","v":1},{"$f":"IF($C11=$B$3,F11,0)","v":0},{"$f":"(IF(AND($E11=\"\",$C11=$B$3),1,0))","v":0},{"$f":"IF($C11=$B$4,F11,0)","v":0},{"$f":"(IF(AND($E11=\"\",$C11=$B$4),1,0))","v":0},{"$f":"IF($C11=$B$5,F11,0)","v":0},{"$f":"(IF(AND($E11=\"\",$C11=$B$5),1,0))","v":0},{"$f":"IF($C11=$B$6,F11,0)","v":0},{"$f":"(IF(AND($E11=\"\",$C11=$B$6),1,0))","v":0},{"$f":"IF($C11=$B$7,F11,0)","v":0},{"$f":"(IF(AND($E11=\"\",$C11=$B$7),1,0))","v":0},{"$nulls":5},{"$f":"U11+V11+W11","v":{"v":0,"d":"0.0"}},{"$f":"IF(X11=D11,1,0)","v":1},{"$f":"IF(X11=0,0,1)","v":0},{"$f":"IF(Y11+Z11=2,\"Korrekt\",\"\")","v":""}]
[3,{"$f":"'Wettkampf 1'!B12","v":"Christian Robben"},{"$f":"'Wettkampf 1'!C12","v":"Börgerwald II"},null,null,{"v":0,"d":"0.0"},0,1,0,0,0,0,0,0,0,0,0,0,{"$nulls":5},{"v":0,"d":"0.0"},1,0,""]
[4,{"$f":"'Wettkampf 1'!B13","v":"Mathis Antons"},{"$f":"'Wettkampf 1'!C13","v":"Börgerwald II"},null,null,{"v":0,"d":"0.0"},0,1,0,0,0,0,0,0,0,0,0,0,{"$nulls":5},{"v":0,"d":"0.0"},1,0,""]
[5,{"$f":"'Wettkampf 1'!B14","v":"Tobias Sebers"},{"$f":"'Wettkampf 1'!C14","v":"Börgerwald II"},null,null,{"v":0,"d":"0.0"},0,1,0,0,0,0,0,0,0,0,0,0,{"$nulls":5},{"v":0,"d":"0.0"},1,0,""]
[6,{"$f":"'Wettkampf 1'!B15","v":"Friedhelm Schroer"},{"$f":"'Wettkampf 1'!C15","v":"Börgerwald II"},null,null,{"v":0,"d":"0.0"},0,1,0,0,0,0,0,0,0,0,0,0,{"$nulls":5},{"v":0,"d":"0.0"},1,0,""]
[7,{"$f":"'Wettkampf 1'!B16","v":"Toni Stahl"},{"$f":"'Wettkampf 1'!C16","v":"Börgerwald II"},null,null,{"v":0,"d":"0.0"},0,1,0,0,0,0,0,0,0,0,0,0,{"$nulls":5},{"v":0,"d":"0.0"},1,0,""]
[8,{"$f":"'Wettkampf 1'!B17","v":"Martin Hinrichs"},{"$f":"'Wettkampf 1'!C17","v":"Börgerwald II"},null,null,{"v":0,"d":"0.0"},0,1,0,0,0,0,0,0,0,0,0,0,{"$nulls":5},{"v":0,"d":"0.0"},1,0,""]
[9,{"$f":"'Wettkampf 1'!B18","v":"Dirk Thunert"},{"$f":"'Wettkampf 1'!C18","v":"Neuvrees II"},null,null,{"v":0,"d":"0.0"},0,0,0,1,0,0,0,0,0,0,0,0,{"$nulls":5},{"v":0,"d":"0.0"},1,0,""]
[10,{"$f":"'Wettkampf 1'!B19","v":"Hans Preuth"},{"$f":"'Wettkampf 1'!C19","v":"Neuvrees II"},null,null,{"v":0,"d":"0.0"},0,0,0,1,0,0,0,0,0,0,0,0,{"$nulls":5},{"v":0,"d":"0.0"},1,0,""]
[11,{"$f":"'Wettkampf 1'!B20","v":"Karl-Heinz Schrand"},{"$f":"'Wettkampf 1'!C20","v":"Neuvrees II"},null,null,{"v":0,"d":"0.0"},0,0,0,1,0,0,0,0,0,0,0,0,{"$nulls":5},{"v":0,"d":"0.0"},1,0,""]
[12,{"$f":"'Wettkampf 1'!B21","v":"Holger Szczepanski"},{"$f":"'Wettkampf 1'!C21","v":"Neuvrees II"},null,null,{"v":0,"d":"0.0"},0,0,0,1,0,0,0,0,0,0,0,0,{"$nulls":5},{"v":0,"d":"0.0"},1,0,""]
[13,{"$f":"'Wettkampf 1'!B22","v":"Bernd Witting"},{"$f":"'Wettkampf 1'!C22","v":"Neuvrees II"},null,null,{"v":0,"d":"0.0"},0,0,0,1,0,0,0,0,0,0,0,0,{"$nulls":5},{"v":0,"d":"0.0"},1,0,""]
[14,{"$f":"'Wettkampf 1'!B23","v":"Hermann Schwarte"},{"$f":"'Wettkampf 1'!C23","v":"Börger II"},null,null,{"v":0,"d":"0.0"},0,0,0,0,0,0,0,1,0,0,0,0,{"$nulls":5},{"v":0,"d":"0.0"},1,0,""]
[15,{"$f":"'Wettkampf 1'!B24","v":"Bernd Rode"},{"$f":"'Wettkampf 1'!C24","v":"Börger III"},null,null,{"v":0,"d":"0.0"},0,0,0,0,0,1,0,0,0,0,0,0,{"$nulls":5},{"v":0,"d":"0.0"},1,0,""]
[16,{"$f":"'Wettkampf 1'!B25","v":"Daniel Sebers"},{"$f":"'Wettkampf 1'!C25","v":"Börger III"},null,null,{"v":0,"d":"0.0"},0,0,0,0,0,1,0,0,0,0,0,0,{"$nulls":5},{"v":0,"d":"0.0"},1,0,""]
[17,{"$f":"'Wettkampf 1'!B26","v":"Simon Schutenbrock"},{"$f":"'Wettkampf 1'!C26","v":"Börger III"},null,null,{"v":0,"d":"0.0"},0,0,0,0,0,1,0,0,0,0,0,0,{"$nulls":5},{"v":0,"d":"0.0"},1,0,""]
[18,{"$f":"'Wettkampf 1'!B27","v":"Jürgen Schroer"},{"$f":"'Wettkampf 1'!C27","v":"Börger III"},null,null,{"v":0,"d":"0.0"},0,0,0,0,0,1,0,0,0,0,0,0,{"$nulls":5},{"v":0,"d":"0.0"},1,0,""]
[19,{"$f":"'Wettkampf 1'!B28","v":"Marc Eckmann"},{"$f":"'Wettkampf 1'!C28","v":"Börger II"},null,null,{"v":0,"d":"0.0"},0,0,0,0,0,0,0,1,0,0,0,0,{"$nulls":5},{"v":0,"d":"0.0"},1,0,""]
[20,{"$f":"'Wettkampf 1'!B29","v":"Markus Jungsthöfel"},{"$f":"'Wettkampf 1'!C29","v":"Börger II"},null,null,{"v":0,"d":"0.0"},0,0,0,0,0,0,0,1,0,0,0,0,{"$nulls":5},{"v":0,"d":"0.0"},1,0,""]
[21,{"$f":"'Wettkampf 1'!B30","v":"Jens Henzen"},{"$f":"'Wettkampf 1'!C30","v":"Börger III"},null,null,{"v":0,"d":"0.0"},0,0,0,0,0,1,0,0,0,0,0,0,{"$nulls":5},{"v":0,"d":"0.0"},1,0,""]
[22,{"$f":"'Wettkampf 1'!B31","v":"Uwe Goldenstein"},{"$f":"'Wettkampf 1'!C31","v":"Börger II"},null,null,{"v":0,"d":"0.0"},0,0,0,0,0,0,0,1,0,0,0,0,{"$nulls":5},{"v":0,"d":"0.0"},1,0,""]
[23,{"$f":"'Wettkampf 1'!B32","v":"Ingo Zdralik"},{"$f":"'Wettkampf 1'!C32","v":"Börger II"},null,null,{"v":0,"d":"0.0"},0,0,0,0,0,0,0,1,0,0,0,0,{"$nulls":5},{"v":0,"d":"0.0"},1,0,""]
[24,{"$f":"'Wettkampf 1'!B33","v":"Schütze 24"},{"$f":"'Wettkampf 1'!C33","v":"Börger II"},null,null,{"v":0,"d":"0.0"},0,0,0,0,0,0,0,1,0,0,0,0,{"$nulls":5},{"v":0,"d":"0.0"},1,0,""]
[25,{"$f":"'Wettkampf 1'!B34","v":"Oliver Reinelt"},{"$f":"'Wettkampf 1'!C34","v":"Lahn IV"},null,null,{"v":0,"d":"0.0"},0,0,0,0,0,0,0,0,0,1,0,0,{"$nulls":5},{"v":0,"d":"0.0"},1,0,""]
[26,{"$f":"'Wettkampf 1'!B35","v":"Vitalij Schmidt"},{"$f":"'Wettkampf 1'!C35","v":"Lahn IV"},null,null,{"v":0,"d":"0.0"},0,0,0,0,0,0,0,0,0,1,0,0,{"$nulls":5},{"v":0,"d":"0.0"},1,0,""]
[27,{"$f":"'Wettkampf 1'!B36","v":"Hermann Benten"},{"$f":"'Wettkampf 1'!C36","v":"Lahn IV"},null,null,{"v":0,"d":"0.0"},0,0,0,0,0,0,0,0,0,1,0,0,{"$nulls":5},{"v":0,"d":"0.0"},1,0,""]
[28,{"$f":"'Wettkampf 1'!B37","v":"Johannes Thesing"},{"$f":"'Wettkampf 1'!C37","v":"Lahn IV"},null,null,{"v":0,"d":"0.0"},0,0,0,0,0,0,0,0,0,1,0,0,{"$nulls":5},{"v":0,"d":"0.0"},1,0,""]
[29,{"$f":"'Wettkampf 1'!B38","v":"Schütze 29"},{"$f":"'Wettkampf 1'!C38","v":"Lahn IV"},null,null,{"v":0,"d":"0.0"},0,0,0,0,0,0,0,0,0,1,0,0,{"$nulls":5},{"v":0,"d":"0.0"},1,0,""]
[30,{"$f":"'Wettkampf 1'!B39","v":"Willi Rolfes"},{"$f":"'Wettkampf 1'!C39","v":"Neuvrees I"},null,null,{"v":0,"d":"0.0"},0,0,0,0,0,0,0,0,0,0,0,1,{"$nulls":5},{"v":0,"d":"0.0"},1,0,""]
[31,{"$f":"'Wettkampf 1'!B40","v":"Werner Thyen"},{"$f":"'Wettkampf 1'!C40","v":"Neuvrees I"},null,null,{"v":0,"d":"0.0"},0,0,0,0,0,0,0,0,0,0,0,1,{"$nulls":5},{"v":0,"d":"0.0"},1,0,""]
[32,{"$f":"'Wettkampf 1'!B41","v":"Wilfried Breyer"},{"$f":"'Wettkampf 1'!C41","v":"Neuvrees I"},null,null,{"v":0,"d":"0.0"},0,0,0,0,0,0,0,0,0,0,0,1,{"$nulls":5},{"v":0,"d":"0.0"},1,0,""]
[33,{"$f":"'Wettkampf 1'!B42","v":"Klaus Steenken"},{"$f":"'Wettkampf 1'!C42","v":"Neuvrees I"},null,null,{"v":0,"d":"0.0"},0,0,0,0,0,0,0,0,0,0,0,1,{"$nulls":5},{"v":0,"d":"0.0"},1,0,""]
[34,{"$f":"'Wettkampf 1'!B43","v":"Markus Janßen"},{"$f":"'Wettkampf 1'!C43","v":"Neuvrees I"},null,null,{"v":0,"d":"0.0"},0,0,0,0,0,0,0,0,0,0,0,1,{"$nulls":5},{"v":0,"d":"0.0"},1,0,""]
[35,{"$f":"'Wettkampf 1'!B44","v":"Carsten Peters"},{"$f":"'Wettkampf 1'!C44","v":"Neuvrees I"},null,null,{"v":0,"d":"0.0"},0,0,0,0,0,0,0,0,0,0,0,1,{"$nulls":5},{"v":0,"d":"0.0"},1,0,""]
[36,{"$f":"'Wettkampf 1'!B45","v":"Dietmar Spekker"},{"$f":"'Wettkampf 1'!C45","v":"Neuvrees I"},null,null,{"v":0,"d":"0.0"},0,0,0,0,0,0,0,0,0,0,0,1,{"$nulls":5},{"v":0,"d":"0.0"},1,0,""]
[{"$nulls":6},{"$f":"LARGE(G10:G45,1)+LARGE(G10:G45,2)+LARGE(G10:G45,3)","v":0},{"$f":"SUM(H10:H45)","v":8},{"$f":"LARGE(I10:I45,1)+LARGE(I10:I45,2)+LARGE(I10:I45,3)","v":0},{"$f":"SUM(J10:J45)","v":5},{"$f":"LARGE(K10:K45,1)+LARGE(K10:K45,2)+LARGE(K10:K45,3)","v":0},{"$f":"SUM(L10:L45)","v":5},{"$f":"LARGE(M10:M45,1)+LARGE(M10:M45,2)+LARGE(M10:M45,3)","v":0},{"$f":"SUM(N10:N45)","v":6},{"$f":"LARGE(O10:O45,1)+LARGE(O10:O45,2)+LARGE(O10:O45,3)","v":0},{"$f":"SUM(P10:P45)","v":5},{"$f":"LARGE(Q10:Q45,1)+LARGE(Q10:Q45,2)+LARGE(Q10:Q45,3)","v":0},{"$f":"SUM(R10:S45)","v":7}]
[null,null,"per Email an: sk-huemmling@gmx.de"]

{"sheet":"9","index":9,"n_rows":47,"n_cols":27,"rows_kept":47,"merged":[[0,22,0,23],[1,22,1,23],[4,22,4,23],[5,22,5,23],[6,22,6,23],[8,20,8,23]]}
[null,"Verein / Gruppe",null,"Ergebnisse",{"$nulls":17},"Austragungsort:",{"$f":"Übersicht!N4","v":"Börger"}]
[1,{"$f":"'Wettkampf 1'!B2","v":"Börgerwald II"},null,{"$f":"G46","v":{"v":0,"d":"0.0"}},{"$f":"IF(H46>4,\"Es sind zu viele Schützen in Wertung!\",\" \")","v":"Es sind zu viele Schützen in Wertung!"},{"$nulls":16},"Wettkampftag:",{"$f":"Übersicht!N3","v":"11.02."}]
[2,{"$f":"'Wettkampf 1'!B3","v":"Neuvrees II"},null,{"$f":"I46","v":{"v":0,"d":"0.0"}},{"$f":"IF(J46>4,\"Es sind zu viele Schützen in Wertung!\",\" \")","v":"Es sind zu viele Schützen in Wertung!"}]
[3,{"$f":"'Wettkampf 1'!B4","v":"Börger III"},null,{"$f":"K46","v":{"v":0,"d":"0.0"}},{"$f":"IF(L46>4,\"Es sind zu viele Schützen in Wertung!\",\" \")","v":"Es sind zu viele Schützen in Wertung!"},{"$nulls":18},"Ansprechpartner für Rückfragen:"]
[4,{"$f":"'Wettkampf 1'!B5","v":"Börger II"},null,{"$f":"M46","v":{"v":0,"d":"0.0"}},{"$f":"IF(N46>4,\"Es sind zu viele Schützen in Wertung!\",\" \")","v":"Es sind zu viele Schützen in Wertung!"},{"$nulls":16},"Name:"]
[5,{"$f":"'Wettkampf 1'!B6","v":"Lahn IV"},null,{"$f":"O46","v":{"v":0,"d":"0.0"}},{"$f":"IF(P46>4,\"Es sind zu viele Schützen in Wertung!\",\" \")","v":"Es sind zu viele Schützen in Wertung!"},{"$nulls":16},"Tel:"]
[6,{"$f":"'Wettkampf 1'!B7","v":"Neuvrees I"},null,{"$f":"Q46","v":{"v":0,"d":"0.0"}},{"$f":"IF(R46>4,\"Es sind zu viele Schützen in Wertung!\",\" \")","v":"Es sind zu viele Schützen in Wertung!"},{"$nulls":16},"Standaufsicht:","eintragen"]
[]
[null,"Einzelergebnisse:","Verein / Gruppe","Ergebnisse (mindestens 0 eintragen)","AW? Dann x eintippen",null,"Verein 1",null,"Verein 2",null,"Verein 3",null,"Verein 4",null,"Verein 5",null,"Verein 6",{"$nulls":3},"Proberechnung bei Streifen:"]
[1,{"$f":"'Wettkampf 1'!B10","v":"Andre Hanenkamp"},{"$f":"'Wettkampf 1'!C10","v":"Börgerwald II"},null,null,{"$f":"IF(E10=\"x\",\"0\",D10)","v":{"v":0,"d":"0.0"}},{"$f":"IF(C10=$B$2,F10,0)","v":0},{"$f":"(IF(AND($E10=\"\",$C10=$B$2),1,0))","v":1},{"$f":"IF($C10=$B$3,F10,0)","v":0},{"$f":"(IF(AND($E10=\"\",$C10=$B$3),1,0))","v":0},{"$f":"IF($C10=$B$4,F10,0)","v":0},{"$f":"(IF(AND($E10=\"\",$C10=$B$4),1,0))","v":0},{"$f":"IF($C10=$B$5,F10,0)","v":0},{"$f":"(IF(AND($E10=\"\",$C10=$B$5),1,0))","v":0},{"$f":"IF($C10=$B$6,F10,0)","v":0},{"$f":"(IF(AND($E10=\"\",$C10=$B$6),1,0))","v":0},{"$f":"IF($C10=$B$7,F10,0)","v":0},{"$f":"(IF(AND($E10=\"\",$C10=$B$7),1,0))","v":0},{"$nulls":5},{"$f":"U10+V10+W10","v":{"v":0,"d":"0.0"}},{"$f":"IF(X10=D10,1,0)","v":1},{"$f":"IF(X10=0,0,1)","v":0},{"$f":"IF(Y10+Z10=2,\"Korrekt\",\"\")","v":""}]
[2,{"$f":"'Wettkampf 1'!B11","v":"Horst Sabel"},{"$f":"'Wettkampf 1'!C11","v":"Börgerwald II"},null,null,{"$f":"IF(E11=\"x\",\"0\",D11)","v":{"v":0,"d":"0.0"}},{"$f":"IF(C11=$B$2,F11,0)","v":0},{"$f":"(IF(AND($E11=\"\",$C11=$B$2),1,0))","v":1},{"$f":"IF($C11=$B$3,F11,0)","v":0},{"$f":"(IF(AND($E11=\"\",$C11=$B$3),1,0))","v":0},{"$f":"IF($C11=$B$4,F11,0)","v":0},{"$f":"(IF(AND($E11=\"\",$C11=$B$4),1,0))","v":0},{"$f":"IF($C11=$B$5,F11,0)","v":0},{"$f":"(IF(AND($E11=\"\",$C11=$B$5),1,0))","v":0},{"$f":"IF($C11=$B$6,F11,0)","v":0},{"$f":"(IF(AND($E11=\"\",$C11=$B$6),1,0))","v":0},{"$f":"IF($C11=$B$7,F11,0)","v":0},{"$f":"(IF(AND($E11=\"\",$C11=$B$7),1,0))","v":0},{"$nulls":5},{"$f":"U11+V11+W11","v":{"v":0,"d":"0.0"}},{"$f":"IF(X11=D11,1,0)","v":1},{"$f":"IF(X11=0,0,1)","v":0},{"$f":"IF(Y11+Z11=2,\"Korrekt\",\"\")","v":""}]
[3,{"$f":"'Wettkampf 1'!B12","v":"Christian Robben"},{"$f":"'Wettkampf 1'!C12","v":"Börgerwald II"},null,null,{"v":0,"d":"0.0"},0,1,0,0,0,0,0,0,0,0,0,0,{"$nulls":5},{"v":0,"d":"0.0"},1,0,""]
[4,{"$f":"'Wettkampf 1'!B13","v":"Mathis Antons"},{"$f":"'Wettkampf 1'!C13","v":"Börgerwald II"},null,null,{"v":0,"d":"0.0"},0,1,0,0,0,0,0,0,0,0,0,0,{"$nulls":5},{"v":0,"d":"0.0"},1,0,""]
[5,{"$f":"'Wettkampf 1'!B14","v":"Tobias Sebers"},{"$f":"'Wettkampf 1'!C14","v":"Börgerwald II"},null,null,{"v":0,"d":"0.0"},0,1,0,0,0,0,0,0,0,0,0,0,{"$nulls":5},{"v":0,"d":"0.0"},1,0,""]
[6,{"$f":"'Wettkampf 1'!B15","v":"Friedhelm Schroer"},{"$f":"'Wettkampf 1'!C15","v":"Börgerwald II"},null,null,{"v":0,"d":"0.0"},0,1,0,0,0,0,0,0,0,0,0,0,{"$nulls":5},{"v":0,"d":"0.0"},1,0,""]
[7,{"$f":"'Wettkampf 1'!B16","v":"Toni Stahl"},{"$f":"'Wettkampf 1'!C16","v":"Börgerwald II"},null,null,{"v":0,"d":"0.0"},0,1,0,0,0,0,0,0,0,0,0,0,{"$nulls":5},{"v":0,"d":"0.0"},1,0,""]
[8,{"$f":"'Wettkampf 1'!B17","v":"Martin Hinrichs"},{"$f":"'Wettkampf 1'!C17","v":"Börgerwald II"},null,null,{"v":0,"d":"0.0"},0,1,0,0,0,0,0,0,0,0,0,0,{"$nulls":5},{"v":0,"d":"0.0"},1,0,""]
[9,{"$f":"'Wettkampf 1'!B18","v":"Dirk Thunert"},{"$f":"'Wettkampf 1'!C18","v":"Neuvrees II"},null,null,{"v":0,"d":"0.0"},0,0,0,1,0,0,0,0,0,0,0,0,{"$nulls":5},{"v":0,"d":"0.0"},1,0,""]
[10,{"$f":"'Wettkampf 1'!B19","v":"Hans Preuth"},{"$f":"'Wettkampf 1'!C19","v":"Neuvrees II"},null,null,{"v":0,"d":"0.0"},0,0,0,1,0,0,0,0,0,0,0,0,{"$nulls":5},{"v":0,"d":"0.0"},1,0,""]
[11,{"$f":"'Wettkampf 1'!B20","v":"Karl-Heinz Schrand"},{"$f":"'Wettkampf 1'!C20","v":"Neuvrees II"},null,null,{"v":0,"d":"0.0"},0,0,0,1,0,0,0,0,0,0,0,0,{"$nulls":5},{"v":0,"d":"0.0"},1,0,""]
[12,{"$f":"'Wettkampf 1'!B21","v":"Holger Szczepanski"},{"$f":"'Wettkampf 1'!C21","v":"Neuvrees II"},null,null,{"v":0,"d":"0.0"},0,0,0,1,0,0,0,0,0,0,0,0,{"$nulls":5},{"v":0,"d":"0.0"},1,0,""]
[13,{"$f":"'Wettkampf 1'!B22","v":"Bernd Witting"},{"$f":"'Wettkampf 1'!C22","v":"Neuvrees II"},null,null,{"v":0,"d":"0.0"},0,0,0,1,0,0,0,0,0,0,0,0,{"$nulls":5},{"v":0,"d":"0.0"},1,0,""]
[14,{"$f":"'Wettkampf 1'!B23","v":"Hermann Schwarte"},{"$f":"'Wettkampf 1'!C23","v":"Börger II"},null,null,{"v":0,"d":"0.0"},0,0,0,0,0,0,0,1,0,0,0,0,{"$nulls":5},{"v":0,"d":"0.0"},1,0,""]
[15,{"$f":"'Wettkampf 1'!B24","v":"Bernd Rode"},{"$f":"'Wettkampf 1'!C24","v":"Börger III"},null,null,{"v":0,"d":"0.0"},0,0,0,0,0,1,0,0,0,0,0,0,{"$nulls":5},{"v":0,"d":"0.0"},1,0,""]
[16,{"$f":"'Wettkampf 1'!B25","v":"Daniel Sebers"},{"$f":"'Wettkampf 1'!C25","v":"Börger III"},null,null,{"v":0,"d":"0.0"},0,0,0,0,0,1,0,0,0,0,0,0,{"$nulls":5},{"v":0,"d":"0.0"},1,0,""]
[17,{"$f":"'Wettkampf 1'!B26","v":"Simon Schutenbrock"},{"$f":"'Wettkampf 1'!C26","v":"Börger III"},null,null,{"v":0,"d":"0.0"},0,0,0,0,0,1,0,0,0,0,0,0,{"$nulls":5},{"v":0,"d":"0.0"},1,0,""]
[18,{"$f":"'Wettkampf 1'!B27","v":"Jürgen Schroer"},{"$f":"'Wettkampf 1'!C27","v":"Börger III"},null,null,{"v":0,"d":"0.0"},0,0,0,0,0,1,0,0,0,0,0,0,{"$nulls":5},{"v":0,"d":"0.0"},1,0,""]
[19,{"$f":"'Wettkampf 1'!B28","v":"Marc Eckmann"},{"$f":"'Wettkampf 1'!C28","v":"Börger II"},null,null,{"v":0,"d":"0.0"},0,0,0,0,0,0,0,1,0,0,0,0,{"$nulls":5},{"v":0,"d":"0.0"},1,0,""]
[20,{"$f":"'Wettkampf 1'!B29","v":"Markus Jungsthöfel"},{"$f":"'Wettkampf 1'!C29","v":"Börger II"},null,null,{"v":0,"d":"0.0"},0,0,0,0,0,0,0,1,0,0,0,0,{"$nulls":5},{"v":0,"d":"0.0"},1,0,""]
[21,{"$f":"'Wettkampf 1'!B30","v":"Jens Henzen"},{"$f":"'Wettkampf 1'!C30","v":"Börger III"},null,null,{"v":0,"d":"0.0"},0,0,0,0,0,1,0,0,0,0,0,0,{"$nulls":5},{"v":0,"d":"0.0"},1,0,""]
[22,{"$f":"'Wettkampf 1'!B31","v":"Uwe Goldenstein"},{"$f":"'Wettkampf 1'!C31","v":"Börger II"},null,null,{"v":0,"d":"0.0"},0,0,0,0,0,0,0,1,0,0,0,0,{"$nulls":5},{"v":0,"d":"0.0"},1,0,""]
[23,{"$f":"'Wettkampf 1'!B32","v":"Ingo Zdralik"},{"$f":"'Wettkampf 1'!C32","v":"Börger II"},null,null,{"v":0,"d":"0.0"},0,0,0,0,0,0,0,1,0,0,0,0,{"$nulls":5},{"v":0,"d":"0.0"},1,0,""]
[24,{"$f":"'Wettkampf 1'!B33","v":"Schütze 24"},{"$f":"'Wettkampf 1'!C33","v":"Börger II"},null,null,{"v":0,"d":"0.0"},0,0,0,0,0,0,0,1,0,0,0,0,{"$nulls":5},{"v":0,"d":"0.0"},1,0,""]
[25,{"$f":"'Wettkampf 1'!B34","v":"Oliver Reinelt"},{"$f":"'Wettkampf 1'!C34","v":"Lahn IV"},null,null,{"v":0,"d":"0.0"},0,0,0,0,0,0,0,0,0,1,0,0,{"$nulls":5},{"v":0,"d":"0.0"},1,0,""]
[26,{"$f":"'Wettkampf 1'!B35","v":"Vitalij Schmidt"},{"$f":"'Wettkampf 1'!C35","v":"Lahn IV"},null,null,{"v":0,"d":"0.0"},0,0,0,0,0,0,0,0,0,1,0,0,{"$nulls":5},{"v":0,"d":"0.0"},1,0,""]
[27,{"$f":"'Wettkampf 1'!B36","v":"Hermann Benten"},{"$f":"'Wettkampf 1'!C36","v":"Lahn IV"},null,null,{"v":0,"d":"0.0"},0,0,0,0,0,0,0,0,0,1,0,0,{"$nulls":5},{"v":0,"d":"0.0"},1,0,""]
[28,{"$f":"'Wettkampf 1'!B37","v":"Johannes Thesing"},{"$f":"'Wettkampf 1'!C37","v":"Lahn IV"},null,null,{"v":0,"d":"0.0"},0,0,0,0,0,0,0,0,0,1,0,0,{"$nulls":5},{"v":0,"d":"0.0"},1,0,""]
[29,{"$f":"'Wettkampf 1'!B38","v":"Schütze 29"},{"$f":"'Wettkampf 1'!C38","v":"Lahn IV"},null,null,{"v":0,"d":"0.0"},0,0,0,0,0,0,0,0,0,1,0,0,{"$nulls":5},{"v":0,"d":"0.0"},1,0,""]
[30,{"$f":"'Wettkampf 1'!B39","v":"Willi Rolfes"},{"$f":"'Wettkampf 1'!C39","v":"Neuvrees I"},null,null,{"v":0,"d":"0.0"},0,0,0,0,0,0,0,0,0,0,0,1,{"$nulls":5},{"v":0,"d":"0.0"},1,0,""]
[31,{"$f":"'Wettkampf 1'!B40","v":"Werner Thyen"},{"$f":"'Wettkampf 1'!C40","v":"Neuvrees I"},null,null,{"v":0,"d":"0.0"},0,0,0,0,0,0,0,0,0,0,0,1,{"$nulls":5},{"v":0,"d":"0.0"},1,0,""]
[32,{"$f":"'Wettkampf 1'!B41","v":"Wilfried Breyer"},{"$f":"'Wettkampf 1'!C41","v":"Neuvrees I"},null,null,{"v":0,"d":"0.0"},0,0,0,0,0,0,0,0,0,0,0,1,{"$nulls":5},{"v":0,"d":"0.0"},1,0,""]
[33,{"$f":"'Wettkampf 1'!B42","v":"Klaus Steenken"},{"$f":"'Wettkampf 1'!C42","v":"Neuvrees I"},null,null,{"v":0,"d":"0.0"},0,0,0,0,0,0,0,0,0,0,0,1,{"$nulls":5},{"v":0,"d":"0.0"},1,0,""]
[34,{"$f":"'Wettkampf 1'!B43","v":"Markus Janßen"},{"$f":"'Wettkampf 1'!C43","v":"Neuvrees I"},null,null,{"v":0,"d":"0.0"},0,0,0,0,0,0,0,0,0,0,0,1,{"$nulls":5},{"v":0,"d":"0.0"},1,0,""]
[35,{"$f":"'Wettkampf 1'!B44","v":"Carsten Peters"},{"$f":"'Wettkampf 1'!C44","v":"Neuvrees I"},null,null,{"v":0,"d":"0.0"},0,0,0,0,0,0,0,0,0,0,0,1,{"$nulls":5},{"v":0,"d":"0.0"},1,0,""]
[36,{"$f":"'Wettkampf 1'!B45","v":"Dietmar Spekker"},{"$f":"'Wettkampf 1'!C45","v":"Neuvrees I"},null,null,{"v":0,"d":"0.0"},0,0,0,0,0,0,0,0,0,0,0,1,{"$nulls":5},{"v":0,"d":"0.0"},1,0,""]
[{"$nulls":6},{"$f":"LARGE(G10:G45,1)+LARGE(G10:G45,2)+LARGE(G10:G45,3)","v":0},{"$f":"SUM(H10:H45)","v":8},{"$f":"LARGE(I10:I45,1)+LARGE(I10:I45,2)+LARGE(I10:I45,3)","v":0},{"$f":"SUM(J10:J45)","v":5},{"$f":"LARGE(K10:K45,1)+LARGE(K10:K45,2)+LARGE(K10:K45,3)","v":0},{"$f":"SUM(L10:L45)","v":5},{"$f":"LARGE(M10:M45,1)+LARGE(M10:M45,2)+LARGE(M10:M45,3)","v":0},{"$f":"SUM(N10:N45)","v":6},{"$f":"LARGE(O10:O45,1)+LARGE(O10:O45,2)+LARGE(O10:O45,3)","v":0},{"$f":"SUM(P10:P45)","v":5},{"$f":"LARGE(Q10:Q45,1)+LARGE(Q10:Q45,2)+LARGE(Q10:Q45,3)","v":0},{"$f":"SUM(R10:S45)","v":7}]
[null,null,"per Email an: sk-huemmling@gmx.de"]

{"sheet":"10","index":10,"n_rows":47,"n_cols":27,"rows_kept":47,"merged":[[0,22,0,23],[1,22,1,23],[4,22,4,23],[5,22,5,23],[6,22,6,23],[8,20,8,23]]}
[null,"Verein / Gruppe",null,"Ergebnisse",{"$nulls":17},"Austragungsort:",{"$f":"Übersicht!O4","v":"Börger"}]
[1,{"$f":"'Wettkampf 1'!B2","v":"Börgerwald II"},null,{"$f":"G46","v":{"v":0,"d":"0.0"}},{"$f":"IF(H46>4,\"Es sind zu viele Schützen in Wertung!\",\" \")","v":"Es sind zu viele Schützen in Wertung!"},{"$nulls":16},"Wettkampftag:",{"$f":"Übersicht!O3","v":"25.02."}]
[2,{"$f":"'Wettkampf 1'!B3","v":"Neuvrees II"},null,{"$f":"I46","v":{"v":0,"d":"0.0"}},{"$f":"IF(J46>4,\"Es sind zu viele Schützen in Wertung!\",\" \")","v":"Es sind zu viele Schützen in Wertung!"}]
[3,{"$f":"'Wettkampf 1'!B4","v":"Börger III"},null,{"$f":"K46","v":{"v":0,"d":"0.0"}},{"$f":"IF(L46>4,\"Es sind zu viele Schützen in Wertung!\",\" \")","v":"Es sind zu viele Schützen in Wertung!"},{"$nulls":18},"Ansprechpartner für Rückfragen:"]
[4,{"$f":"'Wettkampf 1'!B5","v":"Börger II"},null,{"$f":"M46","v":{"v":0,"d":"0.0"}},{"$f":"IF(N46>4,\"Es sind zu viele Schützen in Wertung!\",\" \")","v":"Es sind zu viele Schützen in Wertung!"},{"$nulls":16},"Name:"]
[5,{"$f":"'Wettkampf 1'!B6","v":"Lahn IV"},null,{"$f":"O46","v":{"v":0,"d":"0.0"}},{"$f":"IF(P46>4,\"Es sind zu viele Schützen in Wertung!\",\" \")","v":"Es sind zu viele Schützen in Wertung!"},{"$nulls":16},"Tel:"]
[6,{"$f":"'Wettkampf 1'!B7","v":"Neuvrees I"},null,{"$f":"Q46","v":{"v":0,"d":"0.0"}},{"$f":"IF(R46>4,\"Es sind zu viele Schützen in Wertung!\",\" \")","v":"Es sind zu viele Schützen in Wertung!"},{"$nulls":16},"Standaufsicht:","eintragen"]
[]
[null,"Einzelergebnisse:","Verein / Gruppe","Ergebnisse (mindestens 0 eintragen)","AW? Dann x eintippen",null,"Verein 1",null,"Verein 2",null,"Verein 3",null,"Verein 4",null,"Verein 5",null,"Verein 6",{"$nulls":3},"Proberechnung bei Streifen:"]
[1,{"$f":"'Wettkampf 1'!B10","v":"Andre Hanenkamp"},{"$f":"'Wettkampf 1'!C10","v":"Börgerwald II"},null,null,{"$f":"IF(E10=\"x\",\"0\",D10)","v":{"v":0,"d":"0.0"}},{"$f":"IF(C10=$B$2,F10,0)","v":0},{"$f":"(IF(AND($E10=\"\",$C10=$B$2),1,0))","v":1},{"$f":"IF($C10=$B$3,F10,0)","v":0},{"$f":"(IF(AND($E10=\"\",$C10=$B$3),1,0))","v":0},{"$f":"IF($C10=$B$4,F10,0)","v":0},{"$f":"(IF(AND($E10=\"\",$C10=$B$4),1,0))","v":0},{"$f":"IF($C10=$B$5,F10,0)","v":0},{"$f":"(IF(AND($E10=\"\",$C10=$B$5),1,0))","v":0},{"$f":"IF($C10=$B$6,F10,0)","v":0},{"$f":"(IF(AND($E10=\"\",$C10=$B$6),1,0))","v":0},{"$f":"IF($C10=$B$7,F10,0)","v":0},{"$f":"(IF(AND($E10=\"\",$C10=$B$7),1,0))","v":0},{"$nulls":5},{"$f":"U10+V10+W10","v":{"v":0,"d":"0.0"}},{"$f":"IF(X10=D10,1,0)","v":1},{"$f":"IF(X10=0,0,1)","v":0},{"$f":"IF(Y10+Z10=2,\"Korrekt\",\"\")","v":""}]
[2,{"$f":"'Wettkampf 1'!B11","v":"Horst Sabel"},{"$f":"'Wettkampf 1'!C11","v":"Börgerwald II"},null,null,{"$f":"IF(E11=\"x\",\"0\",D11)","v":{"v":0,"d":"0.0"}},{"$f":"IF(C11=$B$2,F11,0)","v":0},{"$f":"(IF(AND($E11=\"\",$C11=$B$2),1,0))","v":1},{"$f":"IF($C11=$B$3,F11,0)","v":0},{"$f":"(IF(AND($E11=\"\",$C11=$B$3),1,0))","v":0},{"$f":"IF($C11=$B$4,F11,0)","v":0},{"$f":"(IF(AND($E11=\"\",$C11=$B$4),1,0))","v":0},{"$f":"IF($C11=$B$5,F11,0)","v":0},{"$f":"(IF(AND($E11=\"\",$C11=$B$5),1,0))","v":0},{"$f":"IF($C11=$B$6,F11,0)","v":0},{"$f":"(IF(AND($E11=\"\",$C11=$B$6),1,0))","v":0},{"$f":"IF($C11=$B$7,F11,0)","v":0},{"$f":"(IF(AND($E11=\"\",$C11=$B$7),1,0))","v":0},{"$nulls":5},{"$f":"U11+V11+W11","v":{"v":0,"d":"0.0"}},{"$f":"IF(X11=D11,1,0)","v":1},{"$f":"IF(X11=0,0,1)","v":0},{"$f":"IF(Y11+Z11=2,\"Korrekt\",\"\")","v":""}]
[3,{"$f":"'Wettkampf 1'!B12","v":"Christian Robben"},{"$f":"'Wettkampf 1'!C12","v":"Börgerwald II"},null,null,{"v":0,"d":"0.0"},0,1,0,0,0,0,0,0,0,0,0,0,{"$nulls":5},{"v":0,"d":"0.0"},1,0,""]
[4,{"$f":"'Wettkampf 1'!B13","v":"Mathis Antons"},{"$f":"'Wettkampf 1'!C13","v":"Börgerwald II"},null,null,{"v":0,"d":"0.0"},0,1,0,0,0,0,0,0,0,0,0,0,{"$nulls":5},{"v":0,"d":"0.0"},1,0,""]
[5,{"$f":"'Wettkampf 1'!B14","v":"Tobias Sebers"},{"$f":"'Wettkampf 1'!C14","v":"Börgerwald II"},null,null,{"v":0,"d":"0.0"},0,1,0,0,0,0,0,0,0,0,0,0,{"$nulls":5},{"v":0,"d":"0.0"},1,0,""]
[6,{"$f":"'Wettkampf 1'!B15","v":"Friedhelm Schroer"},{"$f":"'Wettkampf 1'!C15","v":"Börgerwald II"},null,null,{"v":0,"d":"0.0"},0,1,0,0,0,0,0,0,0,0,0,0,{"$nulls":5},{"v":0,"d":"0.0"},1,0,""]
[7,{"$f":"'Wettkampf 1'!B16","v":"Toni Stahl"},{"$f":"'Wettkampf 1'!C16","v":"Börgerwald II"},null,null,{"v":0,"d":"0.0"},0,1,0,0,0,0,0,0,0,0,0,0,{"$nulls":5},{"v":0,"d":"0.0"},1,0,""]
[8,{"$f":"'Wettkampf 1'!B17","v":"Martin Hinrichs"},{"$f":"'Wettkampf 1'!C17","v":"Börgerwald II"},null,null,{"v":0,"d":"0.0"},0,1,0,0,0,0,0,0,0,0,0,0,{"$nulls":5},{"v":0,"d":"0.0"},1,0,""]
[9,{"$f":"'Wettkampf 1'!B18","v":"Dirk Thunert"},{"$f":"'Wettkampf 1'!C18","v":"Neuvrees II"},null,null,{"v":0,"d":"0.0"},0,0,0,1,0,0,0,0,0,0,0,0,{"$nulls":5},{"v":0,"d":"0.0"},1,0,""]
[10,{"$f":"'Wettkampf 1'!B19","v":"Hans Preuth"},{"$f":"'Wettkampf 1'!C19","v":"Neuvrees II"},null,null,{"v":0,"d":"0.0"},0,0,0,1,0,0,0,0,0,0,0,0,{"$nulls":5},{"v":0,"d":"0.0"},1,0,""]
[11,{"$f":"'Wettkampf 1'!B20","v":"Karl-Heinz Schrand"},{"$f":"'Wettkampf 1'!C20","v":"Neuvrees II"},null,null,{"v":0,"d":"0.0"},0,0,0,1,0,0,0,0,0,0,0,0,{"$nulls":5},{"v":0,"d":"0.0"},1,0,""]
[12,{"$f":"'Wettkampf 1'!B21","v":"Holger Szczepanski"},{"$f":"'Wettkampf 1'!C21","v":"Neuvrees II"},null,null,{"v":0,"d":"0.0"},0,0,0,1,0,0,0,0,0,0,0,0,{"$nulls":5},{"v":0,"d":"0.0"},1,0,""]
[13,{"$f":"'Wettkampf 1'!B22","v":"Bernd Witting"},{"$f":"'Wettkampf 1'!C22","v":"Neuvrees II"},null,null,{"v":0,"d":"0.0"},0,0,0,1,0,0,0,0,0,0,0,0,{"$nulls":5},{"v":0,"d":"0.0"},1,0,""]
[14,{"$f":"'Wettkampf 1'!B23","v":"Hermann Schwarte"},{"$f":"'Wettkampf 1'!C23","v":"Börger II"},null,null,{"v":0,"d":"0.0"},0,0,0,0,0,0,0,1,0,0,0,0,{"$nulls":5},{"v":0,"d":"0.0"},1,0,""]
[15,{"$f":"'Wettkampf 1'!B24","v":"Bernd Rode"},{"$f":"'Wettkampf 1'!C24","v":"Börger III"},null,null,{"v":0,"d":"0.0"},0,0,0,0,0,1,0,0,0,0,0,0,{"$nulls":5},{"v":0,"d":"0.0"},1,0,""]
[16,{"$f":"'Wettkampf 1'!B25","v":"Daniel Sebers"},{"$f":"'Wettkampf 1'!C25","v":"Börger III"},null,null,{"v":0,"d":"0.0"},0,0,0,0,0,1,0,0,0,0,0,0,{"$nulls":5},{"v":0,"d":"0.0"},1,0,""]
[17,{"$f":"'Wettkampf 1'!B26","v":"Simon Schutenbrock"},{"$f":"'Wettkampf 1'!C26","v":"Börger III"},null,null,{"v":0,"d":"0.0"},0,0,0,0,0,1,0,0,0,0,0,0,{"$nulls":5},{"v":0,"d":"0.0"},1,0,""]
[18,{"$f":"'Wettkampf 1'!B27","v":"Jürgen Schroer"},{"$f":"'Wettkampf 1'!C27","v":"Börger III"},null,null,{"v":0,"d":"0.0"},0,0,0,0,0,1,0,0,0,0,0,0,{"$nulls":5},{"v":0,"d":"0.0"},1,0,""]
[19,{"$f":"'Wettkampf 1'!B28","v":"Marc Eckmann"},{"$f":"'Wettkampf 1'!C28","v":"Börger II"},null,null,{"v":0,"d":"0.0"},0,0,0,0,0,0,0,1,0,0,0,0,{"$nulls":5},{"v":0,"d":"0.0"},1,0,""]
[20,{"$f":"'Wettkampf 1'!B29","v":"Markus Jungsthöfel"},{"$f":"'Wettkampf 1'!C29","v":"Börger II"},null,null,{"v":0,"d":"0.0"},0,0,0,0,0,0,0,1,0,0,0,0,{"$nulls":5},{"v":0,"d":"0.0"},1,0,""]
[21,{"$f":"'Wettkampf 1'!B30","v":"Jens Henzen"},{"$f":"'Wettkampf 1'!C30","v":"Börger III"},null,null,{"v":0,"d":"0.0"},0,0,0,0,0,1,0,0,0,0,0,0,{"$nulls":5},{"v":0,"d":"0.0"},1,0,""]
[22,{"$f":"'Wettkampf 1'!B31","v":"Uwe Goldenstein"},{"$f":"'Wettkampf 1'!C31","v":"Börger II"},null,null,{"v":0,"d":"0.0"},0,0,0,0,0,0,0,1,0,0,0,0,{"$nulls":5},{"v":0,"d":"0.0"},1,0,""]
[23,{"$f":"'Wettkampf 1'!B32","v":"Ingo Zdralik"},{"$f":"'Wettkampf 1'!C32","v":"Börger II"},null,null,{"v":0,"d":"0.0"},0,0,0,0,0,0,0,1,0,0,0,0,{"$nulls":5},{"v":0,"d":"0.0"},1,0,""]
[24,{"$f":"'Wettkampf 1'!B33","v":"Schütze 24"},{"$f":"'Wettkampf 1'!C33","v":"Börger II"},null,null,{"v":0,"d":"0.0"},0,0,0,0,0,0,0,1,0,0,0,0,{"$nulls":5},{"v":0,"d":"0.0"},1,0,""]
[25,{"$f":"'Wettkampf 1'!B34","v":"Oliver Reinelt"},{"$f":"'Wettkampf 1'!C34","v":"Lahn IV"},null,null,{"v":0,"d":"0.0"},0,0,0,0,0,0,0,0,0,1,0,0,{"$nulls":5},{"v":0,"d":"0.0"},1,0,""]
[26,{"$f":"'Wettkampf 1'!B35","v":"Vitalij Schmidt"},{"$f":"'Wettkampf 1'!C35","v":"Lahn IV"},null,null,{"v":0,"d":"0.0"},0,0,0,0,0,0,0,0,0,1,0,0,{"$nulls":5},{"v":0,"d":"0.0"},1,0,""]
[27,{"$f":"'Wettkampf 1'!B36","v":"Hermann Benten"},{"$f":"'Wettkampf 1'!C36","v":"Lahn IV"},null,null,{"v":0,"d":"0.0"},0,0,0,0,0,0,0,0,0,1,0,0,{"$nulls":5},{"v":0,"d":"0.0"},1,0,""]
[28,{"$f":"'Wettkampf 1'!B37","v":"Johannes Thesing"},{"$f":"'Wettkampf 1'!C37","v":"Lahn IV"},null,null,{"v":0,"d":"0.0"},0,0,0,0,0,0,0,0,0,1,0,0,{"$nulls":5},{"v":0,"d":"0.0"},1,0,""]
[29,{"$f":"'Wettkampf 1'!B38","v":"Schütze 29"},{"$f":"'Wettkampf 1'!C38","v":"Lahn IV"},null,null,{"v":0,"d":"0.0"},0,0,0,0,0,0,0,0,0,1,0,0,{"$nulls":5},{"v":0,"d":"0.0"},1,0,""]
[30,{"$f":"'Wettkampf 1'!B39","v":"Willi Rolfes"},{"$f":"'Wettkampf 1'!C39","v":"Neuvrees I"},null,null,{"v":0,"d":"0.0"},0,0,0,0,0,0,0,0,0,0,0,1,{"$nulls":5},{"v":0,"d":"0.0"},1,0,""]
[31,{"$f":"'Wettkampf 1'!B40","v":"Werner Thyen"},{"$f":"'Wettkampf 1'!C40","v":"Neuvrees I"},null,null,{"v":0,"d":"0.0"},0,0,0,0,0,0,0,0,0,0,0,1,{"$nulls":5},{"v":0,"d":"0.0"},1,0,""]
[32,{"$f":"'Wettkampf 1'!B41","v":"Wilfried Breyer"},{"$f":"'Wettkampf 1'!C41","v":"Neuvrees I"},null,null,{"v":0,"d":"0.0"},0,0,0,0,0,0,0,0,0,0,0,1,{"$nulls":5},{"v":0,"d":"0.0"},1,0,""]
[33,{"$f":"'Wettkampf 1'!B42","v":"Klaus Steenken"},{"$f":"'Wettkampf 1'!C42","v":"Neuvrees I"},null,null,{"v":0,"d":"0.0"},0,0,0,0,0,0,0,0,0,0,0,1,{"$nulls":5},{"v":0,"d":"0.0"},1,0,""]
[34,{"$f":"'Wettkampf 1'!B43","v":"Markus Janßen"},{"$f":"'Wettkampf 1'!C43","v":"Neuvrees I"},null,null,{"v":0,"d":"0.0"},0,0,0,0,0,0,0,0,0,0,0,1,{"$nulls":5},{"v":0,"d":"0.0"},1,0,""]
[35,{"$f":"'Wettkampf 1'!B44","v":"Carsten Peters"},{"$f":"'Wettkampf 1'!C44","v":"Neuvrees I"},null,null,{"v":0,"d":"0.0"},0,0,0,0,0,0,0,0,0,0,0,1,{"$nulls":5},{"v":0,"d":"0.0"},1,0,""]
[36,{"$f":"'Wettkampf 1'!B45","v":"Dietmar Spekker"},{"$f":"'Wettkampf 1'!C45","v":"Neuvrees I"},null,null,{"v":0,"d":"0.0"},0,0,0,0,0,0,0,0,0,0,0,1,{"$nulls":5},{"v":0,"d":"0.0"},1,0,""]
[{"$nulls":6},{"$f":"LARGE(G10:G45,1)+LARGE(G10:G45,2)+LARGE(G10:G45,3)","v":0},{"$f":"SUM(H10:H45)","v":8},{"$f":"LARGE(I10:I45,1)+LARGE(I10:I45,2)+LARGE(I10:I45,3)","v":0},{"$f":"SUM(J10:J45)","v":5},{"$f":"LARGE(K10:K45,1)+LARGE(K10:K45,2)+LARGE(K10:K45,3)","v":0},{"$f":"SUM(L10:L45)","v":5},{"$f":"LARGE(M10:M45,1)+LARGE(M10:M45,2)+LARGE(M10:M45,3)","v":0},{"$f":"SUM(N10:N45)","v":6},{"$f":"LARGE(O10:O45,1)+LARGE(O10:O45,2)+LARGE(O10:O45,3)","v":0},{"$f":"SUM(P10:P45)","v":5},{"$f":"LARGE(Q10:Q45,1)+LARGE(Q10:Q45,2)+LARGE(Q10:Q45,3)","v":0},{"$f":"SUM(R10:S45)","v":7}]
[null,null,"per Email an: sk-huemmling@gmx.de"]

{"sheet":"11","index":11,"n_rows":47,"n_cols":27,"rows_kept":47,"merged":[[0,22,0,23],[1,22,1,23],[4,22,4,23],[5,22,5,23],[6,22,6,23],[8,20,8,23]]}
[null,"Verein / Gruppe",null,"Ergebnisse",{"$nulls":17},"Austragungsort:",{"$f":"Übersicht!P4","v":"Lahn"}]
[1,{"$f":"'Wettkampf 1'!B2","v":"Börgerwald II"},null,{"$f":"G46","v":{"v":0,"d":"0.0"}},{"$f":"IF(H46>4,\"Es sind zu viele Schützen in Wertung!\",\" \")","v":"Es sind zu viele Schützen in Wertung!"},{"$nulls":16},"Wettkampftag:",{"$f":"Übersicht!P3","v":"10.03."}]
[2,{"$f":"'Wettkampf 1'!B3","v":"Neuvrees II"},null,{"$f":"I46","v":{"v":0,"d":"0.0"}},{"$f":"IF(J46>4,\"Es sind zu viele Schützen in Wertung!\",\" \")","v":"Es sind zu viele Schützen in Wertung!"}]
[3,{"$f":"'Wettkampf 1'!B4","v":"Börger III"},null,{"$f":"K46","v":{"v":0,"d":"0.0"}},{"$f":"IF(L46>4,\"Es sind zu viele Schützen in Wertung!\",\" \")","v":"Es sind zu viele Schützen in Wertung!"},{"$nulls":18},"Ansprechpartner für Rückfragen:"]
[4,{"$f":"'Wettkampf 1'!B5","v":"Börger II"},null,{"$f":"M46","v":{"v":0,"d":"0.0"}},{"$f":"IF(N46>4,\"Es sind zu viele Schützen in Wertung!\",\" \")","v":"Es sind zu viele Schützen in Wertung!"},{"$nulls":16},"Name:"]
[5,{"$f":"'Wettkampf 1'!B6","v":"Lahn IV"},null,{"$f":"O46","v":{"v":0,"d":"0.0"}},{"$f":"IF(P46>4,\"Es sind zu viele Schützen in Wertung!\",\" \")","v":"Es sind zu viele Schützen in Wertung!"},{"$nulls":16},"Tel:"]
[6,{"$f":"'Wettkampf 1'!B7","v":"Neuvrees I"},null,{"$f":"Q46","v":{"v":0,"d":"0.0"}},{"$f":"IF(R46>4,\"Es sind zu viele Schützen in Wertung!\",\" \")","v":"Es sind zu viele Schützen in Wertung!"},{"$nulls":16},"Standaufsicht:","eintragen"]
[]
[null,"Einzelergebnisse:","Verein / Gruppe","Ergebnisse (mindestens 0 eintragen)","AW? Dann x eintippen",null,"Verein 1",null,"Verein 2",null,"Verein 3",null,"Verein 4",null,"Verein 5",null,"Verein 6",{"$nulls":3},"Proberechnung bei Streifen:"]
[1,{"$f":"'Wettkampf 1'!B10","v":"Andre Hanenkamp"},{"$f":"'Wettkampf 1'!C10","v":"Börgerwald II"},null,null,{"$f":"IF(E10=\"x\",\"0\",D10)","v":{"v":0,"d":"0.0"}},{"$f":"IF(C10=$B$2,F10,0)","v":0},{"$f":"(IF(AND($E10=\"\",$C10=$B$2),1,0))","v":1},{"$f":"IF($C10=$B$3,F10,0)","v":0},{"$f":"(IF(AND($E10=\"\",$C10=$B$3),1,0))","v":0},{"$f":"IF($C10=$B$4,F10,0)","v":0},{"$f":"(IF(AND($E10=\"\",$C10=$B$4),1,0))","v":0},{"$f":"IF($C10=$B$5,F10,0)","v":0},{"$f":"(IF(AND($E10=\"\",$C10=$B$5),1,0))","v":0},{"$f":"IF($C10=$B$6,F10,0)","v":0},{"$f":"(IF(AND($E10=\"\",$C10=$B$6),1,0))","v":0},{"$f":"IF($C10=$B$7,F10,0)","v":0},{"$f":"(IF(AND($E10=\"\",$C10=$B$7),1,0))","v":0},{"$nulls":5},{"$f":"U10+V10+W10","v":{"v":0,"d":"0.0"}},{"$f":"IF(X10=D10,1,0)","v":1},{"$f":"IF(X10=0,0,1)","v":0},{"$f":"IF(Y10+Z10=2,\"Korrekt\",\"\")","v":""}]
[2,{"$f":"'Wettkampf 1'!B11","v":"Horst Sabel"},{"$f":"'Wettkampf 1'!C11","v":"Börgerwald II"},null,null,{"$f":"IF(E11=\"x\",\"0\",D11)","v":{"v":0,"d":"0.0"}},{"$f":"IF(C11=$B$2,F11,0)","v":0},{"$f":"(IF(AND($E11=\"\",$C11=$B$2),1,0))","v":1},{"$f":"IF($C11=$B$3,F11,0)","v":0},{"$f":"(IF(AND($E11=\"\",$C11=$B$3),1,0))","v":0},{"$f":"IF($C11=$B$4,F11,0)","v":0},{"$f":"(IF(AND($E11=\"\",$C11=$B$4),1,0))","v":0},{"$f":"IF($C11=$B$5,F11,0)","v":0},{"$f":"(IF(AND($E11=\"\",$C11=$B$5),1,0))","v":0},{"$f":"IF($C11=$B$6,F11,0)","v":0},{"$f":"(IF(AND($E11=\"\",$C11=$B$6),1,0))","v":0},{"$f":"IF($C11=$B$7,F11,0)","v":0},{"$f":"(IF(AND($E11=\"\",$C11=$B$7),1,0))","v":0},{"$nulls":5},{"$f":"U11+V11+W11","v":{"v":0,"d":"0.0"}},{"$f":"IF(X11=D11,1,0)","v":1},{"$f":"IF(X11=0,0,1)","v":0},{"$f":"IF(Y11+Z11=2,\"Korrekt\",\"\")","v":""}]
[3,{"$f":"'Wettkampf 1'!B12","v":"Christian Robben"},{"$f":"'Wettkampf 1'!C12","v":"Börgerwald II"},null,null,{"v":0,"d":"0.0"},0,1,0,0,0,0,0,0,0,0,0,0,{"$nulls":5},{"v":0,"d":"0.0"},1,0,""]
[4,{"$f":"'Wettkampf 1'!B13","v":"Mathis Antons"},{"$f":"'Wettkampf 1'!C13","v":"Börgerwald II"},null,null,{"v":0,"d":"0.0"},0,1,0,0,0,0,0,0,0,0,0,0,{"$nulls":5},{"v":0,"d":"0.0"},1,0,""]
[5,{"$f":"'Wettkampf 1'!B14","v":"Tobias Sebers"},{"$f":"'Wettkampf 1'!C14","v":"Börgerwald II"},null,null,{"v":0,"d":"0.0"},0,1,0,0,0,0,0,0,0,0,0,0,{"$nulls":5},{"v":0,"d":"0.0"},1,0,""]
[6,{"$f":"'Wettkampf 1'!B15","v":"Friedhelm Schroer"},{"$f":"'Wettkampf 1'!C15","v":"Börgerwald II"},null,null,{"v":0,"d":"0.0"},0,1,0,0,0,0,0,0,0,0,0,0,{"$nulls":5},{"v":0,"d":"0.0"},1,0,""]
[7,{"$f":"'Wettkampf 1'!B16","v":"Toni Stahl"},{"$f":"'Wettkampf 1'!C16","v":"Börgerwald II"},null,null,{"v":0,"d":"0.0"},0,1,0,0,0,0,0,0,0,0,0,0,{"$nulls":5},{"v":0,"d":"0.0"},1,0,""]
[8,{"$f":"'Wettkampf 1'!B17","v":"Martin Hinrichs"},{"$f":"'Wettkampf 1'!C17","v":"Börgerwald II"},null,null,{"v":0,"d":"0.0"},0,1,0,0,0,0,0,0,0,0,0,0,{"$nulls":5},{"v":0,"d":"0.0"},1,0,""]
[9,{"$f":"'Wettkampf 1'!B18","v":"Dirk Thunert"},{"$f":"'Wettkampf 1'!C18","v":"Neuvrees II"},null,null,{"v":0,"d":"0.0"},0,0,0,1,0,0,0,0,0,0,0,0,{"$nulls":5},{"v":0,"d":"0.0"},1,0,""]
[10,{"$f":"'Wettkampf 1'!B19","v":"Hans Preuth"},{"$f":"'Wettkampf 1'!C19","v":"Neuvrees II"},null,null,{"v":0,"d":"0.0"},0,0,0,1,0,0,0,0,0,0,0,0,{"$nulls":5},{"v":0,"d":"0.0"},1,0,""]
[11,{"$f":"'Wettkampf 1'!B20","v":"Karl-Heinz Schrand"},{"$f":"'Wettkampf 1'!C20","v":"Neuvrees II"},null,null,{"v":0,"d":"0.0"},0,0,0,1,0,0,0,0,0,0,0,0,{"$nulls":5},{"v":0,"d":"0.0"},1,0,""]
[12,{"$f":"'Wettkampf 1'!B21","v":"Holger Szczepanski"},{"$f":"'Wettkampf 1'!C21","v":"Neuvrees II"},null,null,{"v":0,"d":"0.0"},0,0,0,1,0,0,0,0,0,0,0,0,{"$nulls":5},{"v":0,"d":"0.0"},1,0,""]
[13,{"$f":"'Wettkampf 1'!B22","v":"Bernd Witting"},{"$f":"'Wettkampf 1'!C22","v":"Neuvrees II"},null,null,{"v":0,"d":"0.0"},0,0,0,1,0,0,0,0,0,0,0,0,{"$nulls":5},{"v":0,"d":"0.0"},1,0,""]
[14,{"$f":"'Wettkampf 1'!B23","v":"Hermann Schwarte"},{"$f":"'Wettkampf 1'!C23","v":"Börger II"},null,null,{"v":0,"d":"0.0"},0,0,0,0,0,0,0,1,0,0,0,0,{"$nulls":5},{"v":0,"d":"0.0"},1,0,""]
[15,{"$f":"'Wettkampf 1'!B24","v":"Bernd Rode"},{"$f":"'Wettkampf 1'!C24","v":"Börger III"},null,null,{"v":0,"d":"0.0"},0,0,0,0,0,1,0,0,0,0,0,0,{"$nulls":5},{"v":0,"d":"0.0"},1,0,""]
[16,{"$f":"'Wettkampf 1'!B25","v":"Daniel Sebers"},{"$f":"'Wettkampf 1'!C25","v":"Börger III"},null,null,{"v":0,"d":"0.0"},0,0,0,0,0,1,0,0,0,0,0,0,{"$nulls":5},{"v":0,"d":"0.0"},1,0,""]
[17,{"$f":"'Wettkampf 1'!B26","v":"Simon Schutenbrock"},{"$f":"'Wettkampf 1'!C26","v":"Börger III"},null,null,{"v":0,"d":"0.0"},0,0,0,0,0,1,0,0,0,0,0,0,{"$nulls":5},{"v":0,"d":"0.0"},1,0,""]
[18,{"$f":"'Wettkampf 1'!B27","v":"Jürgen Schroer"},{"$f":"'Wettkampf 1'!C27","v":"Börger III"},null,null,{"v":0,"d":"0.0"},0,0,0,0,0,1,0,0,0,0,0,0,{"$nulls":5},{"v":0,"d":"0.0"},1,0,""]
[19,{"$f":"'Wettkampf 1'!B28","v":"Marc Eckmann"},{"$f":"'Wettkampf 1'!C28","v":"Börger II"},null,null,{"v":0,"d":"0.0"},0,0,0,0,0,0,0,1,0,0,0,0,{"$nulls":5},{"v":0,"d":"0.0"},1,0,""]
[20,{"$f":"'Wettkampf 1'!B29","v":"Markus Jungsthöfel"},{"$f":"'Wettkampf 1'!C29","v":"Börger II"},null,null,{"v":0,"d":"0.0"},0,0,0,0,0,0,0,1,0,0,0,0,{"$nulls":5},{"v":0,"d":"0.0"},1,0,""]
[21,{"$f":"'Wettkampf 1'!B30","v":"Jens Henzen"},{"$f":"'Wettkampf 1'!C30","v":"Börger III"},null,null,{"v":0,"d":"0.0"},0,0,0,0,0,1,0,0,0,0,0,0,{"$nulls":5},{"v":0,"d":"0.0"},1,0,""]
[22,{"$f":"'Wettkampf 1'!B31","v":"Uwe Goldenstein"},{"$f":"'Wettkampf 1'!C31","v":"Börger II"},null,null,{"v":0,"d":"0.0"},0,0,0,0,0,0,0,1,0,0,0,0,{"$nulls":5},{"v":0,"d":"0.0"},1,0,""]
[23,{"$f":"'Wettkampf 1'!B32","v":"Ingo Zdralik"},{"$f":"'Wettkampf 1'!C32","v":"Börger II"},null,null,{"v":0,"d":"0.0"},0,0,0,0,0,0,0,1,0,0,0,0,{"$nulls":5},{"v":0,"d":"0.0"},1,0,""]
[24,{"$f":"'Wettkampf 1'!B33","v":"Schütze 24"},{"$f":"'Wettkampf 1'!C33","v":"Börger II"},null,null,{"v":0,"d":"0.0"},0,0,0,0,0,0,0,1,0,0,0,0,{"$nulls":5},{"v":0,"d":"0.0"},1,0,""]
[25,{"$f":"'Wettkampf 1'!B34","v":"Oliver Reinelt"},{"$f":"'Wettkampf 1'!C34","v":"Lahn IV"},null,null,{"v":0,"d":"0.0"},0,0,0,0,0,0,0,0,0,1,0,0,{"$nulls":5},{"v":0,"d":"0.0"},1,0,""]
[26,{"$f":"'Wettkampf 1'!B35","v":"Vitalij Schmidt"},{"$f":"'Wettkampf 1'!C35","v":"Lahn IV"},null,null,{"v":0,"d":"0.0"},0,0,0,0,0,0,0,0,0,1,0,0,{"$nulls":5},{"v":0,"d":"0.0"},1,0,""]
[27,{"$f":"'Wettkampf 1'!B36","v":"Hermann Benten"},{"$f":"'Wettkampf 1'!C36","v":"Lahn IV"},null,null,{"v":0,"d":"0.0"},0,0,0,0,0,0,0,0,0,1,0,0,{"$nulls":5},{"v":0,"d":"0.0"},1,0,""]
[28,{"$f":"'Wettkampf 1'!B37","v":"Johannes Thesing"},{"$f":"'Wettkampf 1'!C37","v":"Lahn IV"},null,null,{"v":0,"d":"0.0"},0,0,0,0,0,0,0,0,0,1,0,0,{"$nulls":5},{"v":0,"d":"0.0"},1,0,""]
[29,{"$f":"'Wettkampf 1'!B38","v":"Schütze 29"},{"$f":"'Wettkampf 1'!C38","v":"Lahn IV"},null,null,{"v":0,"d":"0.0"},0,0,0,0,0,0,0,0,0,1,0,0,{"$nulls":5},{"v":0,"d":"0.0"},1,0,""]
[30,{"$f":"'Wettkampf 1'!B39","v":"Willi Rolfes"},{"$f":"'Wettkampf 1'!C39","v":"Neuvrees I"},null,null,{"v":0,"d":"0.0"},0,0,0,0,0,0,0,0,0,0,0,1,{"$nulls":5},{"v":0,"d":"0.0"},1,0,""]
[31,{"$f":"'Wettkampf 1'!B40","v":"Werner Thyen"},{"$f":"'Wettkampf 1'!C40","v":"Neuvrees I"},null,null,{"v":0,"d":"0.0"},0,0,0,0,0,0,0,0,0,0,0,1,{"$nulls":5},{"v":0,"d":"0.0"},1,0,""]
[32,{"$f":"'Wettkampf 1'!B41","v":"Wilfried Breyer"},{"$f":"'Wettkampf 1'!C41","v":"Neuvrees I"},null,null,{"v":0,"d":"0.0"},0,0,0,0,0,0,0,0,0,0,0,1,{"$nulls":5},{"v":0,"d":"0.0"},1,0,""]
[33,{"$f":"'Wettkampf 1'!B42","v":"Klaus Steenken"},{"$f":"'Wettkampf 1'!C42","v":"Neuvrees I"},null,null,{"v":0,"d":"0.0"},0,0,0,0,0,0,0,0,0,0,0,1,{"$nulls":5},{"v":0,"d":"0.0"},1,0,""]
[34,{"$f":"'Wettkampf 1'!B43","v":"Markus Janßen"},{"$f":"'Wettkampf 1'!C43","v":"Neuvrees I"},null,null,{"v":0,"d":"0.0"},0,0,0,0,0,0,0,0,0,0,0,1,{"$nulls":5},{"v":0,"d":"0.0"},1,0,""]
[35,{"$f":"'Wettkampf 1'!B44","v":"Carsten Peters"},{"$f":"'Wettkampf 1'!C44","v":"Neuvrees I"},null,null,{"v":0,"d":"0.0"},0,0,0,0,0,0,0,0,0,0,0,1,{"$nulls":5},{"v":0,"d":"0.0"},1,0,""]
[36,{"$f":"'Wettkampf 1'!B45","v":"Dietmar Spekker"},{"$f":"'Wettkampf 1'!C45","v":"Neuvrees I"},null,null,{"v":0,"d":"0.0"},0,0,0,0,0,0,0,0,0,0,0,1,{"$nulls":5},{"v":0,"d":"0.0"},1,0,""]
[{"$nulls":6},{"$f":"LARGE(G10:G45,1)+LARGE(G10:G45,2)+LARGE(G10:G45,3)","v":0},{"$f":"SUM(H10:H45)","v":8},{"$f":"LARGE(I10:I45,1)+LARGE(I10:I45,2)+LARGE(I10:I45,3)","v":0},{"$f":"SUM(J10:J45)","v":5},{"$f":"LARGE(K10:K45,1)+LARGE(K10:K45,2)+LARGE(K10:K45,3)","v":0},{"$f":"SUM(L10:L45)","v":5},{"$f":"LARGE(M10:M45,1)+LARGE(M10:M45,2)+LARGE(M10:M45,3)","v":0},{"$f":"SUM(N10:N45)","v":6},{"$f":"LARGE(O10:O45,1)+LARGE(O10:O45,2)+LARGE(O10:O45,3)","v":0},{"$f":"SUM(P10:P45)","v":5},{"$f":"LARGE(Q10:Q45,1)+LARGE(Q10:Q45,2)+LARGE(Q10:Q45,3)","v":0},{"$f":"SUM(R10:S45)","v":7}]
[null,null,"per Email an: sk-huemmling@gmx.de"]

{"sheet":"12","index":12,"n_rows":47,"n_cols":27,"rows_kept":47,"merged":[[0,22,0,23],[1,22,1,23],[4,22,4,23],[5,22,5,23],[6,22,6,23],[8,20,8,23]]}
[null,"Verein / Gruppe",null,"Ergebnisse",{"$nulls":17},"Austragungsort:",{"$f":"Übersicht!Q4","v":"Börgerwald"}]
[1,{"$f":"'Wettkampf 1'!B2","v":"Börgerwald II"},null,{"$f":"G46","v":{"v":0,"d":"0.0"}},{"$f":"IF(H46>4,\"Es sind zu viele Schützen in Wertung!\",\" \")","v":"Es sind zu viele Schützen in Wertung!"},{"$nulls":16},"Wettkampftag:",{"$f":"Übersicht!Q3","v":"07.04."}]
[2,{"$f":"'Wettkampf 1'!B3","v":"Neuvrees II"},null,{"$f":"I46","v":{"v":0,"d":"0.0"}},{"$f":"IF(J46>4,\"Es sind zu viele Schützen in Wertung!\",\" \")","v":"Es sind zu viele Schützen in Wertung!"}]
[3,{"$f":"'Wettkampf 1'!B4","v":"Börger III"},null,{"$f":"K46","v":{"v":0,"d":"0.0"}},{"$f":"IF(L46>4,\"Es sind zu viele Schützen in Wertung!\",\" \")","v":"Es sind zu viele Schützen in Wertung!"},{"$nulls":18},"Ansprechpartner für Rückfragen:"]
[4,{"$f":"'Wettkampf 1'!B5","v":"Börger II"},null,{"$f":"M46","v":{"v":0,"d":"0.0"}},{"$f":"IF(N46>4,\"Es sind zu viele Schützen in Wertung!\",\" \")","v":"Es sind zu viele Schützen in Wertung!"},{"$nulls":16},"Name:"]
[5,{"$f":"'Wettkampf 1'!B6","v":"Lahn IV"},null,{"$f":"O46","v":{"v":0,"d":"0.0"}},{"$f":"IF(P46>4,\"Es sind zu viele Schützen in Wertung!\",\" \")","v":"Es sind zu viele Schützen in Wertung!"},{"$nulls":16},"Tel:"]
[6,{"$f":"'Wettkampf 1'!B7","v":"Neuvrees I"},null,{"$f":"Q46","v":{"v":0,"d":"0.0"}},{"$f":"IF(R46>4,\"Es sind zu viele Schützen in Wertung!\",\" \")","v":"Es sind zu viele Schützen in Wertung!"},{"$nulls":16},"Standaufsicht:","eintragen"]
[]
[null,"Einzelergebnisse:","Verein / Gruppe","Ergebnisse (mindestens 0 eintragen)","AW? Dann x eintippen",null,"Verein 1",null,"Verein 2",null,"Verein 3",null,"Verein 4",null,"Verein 5",null,"Verein 6",{"$nulls":3},"Proberechnung bei Streifen:"]
[1,{"$f":"'Wettkampf 1'!B10","v":"Andre Hanenkamp"},{"$f":"'Wettkampf 1'!C10","v":"Börgerwald II"},null,null,{"$f":"IF(E10=\"x\",\"0\",D10)","v":{"v":0,"d":"0.0"}},{"$f":"IF(C10=$B$2,F10,0)","v":0},{"$f":"(IF(AND($E10=\"\",$C10=$B$2),1,0))","v":1},{"$f":"IF($C10=$B$3,F10,0)","v":0},{"$f":"(IF(AND($E10=\"\",$C10=$B$3),1,0))","v":0},{"$f":"IF($C10=$B$4,F10,0)","v":0},{"$f":"(IF(AND($E10=\"\",$C10=$B$4),1,0))","v":0},{"$f":"IF($C10=$B$5,F10,0)","v":0},{"$f":"(IF(AND($E10=\"\",$C10=$B$5),1,0))","v":0},{"$f":"IF($C10=$B$6,F10,0)","v":0},{"$f":"(IF(AND($E10=\"\",$C10=$B$6),1,0))","v":0},{"$f":"IF($C10=$B$7,F10,0)","v":0},{"$f":"(IF(AND($E10=\"\",$C10=$B$7),1,0))","v":0},{"$nulls":5},{"$f":"U10+V10+W10","v":{"v":0,"d":"0.0"}},{"$f":"IF(X10=D10,1,0)","v":1},{"$f":"IF(X10=0,0,1)","v":0},{"$f":"IF(Y10+Z10=2,\"Korrekt\",\"\")","v":""}]
[2,{"$f":"'Wettkampf 1'!B11","v":"Horst Sabel"},{"$f":"'Wettkampf 1'!C11","v":"Börgerwald II"},null,null,{"$f":"IF(E11=\"x\",\"0\",D11)","v":{"v":0,"d":"0.0"}},{"$f":"IF(C11=$B$2,F11,0)","v":0},{"$f":"(IF(AND($E11=\"\",$C11=$B$2),1,0))","v":1},{"$f":"IF($C11=$B$3,F11,0)","v":0},{"$f":"(IF(AND($E11=\"\",$C11=$B$3),1,0))","v":0},{"$f":"IF($C11=$B$4,F11,0)","v":0},{"$f":"(IF(AND($E11=\"\",$C11=$B$4),1,0))","v":0},{"$f":"IF($C11=$B$5,F11,0)","v":0},{"$f":"(IF(AND($E11=\"\",$C11=$B$5),1,0))","v":0},{"$f":"IF($C11=$B$6,F11,0)","v":0},{"$f":"(IF(AND($E11=\"\",$C11=$B$6),1,0))","v":0},{"$f":"IF($C11=$B$7,F11,0)","v":0},{"$f":"(IF(AND($E11=\"\",$C11=$B$7),1,0))","v":0},{"$nulls":5},{"$f":"U11+V11+W11","v":{"v":0,"d":"0.0"}},{"$f":"IF(X11=D11,1,0)","v":1},{"$f":"IF(X11=0,0,1)","v":0},{"$f":"IF(Y11+Z11=2,\"Korrekt\",\"\")","v":""}]
[3,{"$f":"'Wettkampf 1'!B12","v":"Christian Robben"},{"$f":"'Wettkampf 1'!C12","v":"Börgerwald II"},null,null,{"v":0,"d":"0.0"},0,1,0,0,0,0,0,0,0,0,0,0,{"$nulls":5},{"v":0,"d":"0.0"},1,0,""]
[4,{"$f":"'Wettkampf 1'!B13","v":"Mathis Antons"},{"$f":"'Wettkampf 1'!C13","v":"Börgerwald II"},null,null,{"v":0,"d":"0.0"},0,1,0,0,0,0,0,0,0,0,0,0,{"$nulls":5},{"v":0,"d":"0.0"},1,0,""]
[5,{"$f":"'Wettkampf 1'!B14","v":"Tobias Sebers"},{"$f":"'Wettkampf 1'!C14","v":"Börgerwald II"},null,null,{"v":0,"d":"0.0"},0,1,0,0,0,0,0,0,0,0,0,0,{"$nulls":5},{"v":0,"d":"0.0"},1,0,""]
[6,{"$f":"'Wettkampf 1'!B15","v":"Friedhelm Schroer"},{"$f":"'Wettkampf 1'!C15","v":"Börgerwald II"},null,null,{"v":0,"d":"0.0"},0,1,0,0,0,0,0,0,0,0,0,0,{"$nulls":5},{"v":0,"d":"0.0"},1,0,""]
[7,{"$f":"'Wettkampf 1'!B16","v":"Toni Stahl"},{"$f":"'Wettkampf 1'!C16","v":"Börgerwald II"},null,null,{"v":0,"d":"0.0"},0,1,0,0,0,0,0,0,0,0,0,0,{"$nulls":5},{"v":0,"d":"0.0"},1,0,""]
[8,{"$f":"'Wettkampf 1'!B17","v":"Martin Hinrichs"},{"$f":"'Wettkampf 1'!C17","v":"Börgerwald II"},null,null,{"v":0,"d":"0.0"},0,1,0,0,0,0,0,0,0,0,0,0,{"$nulls":5},{"v":0,"d":"0.0"},1,0,""]
[9,{"$f":"'Wettkampf 1'!B18","v":"Dirk Thunert"},{"$f":"'Wettkampf 1'!C18","v":"Neuvrees II"},null,null,{"v":0,"d":"0.0"},0,0,0,1,0,0,0,0,0,0,0,0,{"$nulls":5},{"v":0,"d":"0.0"},1,0,""]
[10,{"$f":"'Wettkampf 1'!B19","v":"Hans Preuth"},{"$f":"'Wettkampf 1'!C19","v":"Neuvrees II"},null,null,{"v":0,"d":"0.0"},0,0,0,1,0,0,0,0,0,0,0,0,{"$nulls":5},{"v":0,"d":"0.0"},1,0,""]
[11,{"$f":"'Wettkampf 1'!B20","v":"Karl-Heinz Schrand"},{"$f":"'Wettkampf 1'!C20","v":"Neuvrees II"},null,null,{"v":0,"d":"0.0"},0,0,0,1,0,0,0,0,0,0,0,0,{"$nulls":5},{"v":0,"d":"0.0"},1,0,""]
[12,{"$f":"'Wettkampf 1'!B21","v":"Holger Szczepanski"},{"$f":"'Wettkampf 1'!C21","v":"Neuvrees II"},null,null,{"v":0,"d":"0.0"},0,0,0,1,0,0,0,0,0,0,0,0,{"$nulls":5},{"v":0,"d":"0.0"},1,0,""]
[13,{"$f":"'Wettkampf 1'!B22","v":"Bernd Witting"},{"$f":"'Wettkampf 1'!C22","v":"Neuvrees II"},null,null,{"v":0,"d":"0.0"},0,0,0,1,0,0,0,0,0,0,0,0,{"$nulls":5},{"v":0,"d":"0.0"},1,0,""]
[14,{"$f":"'Wettkampf 1'!B23","v":"Hermann Schwarte"},{"$f":"'Wettkampf 1'!C23","v":"Börger II"},null,null,{"v":0,"d":"0.0"},0,0,0,0,0,0,0,1,0,0,0,0,{"$nulls":5},{"v":0,"d":"0.0"},1,0,""]
[15,{"$f":"'Wettkampf 1'!B24","v":"Bernd Rode"},{"$f":"'Wettkampf 1'!C24","v":"Börger III"},null,null,{"v":0,"d":"0.0"},0,0,0,0,0,1,0,0,0,0,0,0,{"$nulls":5},{"v":0,"d":"0.0"},1,0,""]
[16,{"$f":"'Wettkampf 1'!B25","v":"Daniel Sebers"},{"$f":"'Wettkampf 1'!C25","v":"Börger III"},null,null,{"v":0,"d":"0.0"},0,0,0,0,0,1,0,0,0,0,0,0,{"$nulls":5},{"v":0,"d":"0.0"},1,0,""]
[17,{"$f":"'Wettkampf 1'!B26","v":"Simon Schutenbrock"},{"$f":"'Wettkampf 1'!C26","v":"Börger III"},null,null,{"v":0,"d":"0.0"},0,0,0,0,0,1,0,0,0,0,0,0,{"$nulls":5},{"v":0,"d":"0.0"},1,0,""]
[18,{"$f":"'Wettkampf 1'!B27","v":"Jürgen Schroer"},{"$f":"'Wettkampf 1'!C27","v":"Börger III"},null,null,{"v":0,"d":"0.0"},0,0,0,0,0,1,0,0,0,0,0,0,{"$nulls":5},{"v":0,"d":"0.0"},1,0,""]
[19,{"$f":"'Wettkampf 1'!B28","v":"Marc Eckmann"},{"$f":"'Wettkampf 1'!C28","v":"Börger II"},null,null,{"v":0,"d":"0.0"},0,0,0,0,0,0,0,1,0,0,0,0,{"$nulls":5},{"v":0,"d":"0.0"},1,0,""]
[20,{"$f":"'Wettkampf 1'!B29","v":"Markus Jungsthöfel"},{"$f":"'Wettkampf 1'!C29","v":"Börger II"},null,null,{"v":0,"d":"0.0"},0,0,0,0,0,0,0,1,0,0,0,0,{"$nulls":5},{"v":0,"d":"0.0"},1,0,""]
[21,{"$f":"'Wettkampf 1'!B30","v":"Jens Henzen"},{"$f":"'Wettkampf 1'!C30","v":"Börger III"},null,null,{"v":0,"d":"0.0"},0,0,0,0,0,1,0,0,0,0,0,0,{"$nulls":5},{"v":0,"d":"0.0"},1,0,""]
[22,{"$f":"'Wettkampf 1'!B31","v":"Uwe Goldenstein"},{"$f":"'Wettkampf 1'!C31","v":"Börger II"},null,null,{"v":0,"d":"0.0"},0,0,0,0,0,0,0,1,0,0,0,0,{"$nulls":5},{"v":0,"d":"0.0"},1,0,""]
[23,{"$f":"'Wettkampf 1'!B32","v":"Ingo Zdralik"},{"$f":"'Wettkampf 1'!C32","v":"Börger II"},null,null,{"v":0,"d":"0.0"},0,0,0,0,0,0,0,1,0,0,0,0,{"$nulls":5},{"v":0,"d":"0.0"},1,0,""]
[24,{"$f":"'Wettkampf 1'!B33","v":"Schütze 24"},{"$f":"'Wettkampf 1'!C33","v":"Börger II"},null,null,{"v":0,"d":"0.0"},0,0,0,0,0,0,0,1,0,0,0,0,{"$nulls":5},{"v":0,"d":"0.0"},1,0,""]
[25,{"$f":"'Wettkampf 1'!B34","v":"Oliver Reinelt"},{"$f":"'Wettkampf 1'!C34","v":"Lahn IV"},null,null,{"v":0,"d":"0.0"},0,0,0,0,0,0,0,0,0,1,0,0,{"$nulls":5},{"v":0,"d":"0.0"},1,0,""]
[26,{"$f":"'Wettkampf 1'!B35","v":"Vitalij Schmidt"},{"$f":"'Wettkampf 1'!C35","v":"Lahn IV"},null,null,{"v":0,"d":"0.0"},0,0,0,0,0,0,0,0,0,1,0,0,{"$nulls":5},{"v":0,"d":"0.0"},1,0,""]
[27,{"$f":"'Wettkampf 1'!B36","v":"Hermann Benten"},{"$f":"'Wettkampf 1'!C36","v":"Lahn IV"},null,null,{"v":0,"d":"0.0"},0,0,0,0,0,0,0,0,0,1,0,0,{"$nulls":5},{"v":0,"d":"0.0"},1,0,""]
[28,{"$f":"'Wettkampf 1'!B37","v":"Johannes Thesing"},{"$f":"'Wettkampf 1'!C37","v":"Lahn IV"},null,null,{"v":0,"d":"0.0"},0,0,0,0,0,0,0,0,0,1,0,0,{"$nulls":5},{"v":0,"d":"0.0"},1,0,""]
[29,{"$f":"'Wettkampf 1'!B38","v":"Schütze 29"},{"$f":"'Wettkampf 1'!C38","v":"Lahn IV"},null,null,{"v":0,"d":"0.0"},0,0,0,0,0,0,0,0,0,1,0,0,{"$nulls":5},{"v":0,"d":"0.0"},1,0,""]
[30,{"$f":"'Wettkampf 1'!B39","v":"Willi Rolfes"},{"$f":"'Wettkampf 1'!C39","v":"Neuvrees I"},null,null,{"v":0,"d":"0.0"},0,0,0,0,0,0,0,0,0,0,0,1,{"$nulls":5},{"v":0,"d":"0.0"},1,0,""]
[31,{"$f":"'Wettkampf 1'!B40","v":"Werner Thyen"},{"$f":"'Wettkampf 1'!C40","v":"Neuvrees I"},null,null,{"v":0,"d":"0.0"},0,0,0,0,0,0,0,0,0,0,0,1,{"$nulls":5},{"v":0,"d":"0.0"},1,0,""]
[32,{"$f":"'Wettkampf 1'!B41","v":"Wilfried Breyer"},{"$f":"'Wettkampf 1'!C41","v":"Neuvrees I"},null,null,{"v":0,"d":"0.0"},0,0,0,0,0,0,0,0,0,0,0,1,{"$nulls":5},{"v":0,"d":"0.0"},1,0,""]
[33,{"$f":"'Wettkampf 1'!B42","v":"Klaus Steenken"},{"$f":"'Wettkampf 1'!C42","v":"Neuvrees I"},null,null,{"v":0,"d":"0.0"},0,0,0,0,0,0,0,0,0,0,0,1,{"$nulls":5},{"v":0,"d":"0.0"},1,0,""]
[34,{"$f":"'Wettkampf 1'!B43","v":"Markus Janßen"},{"$f":"'Wettkampf 1'!C43","v":"Neuvrees I"},null,null,{"v":0,"d":"0.0"},0,0,0,0,0,0,0,0,0,0,0,1,{"$nulls":5},{"v":0,"d":"0.0"},1,0,""]
[35,{"$f":"'Wettkampf 1'!B44","v":"Carsten Peters"},{"$f":"'Wettkampf 1'!C44","v":"Neuvrees I"},null,null,{"v":0,"d":"0.0"},0,0,0,0,0,0,0,0,0,0,0,1,{"$nulls":5},{"v":0,"d":"0.0"},1,0,""]
[36,{"$f":"'Wettkampf 1'!B45","v":"Dietmar Spekker"},{"$f":"'Wettkampf 1'!C45","v":"Neuvrees I"},null,null,{"v":0,"d":"0.0"},0,0,0,0,0,0,0,0,0,0,0,1,{"$nulls":5},{"v":0,"d":"0.0"},1,0,""]
[{"$nulls":6},{"$f":"LARGE(G10:G45,1)+LARGE(G10:G45,2)+LARGE(G10:G45,3)","v":0},{"$f":"SUM(H10:H45)","v":8},{"$f":"LARGE(I10:I45,1)+LARGE(I10:I45,2)+LARGE(I10:I45,3)","v":0},{"$f":"SUM(J10:J45)","v":5},{"$f":"LARGE(K10:K45,1)+LARGE(K10:K45,2)+LARGE(K10:K45,3)","v":0},{"$f":"SUM(L10:L45)","v":5},{"$f":"LARGE(M10:M45,1)+LARGE(M10:M45,2)+LARGE(M10:M45,3)","v":0},{"$f":"SUM(N10:N45)","v":6},{"$f":"LARGE(O10:O45,1)+LARGE(O10:O45,2)+LARGE(O10:O45,3)","v":0},{"$f":"SUM(P10:P45)","v":5},{"$f":"LARGE(Q10:Q45,1)+LARGE(Q10:Q45,2)+LARGE(Q10:Q45,3)","v":0},{"$f":"SUM(R10:S45)","v":7}]
[null,null,"per Email an: sk-huemmling@gmx.de"]

{"sheet":"Ausdruck","index":13,"n_rows":48,"n_cols":29,"rows_kept":48,"merged":[[0,3,0,19],[0,24,0,25],[1,3,1,19],[1,24,1,25],[2,3,2,19],[3,3,3,19],[4,24,4,25],[5,24,5,25],[6,24,6,25],[8,22,8,25]]}
[null,"Verein / Gruppe","Ergebnisse",{"$f":"Übersicht!K1","v":"2023/2024"},{"$nulls":19},"Austragungsort:"]
[1,{"$f":"'Wettkampf 1'!B2","v":"Börgerwald II"},null,"Klasse:",{"$nulls":19},"Wettkampftag:"]
[2,{"$f":"'Wettkampf 1'!B3","v":"Neuvrees II"},null,{"$f":"Übersicht!M1","v":"2. Kreisklasse"}]
[3,{"$f":"'Wettkampf 1'!B4","v":"Börger III"},null,{"$f":"Übersicht!P1","v":"Schützen"},{"$nulls":21},"Ansprechpartner für Rückfragen:"]
[4,{"$f":"'Wettkampf 1'!B5","v":"Börger II"},{"$nulls":21},"Name:"]
[5,{"$f":"'Wettkampf 1'!B6","v":"Lahn IV"},{"$nulls":21},"Tel:"]
[6,{"$f":"'Wettkampf 1'!B7","v":"Neuvrees I"},{"$nulls":21},"Standaufsicht:"]
[]
[null,"Name Schütze","Verein/Gruppe","Ergebnis","AW? ",null,"Verein 1",null,"Verein 2",null,"Verein 3",null,"Verein 4",null,"Verein 5",null,"Verein 6",{"$nulls":3},"Geburts-datum",null,"Proberechnung bei Streifen:"]
[1,{"$f":"'Wettkampf 1'!B10","v":"Andre Hanenkamp"},{"$f":"'Wettkampf 1'!C10","v":"Börgerwald II"},null,null,{"$f":"IF(E10=\"x\",\"0\",D10)","v":0},{"$f":"IF(C10=$B$2,F10,0)","v":0},{"$f":"(IF(AND($E10=\"\",$C10=$B$2),1,0))","v":1},{"$f":"IF($C10=$B$3,F10,0)","v":0},{"$f":"(IF(AND($E10=\"\",$C10=$B$3),1,0))","v":0},{"$f":"IF($C10=$B$4,F10,0)","v":0},{"$f":"(IF(AND($E10=\"\",$C10=$B$4),1,0))","v":0},{"$f":"IF($C10=$B$5,F10,0)","v":0},{"$f":"(IF(AND($E10=\"\",$C10=$B$5),1,0))","v":0},{"$f":"IF($C10=$B$6,F10,0)","v":0},{"$f":"(IF(AND($E10=\"\",$C10=$B$6),1,0))","v":0},{"$f":"IF($C10=$B$7,F10,0)","v":0},{"$f":"(IF(AND($E10=\"\",$C10=$B$7),1,0))","v":0},{"$nulls":8},{"$f":"IF(Z10=D10,1,0)","v":1},{"$f":"IF(Z10=0,0,1)","v":0},{"$f":"IF(AA10+AB10=2,\"Korrekt\",\"\")","v":""}]
[2,{"$f":"'Wettkampf 1'!B11","v":"Horst Sabel"},{"$f":"'Wettkampf 1'!C11","v":"Börgerwald II"},null,null,{"$f":"IF(E11=\"x\",\"0\",D11)","v":0},{"$f":"IF(C11=$B$2,F11,0)","v":0},{"$f":"(IF(AND($E11=\"\",$C11=$B$2),1,0))","v":1},{"$f":"IF($C11=$B$3,F11,0)","v":0},{"$f":"(IF(AND($E11=\"\",$C11=$B$3),1,0))","v":0},{"$f":"IF($C11=$B$4,F11,0)","v":0},{"$f":"(IF(AND($E11=\"\",$C11=$B$4),1,0))","v":0},{"$f":"IF($C11=$B$5,F11,0)","v":0},{"$f":"(IF(AND($E11=\"\",$C11=$B$5),1,0))","v":0},{"$f":"IF($C11=$B$6,F11,0)","v":0},{"$f":"(IF(AND($E11=\"\",$C11=$B$6),1,0))","v":0},{"$f":"IF($C11=$B$7,F11,0)","v":0},{"$f":"(IF(AND($E11=\"\",$C11=$B$7),1,0))","v":0},{"$nulls":8},{"$f":"IF(Z11=D11,1,0)","v":1},{"$f":"IF(Z11=0,0,1)","v":0},{"$f":"IF(AA11+AB11=2,\"Korrekt\",\"\")","v":""}]
[3,{"$f":"'Wettkampf 1'!B12","v":"Christian Robben"},{"$f":"'Wettkampf 1'!C12","v":"Börgerwald II"},null,null,0,0,1,0,0,0,0,0,0,0,0,0,0,{"$nulls":8},1,0,""]
[4,{"$f":"'Wettkampf 1'!B13","v":"Mathis Antons"},{"$f":"'Wettkampf 1'!C13","v":"Börgerwald II"},null,null,0,0,1,0,0,0,0,0,0,0,0,0,0,{"$nulls":8},1,0,""]
[5,{"$f":"'Wettkampf 1'!B14","v":"Tobias Sebers"},{"$f":"'Wettkampf 1'!C14","v":"Börgerwald II"},null,null,0,0,1,0,0,0,0,0,0,0,0,0,0,{"$nulls":8},1,0,""]
[6,{"$f":"'Wettkampf 1'!B15","v":"Friedhelm Schroer"},{"$f":"'Wettkampf 1'!C15","v":"Börgerwald II"},null,null,0,0,1,0,0,0,0,0,0,0,0,0,0,{"$nulls":8},1,0,""]
[7,{"$f":"'Wettkampf 1'!B16","v":"Toni Stahl"},{"$f":"'Wettkampf 1'!C16","v":"Börgerwald II"},null,null,0,0,1,0,0,0,0,0,0,0,0,0,0,{"$nulls":8},1,0,""]
[8,{"$f":"'Wettkampf 1'!B17","v":"Martin Hinrichs"},{"$f":"'Wettkampf 1'!C17","v":"Börgerwald II"},null,null,0,0,1,0,0,0,0,0,0,0,0,0,0,{"$nulls":8},1,0,""]
[9,{"$f":"'Wettkampf 1'!B18","v":"Dirk Thunert"},{"$f":"'Wettkampf 1'!C18","v":"Neuvrees II"},null,null,0,0,0,0,1,0,0,0,0,0,0,0,0,{"$nulls":8},1,0,""]
[10,{"$f":"'Wettkampf 1'!B19","v":"Hans Preuth"},{"$f":"'Wettkampf 1'!C19","v":"Neuvrees II"},null,null,0,0,0,0,1,0,0,0,0,0,0,0,0,{"$nulls":8},1,0,""]
[11,{"$f":"'Wettkampf 1'!B20","v":"Karl-Heinz Schrand"},{"$f":"'Wettkampf 1'!C20","v":"Neuvrees II"},null,null,0,0,0,0,1,0,0,0,0,0,0,0,0,{"$nulls":8},1,0,""]
[12,{"$f":"'Wettkampf 1'!B21","v":"Holger Szczepanski"},{"$f":"'Wettkampf 1'!C21","v":"Neuvrees II"},null,null,0,0,0,0,1,0,0,0,0,0,0,0,0,{"$nulls":8},1,0,""]
[13,{"$f":"'Wettkampf 1'!B22","v":"Bernd Witting"},{"$f":"'Wettkampf 1'!C22","v":"Neuvrees II"},null,null,0,0,0,0,1,0,0,0,0,0,0,0,0,{"$nulls":8},1,0,""]
[14,{"$f":"'Wettkampf 1'!B23","v":"Hermann Schwarte"},{"$f":"'Wettkampf 1'!C23","v":"Börger II"},null,null,0,0,0,0,0,0,0,0,1,0,0,0,0,{"$nulls":8},1,0,""]
[15,{"$f":"'Wettkampf 1'!B24","v":"Bernd Rode"},{"$f":"'Wettkampf 1'!C24","v":"Börger III"},null,null,0,0,0,0,0,0,1,0,0,0,0,0,0,{"$nulls":8},1,0,""]
[16,{"$f":"'Wettkampf 1'!B25","v":"Daniel Sebers"},{"$f":"'Wettkampf 1'!C25","v":"Börger III"},null,null,0,0,0,0,0,0,1,0,0,0,0,0,0,{"$nulls":8},1,0,""]
[17,{"$f":"'Wettkampf 1'!B26","v":"Simon Schutenbrock"},{"$f":"'Wettkampf 1'!C26","v":"Börger III"},null,null,0,0,0,0,0,0,1,0,0,0,0,0,0,{"$nulls":8},1,0,""]
[18,{"$f":"'Wettkampf 1'!B27","v":"Jürgen Schroer"},{"$f":"'Wettkampf 1'!C27","v":"Börger III"},null,null,0,0,0,0,0,0,1,0,0,0,0,0,0,{"$nulls":8},1,0,""]
[19,{"$f":"'Wettkampf 1'!B28","v":"Marc Eckmann"},{"$f":"'Wettkampf 1'!C28","v":"Börger II"},null,null,0,0,0,0,0,0,0,0,1,0,0,0,0,{"$nulls":8},1,0,""]
[20,{"$f":"'Wettkampf 1'!B29","v":"Markus Jungsthöfel"},{"$f":"'Wettkampf 1'!C29","v":"Börger II"},null,null,0,0,0,0,0,0,0,0,1,0,0,0,0,{"$nulls":8},1,0,""]
[21,{"$f":"'Wettkampf 1'!B30","v":"Jens Henzen"},{"$f":"'Wettkampf 1'!C30","v":"Börger III"},null,null,0,0,0,0,0,0,1,0,0,0,0,0,0,{"$nulls":8},1,0,""]
[22,{"$f":"'Wettkampf 1'!B31","v":"Uwe Goldenstein"},{"$f":"'Wettkampf 1'!C31","v":"Börger II"},null,null,0,0,0,0,0,0,0,0,1,0,0,0,0,{"$nulls":8},1,0,""]
[23,{"$f":"'Wettkampf 1'!B32","v":"Ingo Zdralik"},{"$f":"'Wettkampf 1'!C32","v":"Börger II"},null,null,0,0,0,0,0,0,0,0,1,0,0,0,0,{"$nulls":8},1,0,""]
[24,{"$f":"'Wettkampf 1'!B33","v":"Schütze 24"},{"$f":"'Wettkampf 1'!C33","v":"Börger II"},null,null,0,0,0,0,0,0,0,0,1,0,0,0,0,{"$nulls":8},1,0,""]
[25,{"$f":"'Wettkampf 1'!B34","v":"Oliver Reinelt"},{"$f":"'Wettkampf 1'!C34","v":"Lahn IV"},null,null,0,0,0,0,0,0,0,0,0,0,1,0,0,{"$nulls":8},1,0,""]
[26,{"$f":"'Wettkampf 1'!B35","v":"Vitalij Schmidt"},{"$f":"'Wettkampf 1'!C35","v":"Lahn IV"},null,null,0,0,0,0,0,0,0,0,0,0,1,0,0,{"$nulls":8},1,0,""]
[27,{"$f":"'Wettkampf 1'!B36","v":"Hermann Benten"},{"$f":"'Wettkampf 1'!C36","v":"Lahn IV"},null,null,0,0,0,0,0,0,0,0,0,0,1,0,0,{"$nulls":8},1,0,""]
[28,{"$f":"'Wettkampf 1'!B37","v":"Johannes Thesing"},{"$f":"'Wettkampf 1'!C37","v":"Lahn IV"},null,null,0,0,0,0,0,0,0,0,0,0,1,0,0,{"$nulls":8},1,0,""]
[29,{"$f":"'Wettkampf 1'!B38","v":"Schütze 29"},{"$f":"'Wettkampf 1'!C38","v":"Lahn IV"},null,null,0,0,0,0,0,0,0,0,0,0,1,0,0,{"$nulls":8},1,0,""]
[30,{"$f":"'Wettkampf 1'!B39","v":"Willi Rolfes"},{"$f":"'Wettkampf 1'!C39","v":"Neuvrees I"},null,null,0,0,0,0,0,0,0,0,0,0,0,0,1,{"$nulls":8},1,0,""]
[31,{"$f":"'Wettkampf 1'!B40","v":"Werner Thyen"},{"$f":"'Wettkampf 1'!C40","v":"Neuvrees I"},null,null,0,0,0,0,0,0,0,0,0,0,0,0,1,{"$nulls":8},1,0,""]
[32,{"$f":"'Wettkampf 1'!B41","v":"Wilfried Breyer"},{"$f":"'Wettkampf 1'!C41","v":"Neuvrees I"},null,null,0,0,0,0,0,0,0,0,0,0,0,0,1,{"$nulls":8},1,0,""]
[33,{"$f":"'Wettkampf 1'!B42","v":"Klaus Steenken"},{"$f":"'Wettkampf 1'!C42","v":"Neuvrees I"},null,null,0,0,0,0,0,0,0,0,0,0,0,0,1,{"$nulls":8},1,0,""]
[34,{"$f":"'Wettkampf 1'!B43","v":"Markus Janßen"},{"$f":"'Wettkampf 1'!C43","v":"Neuvrees I"},null,null,0,0,0,0,0,0,0,0,0,0,0,0,1,{"$nulls":8},1,0,""]
[35,{"$f":"'Wettkampf 1'!B44","v":"Carsten Peters"},{"$f":"'Wettkampf 1'!C44","v":"Neuvrees I"},null,null,0,0,0,0,0,0,0,0,0,0,0,0,1,{"$nulls":8},1,0,""]
[36,{"$f":"'Wettkampf 1'!B45","v":"Dietmar Spekker"},{"$f":"'Wettkampf 1'!C45","v":"Neuvrees I"},null,null,0,0,0,0,0,0,0,0,0,0,0,0,1,{"$nulls":8},1,0,""]
[{"$nulls":6},{"$f":"LARGE(G10:G45,1)+LARGE(G10:G45,2)+LARGE(G10:G45,3)","v":0},{"$f":"SUM(H10:H45)","v":8},{"$f":"LARGE(I10:I45,1)+LARGE(I10:I45,2)+LARGE(I10:I45,3)","v":0},{"$f":"SUM(J10:J45)","v":5},{"$f":"LARGE(K10:K45,1)+LARGE(K10:K45,2)+LARGE(K10:K45,3)","v":0},{"$f":"SUM(L10:L45)","v":5},{"$f":"LARGE(M10:M45,1)+LARGE(M10:M45,2)+LARGE(M10:M45,3)","v":0},{"$f":"SUM(N10:N45)","v":6},{"$f":"LARGE(O10:O45,1)+LARGE(O10:O45,2)+LARGE(O10:O45,3)","v":0},{"$f":"SUM(P10:P45)","v":5},{"$f":"LARGE(Q10:Q45,1)+LARGE(Q10:Q45,2)+LARGE(Q10:Q45,3)","v":0},{"$f":"SUM(R10:S45)","v":7}]
[]
[null,"Bitte beachtet, dass die Standaufsicht benannt werden muss"]

{"sheet":"Ausdruck blank","index":14,"n_rows":48,"n_cols":29,"rows_kept":48,"merged":[[0,3,0,19],[0,24,0,25],[1,3,1,19],[1,24,1,25],[2,3,2,19],[3,3,3,19],[4,24,4,25],[5,24,5,25],[6,24,6,25],[8,22,8,25]]}
[null,"Verein / Gruppe","Ergebnisse",{"$f":"Übersicht!K1","v":"2023/2024"},{"$nulls":19},"Austragungsort:"]
[1,null,null,"Klasse:",{"$nulls":19},"Wettkampftag:"]
[2]
[3,{"$nulls":24},"Ansprechpartner für Rückfragen:"]
[4,{"$nulls":22},"Name:"]
[5,{"$nulls":22},"Tel:"]
[6,{"$nulls":22},"Standaufsicht:"]
[]
[null,"Name Schütze","Verein/Gruppe","Ergebnis","AW? ",null,"Verein 1",null,"Verein 2",null,"Verein 3",null,"Verein 4",null,"Verein 5",null,"Verein 6",{"$nulls":3},"Geburts-datum",null,"Proberechnung bei Streifen:"]
[1,{"$nulls":4},{"$f":"IF(E10=\"x\",\"0\",D10)","v":0},{"$f":"IF(C10=$B$2,F10,0)","v":0},{"$f":"(IF(AND($E10=\"\",$C10=$B$2),1,0))","v":1},{"$f":"IF($C10=$B$3,F10,0)","v":0},{"$f":"(IF(AND($E10=\"\",$C10=$B$3),1,0))","v":1},{"$f":"IF($C10=$B$4,F10,0)","v":0},{"$f":"(IF(AND($E10=\"\",$C10=$B$4),1,0))","v":1},{"$f":"IF($C10=$B$5,F10,0)","v":0},{"$f":"(IF(AND($E10=\"\",$C10=$B$5),1,0))","v":1},{"$f":"IF($C10=$B$6,F10,0)","v":0},{"$f":"(IF(AND($E10=\"\",$C10=$B$6),1,0))","v":1},{"$f":"IF($C10=$B$7,F10,0)","v":0},{"$f":"(IF(AND($E10=\"\",$C10=$B$7),1,0))","v":1},{"$nulls":8},{"$f":"IF(Z10=D10,1,0)","v":1},{"$f":"IF(Z10=0,0,1)","v":0},{"$f":"IF(AA10+AB10=2,\"Korrekt\",\"\")","v":""}]
[2,{"$nulls":4},{"$f":"IF(E11=\"x\",\"0\",D11)","v":0},{"$f":"IF(C11=$B$2,F11,0)","v":0},{"$f":"(IF(AND($E11=\"\",$C11=$B$2),1,0))","v":1},{"$f":"IF($C11=$B$3,F11,0)","v":0},{"$f":"(IF(AND($E11=\"\",$C11=$B$3),1,0))","v":1},{"$f":"IF($C11=$B$4,F11,0)","v":0},{"$f":"(IF(AND($E11=\"\",$C11=$B$4),1,0))","v":1},{"$f":"IF($C11=$B$5,F11,0)","v":0},{"$f":"(IF(AND($E11=\"\",$C11=$B$5),1,0))","v":1},{"$f":"IF($C11=$B$6,F11,0)","v":0},{"$f":"(IF(AND($E11=\"\",$C11=$B$6),1,0))","v":1},{"$f":"IF($C11=$B$7,F11,0)","v":0},{"$f":"(IF(AND($E11=\"\",$C11=$B$7),1,0))","v":1},{"$nulls":8},{"$f":"IF(Z11=D11,1,0)","v":1},{"$f":"IF(Z11=0,0,1)","v":0},{"$f":"IF(AA11+AB11=2,\"Korrekt\",\"\")","v":""}]
[3,{"$nulls":4},0,0,1,0,1,0,1,0,1,0,1,0,1,{"$nulls":8},1,0,""]
[4,{"$nulls":4},0,0,1,0,1,0,1,0,1,0,1,0,1,{"$nulls":8},1,0,""]
[5,{"$nulls":4},0,0,1,0,1,0,1,0,1,0,1,0,1,{"$nulls":8},1,0,""]
[6,{"$nulls":4},0,0,1,0,1,0,1,0,1,0,1,0,1,{"$nulls":8},1,0,""]
[7,{"$nulls":4},0,0,1,0,1,0,1,0,1,0,1,0,1,{"$nulls":8},1,0,""]
[8,{"$nulls":4},0,0,1,0,1,0,1,0,1,0,1,0,1,{"$nulls":8},1,0,""]
[9,{"$nulls":4},0,0,1,0,1,0,1,0,1,0,1,0,1,{"$nulls":8},1,0,""]
[10,{"$nulls":4},0,0,1,0,1,0,1,0,1,0,1,0,1,{"$nulls":8},1,0,""]
[11,{"$nulls":4},0,0,1,0,1,0,1,0,1,0,1,0,1,{"$nulls":8},1,0,""]
[12,{"$nulls":4},0,0,1,0,1,0,1,0,1,0,1,0,1,{"$nulls":8},1,0,""]
[13,{"$nulls":4},0,0,1,0,1,0,1,0,1,0,1,0,1,{"$nulls":8},1,0,""]
[14,{"$nulls":4},0,0,1,0,1,0,1,0,1,0,1,0,1,{"$nulls":8},1,0,""]
[15,{"$nulls":4},0,0,1,0,1,0,1,0,1,0,1,0,1,{"$nulls":8},1,0,""]
[16,{"$nulls":4},0,0,1,0,1,0,1,0,1,0,1,0,1,{"$nulls":8},1,0,""]
[17,{"$nulls":4},0,0,1,0,1,0,1,0,1,0,1,0,1,{"$nulls":8},1,0,""]
[18,{"$nulls":4},0,0,1,0,1,0,1,0,1,0,1,0,1,{"$nulls":8},1,0,""]
[19,{"$nulls":4},0,0,1,0,1,0,1,0,1,0,1,0,1,{"$nulls":8},1,0,""]
[20,{"$nulls":4},0,0,1,0,1,0,1,0,1,0,1,0,1,{"$nulls":8},1,0,""]
[21,{"$nulls":4},0,0,1,0,1,0,1,0,1,0,1,0,1,{"$nulls":8},1,0,""]
[22,{"$nulls":4},0,0,1,0,1,0,1,0,1,0,1,0,1,{"$nulls":8},1,0,""]
[23,{"$nulls":4},0,0,1,0,1,0,1,0,1,0,1,0,1,{"$nulls":8},1,0,""]
[24,{"$nulls":4},0,0,1,0,1,0,1,0,1,0,1,0,1,{"$nulls":8},1,0,""]
[25,{"$nulls":4},0,0,1,0,1,0,1,0,1,0,1,0,1,{"$nulls":8},1,0,""]
[26,{"$nulls":4},0,0,1,0,1,0,1,0,1,0,1,0,1,{"$nulls":8},1,0,""]
[27,{"$nulls":4},0,0,1,0,1,0,1,0,1,0,1,0,1,{"$nulls":8},1,0,""]
[28,{"$nulls":4},0,0,1,0,1,0,1,0,1,0,1,0,1,{"$nulls":8},1,0,""]
[29,{"$nulls":4},0,0,1,0,1,0,1,0,1,0,1,0,1,{"$nulls":8},1,0,""]
[30,{"$nulls":4},0,0,1,0,1,0,1,0,1,0,1,0,1,{"$nulls":8},1,0,""]
[31,{"$nulls":4},0,0,1,0,1,0,1,0,1,0,1,0,1,{"$nulls":8},1,0,""]
[32,{"$nulls":4},0,0,1,0,1,0,1,0,1,0,1,0,1,{"$nulls":8},1,0,""]
[33,{"$nulls":4},0,0,1,0,1,0,1,0,1,0,1,0,1,{"$nulls":8},1,0,""]
[34,{"$nulls":4},0,0,1,0,1,0,1,0,1,0,1,0,1,{"$nulls":8},1,0,""]
[35,{"$nulls":4},0,0,1,0,1,0,1,0,1,0,1,0,1,{"$nulls":8},1,0,""]
[36,{"$nulls":4},0,0,1,0,1,0,1,0,1,0,1,0,1,{"$nulls":8},1,0,""]
[{"$nulls":6},{"$f":"LARGE(G10:G45,1)+LARGE(G10:G45,2)+LARGE(G10:G45,3)","v":0},{"$f":"SUM(H10:H45)","v":36},{"$f":"LARGE(I10:I45,1)+LARGE(I10:I45,2)+LARGE(I10:I45,3)","v":0},{"$f":"SUM(J10:J45)","v":36},{"$f":"LARGE(K10:K45,1)+LARGE(K10:K45,2)+LARGE(K10:K45,3)","v":0},{"$f":"SUM(L10:L45)","v":36},{"$f":"LARGE(M10:M45,1)+LARGE(M10:M45,2)+LARGE(M10:M45,3)","v":0},{"$f":"SUM(N10:N45)","v":36},{"$f":"LARGE(O10:O45,1)+LARGE(O10:O45,2)+LARGE(O10:O45,3)","v":0},{"$f":"SUM(P10:P45)","v":36},{"$f":"LARGE(Q10:Q45,1)+LARGE(Q10:Q45,2)+LARGE(Q10:Q45,3)","v":0},{"$f":"SUM(R10:S45)","v":36}]
[]
[null,"Bitte beachtet, dass die Standaufsicht benannt werden muss"]

{"sheet":"Übersicht Schützen","index":15,"n_rows":37,"n_cols":23,"rows_kept":37,"hidden":true}
[null,null,{"v":1,"d":"1.0"},{"v":2,"d":"2.0"},{"v":3,"d":"3.0"},{"v":4,"d":"4.0"},{"v":5,"d":"5.0"},{"v":6,"d":"6.0"},{"$nulls":3},{"v":7,"d":"7.0"},{"v":8,"d":"8.0"},{"v":9,"d":"9.0"},{"v":10,"d":"10.0"},{"v":11,"d":"11.0"},{"v":12,"d":"12.0"}]
["Ingo Zdralik",{"$f":"VLOOKUP(A2,'Wettkampf 1'!$B$10:$C$45,2,FALSE)","v":"Börger II"},{"$f":"VLOOKUP(A2,'Wettkampf 1'!$B$10:$D$45,3,FALSE)","v":316.1},{"$f":"VLOOKUP($A2,'2'!$B$10:$D$45,3,FALSE)","v":316.2},{"$f":"VLOOKUP($A2,'3'!$B$10:$D$45,3,FALSE)","v":312.9},{"$f":"VLOOKUP($A2,'4'!$B$10:$D$45,3,FALSE)","v":316.6},{"$f":"VLOOKUP($A2,'5'!$B$10:$D$45,3,FALSE)","v":314.1},{"$f":"VLOOKUP($A2,'6'!$B$10:$D$45,3,FALSE)","v":317.8},{"$f":"IF(J2 > 0,K2/J2,0)","v":{"v":315.6166666666667,"d":"315.6"}},{"$f":"VLOOKUP(A2,Formelhilfe!$A$9:$H$44,8,FALSE)","v":{"v":6,"d":"6.0"}},{"$f":"SUM(C2:H2)","v":{"v":1893.7,"d":"1,893.7"}},{"$f":"VLOOKUP($A2,'7'!$B$10:$D$45,3,FALSE)","v":{"v":0,"d":"0.0"}},{"$f":"VLOOKUP($A2,'8'!$B$10:$D$45,3,FALSE)","v":{"v":0,"d":"0.0"}},{"$f":"VLOOKUP($A2,'9'!$B$10:$D$45,3,FALSE)","v":{"v":0,"d":"0.0"}},{"$f":"VLOOKUP($A2,'10'!$B$10:$D$45,3,FALSE)","v":{"v":0,"d":"0.0"}},{"$f":"VLOOKUP($A2,'11'!$B$10:$D$45,3,FALSE)","v":{"v":0,"d":"0.0"}},{"$f":"VLOOKUP($A2,'12'!$B$10:$D$45,3,FALSE)","v":{"v":0,"d":"0.0"}},{"$f":"IF(S2 >0,T2/S2,0)","v":{"v":0,"d":"0.0"}},{"$f":"VLOOKUP(A2,Formelhilfe!$A$9:$O$44,15,FALSE)","v":{"v":0,"d":"0.0"}},{"$f":"SUM(L2:Q2)","v":{"v":0,"d":"0.0"}},{"$f":"IF(V2>0,W2/V2,0)","v":{"v":315.6166666666667,"d":"315.6"}},{"$f":"VLOOKUP(A2,Formelhilfe!$A$9:$P$44,16,FALSE)","v":{"v":6,"d":"6.0"}},{"$f":"SUM(C2:H2,L2:Q2)","v":{"v":1893.7,"d":"1,893.7"}}]
["Johannes Thesing",{"$f":"VLOOKUP(A3,'Wettkampf 1'!$B$10:$C$45,2,FALSE)","v":"Lahn IV"},{"$f":"VLOOKUP(A3,'Wettkampf 1'!$B$10:$D$45,3,FALSE)","v":313.1},{"$f":"VLOOKUP($A3,'2'!$B$10:$D$45,3,FALSE)","v":313.8},{"$f":"VLOOKUP($A3,'3'!$B$10:$D$45,3,FALSE)","v":312.5},{"$f":"VLOOKUP($A3,'4'!$B$10:$D$45,3,FALSE)","v":316.2},{"$f":"VLOOKUP($A3,'5'!$B$10:$D$45,3,FALSE)","v":317.3},{"$f":"VLOOKUP($A3,'6'!$B$10:$D$45,3,FALSE)","v":312.1},{"v":314.1666666666667,"d":"314.2"},{"$f":"VLOOKUP(A3,Formelhilfe!$A$9:$H$44,8,FALSE)","v":{"v":6,"d":"6.0"}},{"v":1885,"d":"1,885.0"},{"$f":"VLOOKUP($A3,'7'!$B$10:$D$45,3,FALSE)","v":{"v":0,"d":"0.0"}},{"$f":"VLOOKUP($A3,'8'!$B$10:$D$45,3,FALSE)","v":{"v":0,"d":"0.0"}},{"$f":"VLOOKUP($A3,'9'!$B$10:$D$45,3,FALSE)","v":{"v":0,"d":"0.0"}},{"$f":"VLOOKUP($A3,'10'!$B$10:$D$45,3,FALSE)","v":{"v":0,"d":"0.0"}},{"$f":"VLOOKUP($A3,'11'!$B$10:$D$45,3,FALSE)","v":{"v":0,"d":"0.0"}},{"$f":"VLOOKUP($A3,'12'!$B$10:$D$45,3,FALSE)","v":{"v":0,"d":"0.0"}},{"v":0,"d":"0.0"},{"$f":"VLOOKUP(A3,Formelhilfe!$A$9:$O$44,15,FALSE)","v":{"v":0,"d":"0.0"}},{"v":0,"d":"0.0"},{"v":314.1666666666667,"d":"314.2"},{"$f":"VLOOKUP(A3,Formelhilfe!$A$9:$P$44,16,FALSE)","v":{"v":6,"d":"6.0"}},{"v":1885,"d":"1,885.0"}]
["Bernd Witting",{"$f":"VLOOKUP(A4,'Wettkampf 1'!$B$10:$C$45,2,FALSE)","v":"Neuvrees II"},{"$f":"VLOOKUP(A4,'Wettkampf 1'!$B$10:$D$45,3,FALSE)","v":{"v":315,"d":"315.0"}},{"$f":"VLOOKUP($A4,'2'!$B$10:$D$45,3,FALSE)","v":311.8},{"$f":"VLOOKUP($A4,'3'!$B$10:$D$45,3,FALSE)","v":313.8},{"$f":"VLOOKUP($A4,'4'!$B$10:$D$45,3,FALSE)","v":309.6},{"$f":"VLOOKUP($A4,'5'!$B$10:$D$45,3,FALSE)","v":310.3},{"$f":"VLOOKUP($A4,'6'!$B$10:$D$45,3,FALSE)","v":311.1},{"v":311.93333333333334,"d":"311.9"},{"$f":"VLOOKUP(A4,Formelhilfe!$A$9:$H$44,8,FALSE)","v":{"v":6,"d":"6.0"}},{"v":1871.6,"d":"1,871.6"},{"$f":"VLOOKUP($A4,'7'!$B$10:$D$45,3,FALSE)","v":{"v":0,"d":"0.0"}},{"$f":"VLOOKUP($A4,'8'!$B$10:$D$45,3,FALSE)","v":{"v":0,"d":"0.0"}},{"$f":"VLOOKUP($A4,'9'!$B$10:$D$45,3,FALSE)","v":{"v":0,"d":"0.0"}},{"$f":"VLOOKUP($A4,'10'!$B$10:$D$45,3,FALSE)","v":{"v":0,"d":"0.0"}},{"$f":"VLOOKUP($A4,'11'!$B$10:$D$45,3,FALSE)","v":{"v":0,"d":"0.0"}},{"$f":"VLOOKUP($A4,'12'!$B$10:$D$45,3,FALSE)","v":{"v":0,"d":"0.0"}},{"v":0,"d":"0.0"},{"$f":"VLOOKUP(A4,Formelhilfe!$A$9:$O$44,15,FALSE)","v":{"v":0,"d":"0.0"}},{"v":0,"d":"0.0"},{"v":311.93333333333334,"d":"311.9"},{"$f":"VLOOKUP(A4,Formelhilfe!$A$9:$P$44,16,FALSE)","v":{"v":6,"d":"6.0"}},{"v":1871.6,"d":"1,871.6"}]
["Dirk Thunert",{"$f":"VLOOKUP(A5,'Wettkampf 1'!$B$10:$C$45,2,FALSE)","v":"Neuvrees II"},{"$f":"VLOOKUP(A5,'Wettkampf 1'!$B$10:$D$45,3,FALSE)","v":{"v":310,"d":"310.0"}},{"$f":"VLOOKUP($A5,'2'!$B$10:$D$45,3,FALSE)","v":310.9},{"$f":"VLOOKUP($A5,'3'!$B$10:$D$45,3,FALSE)","v":311.7},{"$f":"VLOOKUP($A5,'4'!$B$10:$D$45,3,FALSE)","v":310.9},{"$f":"VLOOKUP($A5,'5'!$B$10:$D$45,3,FALSE)","v":312.5},{"$f":"VLOOKUP($A5,'6'!$B$10:$D$45,3,FALSE)","v":{"v":313,"d":"313.0"}},311.5,{"$f":"VLOOKUP(A5,Formelhilfe!$A$9:$H$44,8,FALSE)","v":{"v":6,"d":"6.0"}},{"v":1869,"d":"1,869.0"},{"$f":"VLOOKUP($A5,'7'!$B$10:$D$45,3,FALSE)","v":{"v":0,"d":"0.0"}},{"$f":"VLOOKUP($A5,'8'!$B$10:$D$45,3,FALSE)","v":{"v":0,"d":"0.0"}},{"$f":"VLOOKUP($A5,'9'!$B$10:$D$45,3,FALSE)","v":{"v":0,"d":"0.0"}},{"$f":"VLOOKUP($A5,'10'!$B$10:$D$45,3,FALSE)","v":{"v":0,"d":"0.0"}},{"$f":"VLOOKUP($A5,'11'!$B$10:$D$45,3,FALSE)","v":{"v":0,"d":"0.0"}},{"$f":"VLOOKUP($A5,'12'!$B$10:$D$45,3,FALSE)","v":{"v":0,"d":"0.0"}},{"v":0,"d":"0.0"},{"$f":"VLOOKUP(A5,Formelhilfe!$A$9:$O$44,15,FALSE)","v":{"v":0,"d":"0.0"}},{"v":0,"d":"0.0"},311.5,{"$f":"VLOOKUP(A5,Formelhilfe!$A$9:$P$44,16,FALSE)","v":{"v":6,"d":"6.0"}},{"v":1869,"d":"1,869.0"}]
["Simon Schutenbrock",{"$f":"VLOOKUP(A6,'Wettkampf 1'!$B$10:$C$45,2,FALSE)","v":"Börger III"},{"$f":"VLOOKUP(A6,'Wettkampf 1'!$B$10:$D$45,3,FALSE)","v":313.8},{"$f":"VLOOKUP($A6,'2'!$B$10:$D$45,3,FALSE)","v":311.1},{"$f":"VLOOKUP($A6,'3'!$B$10:$D$45,3,FALSE)","v":307.6},{"$f":"VLOOKUP($A6,'4'!$B$10:$D$45,3,FALSE)","v":314.4},{"$f":"VLOOKUP($A6,'5'!$B$10:$D$45,3,FALSE)","v":309.6},{"$f":"VLOOKUP($A6,'6'!$B$10:$D$45,3,FALSE)","v":{"v":311,"d":"311.0"}},{"v":311.25,"d":"311.3"},{"$f":"VLOOKUP(A6,Formelhilfe!$A$9:$H$44,8,FALSE)","v":{"v":6,"d":"6.0"}},{"v":1867.5,"d":"1,867.5"},{"$f":"VLOOKUP($A6,'7'!$B$10:$D$45,3,FALSE)","v":{"v":0,"d":"0.0"}},{"$f":"VLOOKUP($A6,'8'!$B$10:$D$45,3,FALSE)","v":{"v":0,"d":"0.0"}},{"$f":"VLOOKUP($A6,'9'!$B$10:$D$45,3,FALSE)","v":{"v":0,"d":"0.0"}},{"$f":"VLOOKUP($A6,'10'!$B$10:$D$45,3,FALSE)","v":{"v":0,"d":"0.0"}},{"$f":"VLOOKUP($A6,'11'!$B$10:$D$45,3,FALSE)","v":{"v":0,"d":"0.0"}},{"$f":"VLOOKUP($A6,'12'!$B$10:$D$45,3,FALSE)","v":{"v":0,"d":"0.0"}},{"v":0,"d":"0.0"},{"$f":"VLOOKUP(A6,Formelhilfe!$A$9:$O$44,15,FALSE)","v":{"v":0,"d":"0.0"}},{"v":0,"d":"0.0"},{"v":311.25,"d":"311.3"},{"$f":"VLOOKUP(A6,Formelhilfe!$A$9:$P$44,16,FALSE)","v":{"v":6,"d":"6.0"}},{"v":1867.5,"d":"1,867.5"}]
["Willi Rolfes",{"$f":"VLOOKUP(A7,'Wettkampf 1'!$B$10:$C$45,2,FALSE)","v":"Neuvrees I"},{"$f":"VLOOKUP(A7,'Wettkampf 1'!$B$10:$D$45,3,FALSE)","v":310.7},{"$f":"VLOOKUP($A7,'2'!$B$10:$D$45,3,FALSE)","v":312.8},{"$f":"VLOOKUP($A7,'3'!$B$10:$D$45,3,FALSE)","v":308.5},{"$f":"VLOOKUP($A7,'4'!$B$10:$D$45,3,FALSE)","v":311.1},{"$f":"VLOOKUP($A7,'5'!$B$10:$D$45,3,FALSE)","v":309.9},{"$f":"VLOOKUP($A7,'6'!$B$10:$D$45,3,FALSE)","v":313.8},{"v":311.1333333333333,"d":"311.1"},{"$f":"VLOOKUP(A7,Formelhilfe!$A$9:$H$44,8,FALSE)","v":{"v":6,"d":"6.0"}},{"v":1866.8,"d":"1,866.8"},{"$f":"VLOOKUP($A7,'7'!$B$10:$D$45,3,FALSE)","v":{"v":0,"d":"0.0"}},{"$f":"VLOOKUP($A7,'8'!$B$10:$D$45,3,FALSE)","v":{"v":0,"d":"0.0"}},{"$f":"VLOOKUP($A7,'9'!$B$10:$D$45,3,FALSE)","v":{"v":0,"d":"0.0"}},{"$f":"VLOOKUP($A7,'10'!$B$10:$D$45,3,FALSE)","v":{"v":0,"d":"0.0"}},{"$f":"VLOOKUP($A7,'11'!$B$10:$D$45,3,FALSE)","v":{"v":0,"d":"0.0"}},{"$f":"VLOOKUP($A7,'12'!$B$10:$D$45,3,FALSE)","v":{"v":0,"d":"0.0"}},{"v":0,"d":"0.0"},{"$f":"VLOOKUP(A7,Formelhilfe!$A$9:$O$44,15,FALSE)","v":{"v":0,"d":"0.0"}},{"v":0,"d":"0.0"},{"v":311.1333333333333,"d":"311.1"},{"$f":"VLOOKUP(A7,Formelhilfe!$A$9:$P$44,16,FALSE)","v":{"v":6,"d":"6.0"}},{"v":1866.8,"d":"1,866.8"}]
["Andre Hanenkamp",{"$f":"VLOOKUP(A8,'Wettkampf 1'!$B$10:$C$45,2,FALSE)","v":"Börgerwald II"},{"$f":"VLOOKUP(A8,'Wettkampf 1'!$B$10:$D$45,3,FALSE)","v":306.5},{"$f":"VLOOKUP($A8,'2'!$B$10:$D$45,3,FALSE)","v":311.8},{"$f":"VLOOKUP($A8,'3'!$B$10:$D$45,3,FALSE)","v":307.1},{"$f":"VLOOKUP($A8,'4'!$B$10:$D$45,3,FALSE)","v":311.4},{"$f":"VLOOKUP($A8,'5'!$B$10:$D$45,3,FALSE)","v":314.9},{"$f":"VLOOKUP($A8,'6'!$B$10:$D$45,3,FALSE)","v":310.8},{"v":310.41666666666663,"d":"310.4"},{"$f":"VLOOKUP(A8,Formelhilfe!$A$9:$H$44,8,FALSE)","v":{"v":6,"d":"6.0"}},{"v":1862.4999999999998,"d":"1,862.5"},{"$f":"VLOOKUP($A8,'7'!$B$10:$D$45,3,FALSE)","v":{"v":0,"d":"0.0"}},{"$f":"VLOOKUP($A8,'8'!$B$10:$D$45,3,FALSE)","v":{"v":0,"d":"0.0"}},{"$f":"VLOOKUP($A8,'9'!$B$10:$D$45,3,FALSE)","v":{"v":0,"d":"0.0"}},{"$f":"VLOOKUP($A8,'10'!$B$10:$D$45,3,FALSE)","v":{"v":0,"d":"0.0"}},{"$f":"VLOOKUP($A8,'11'!$B$10:$D$45,3,FALSE)","v":{"v":0,"d":"0.0"}},{"$f":"VLOOKUP($A8,'12'!$B$10:$D$45,3,FALSE)","v":{"v":0,"d":"0.0"}},{"v":0,"d":"0.0"},{"$f":"VLOOKUP(A8,Formelhilfe!$A$9:$O$44,15,FALSE)","v":{"v":0,"d":"0.0"}},{"v":0,"d":"0.0"},{"v":310.41666666666663,"d":"310.4"},{"$f":"VLOOKUP(A8,Formelhilfe!$A$9:$P$44,16,FALSE)","v":{"v":6,"d":"6.0"}},{"v":1862.4999999999998,"d":"1,862.5"}]
["Horst Sabel",{"$f":"VLOOKUP(A9,'Wettkampf 1'!$B$10:$C$45,2,FALSE)","v":"Börgerwald II"},{"$f":"VLOOKUP(A9,'Wettkampf 1'!$B$10:$D$45,3,FALSE)","v":311.8},{"$f":"VLOOKUP($A9,'2'!$B$10:$D$45,3,FALSE)","v":314.7},{"$f":"VLOOKUP($A9,'3'!$B$10:$D$45,3,FALSE)","v":308.9},{"$f":"VLOOKUP($A9,'4'!$B$10:$D$45,3,FALSE)","v":{"v":309,"d":"309.0"}},{"$f":"VLOOKUP($A9,'5'!$B$10:$D$45,3,FALSE)","v":309.4},{"$f":"VLOOKUP($A9,'6'!$B$10:$D$45,3,FALSE)","v":{"v":308,"d":"308.0"}},310.3,{"$f":"VLOOKUP(A9,Formelhilfe!$A$9:$H$44,8,FALSE)","v":{"v":6,"d":"6.0"}},{"v":1861.8000000000002,"d":"1,861.8"},{"$f":"VLOOKUP($A9,'7'!$B$10:$D$45,3,FALSE)","v":{"v":0,"d":"0.0"}},{"$f":"VLOOKUP($A9,'8'!$B$10:$D$45,3,FALSE)","v":{"v":0,"d":"0.0"}},{"$f":"VLOOKUP($A9,'9'!$B$10:$D$45,3,FALSE)","v":{"v":0,"d":"0.0"}},{"$f":"VLOOKUP($A9,'10'!$B$10:$D$45,3,FALSE)","v":{"v":0,"d":"0.0"}},{"$f":"VLOOKUP($A9,'11'!$B$10:$D$45,3,FALSE)","v":{"v":0,"d":"0.0"}},{"$f":"VLOOKUP($A9,'12'!$B$10:$D$45,3,FALSE)","v":{"v":0,"d":"0.0"}},{"v":0,"d":"0.0"},{"$f":"VLOOKUP(A9,Formelhilfe!$A$9:$O$44,15,FALSE)","v":{"v":0,"d":"0.0"}},{"v":0,"d":"0.0"},310.3,{"$f":"VLOOKUP(A9,Formelhilfe!$A$9:$P$44,16,FALSE)","v":{"v":6,"d":"6.0"}},{"v":1861.8000000000002,"d":"1,861.8"}]
["Markus Janßen",{"$f":"VLOOKUP(A10,'Wettkampf 1'!$B$10:$C$45,2,FALSE)","v":"Neuvrees I"},{"$f":"VLOOKUP(A10,'Wettkampf 1'!$B$10:$D$45,3,FALSE)","v":{"v":310,"d":"310.0"}},{"$f":"VLOOKUP($A10,'2'!$B$10:$D$45,3,FALSE)","v":311.6},{"$f":"VLOOKUP($A10,'3'!$B$10:$D$45,3,FALSE)","v":{"v":308,"d":"308.0"}},{"$f":"VLOOKUP($A10,'4'!$B$10:$D$45,3,FALSE)","v":309.9},{"$f":"VLOOKUP($A10,'5'!$B$10:$D$45,3,FALSE)","v":310.2},{"$f":"VLOOKUP($A10,'6'!$B$10:$D$45,3,FALSE)","v":310.9},{"v":310.09999999999997,"d":"310.1"},{"$f":"VLOOKUP(A10,Formelhilfe!$A$9:$H$44,8,FALSE)","v":{"v":6,"d":"6.0"}},{"v":1860.6,"d":"1,860.6"},{"$f":"VLOOKUP($A10,'7'!$B$10:$D$45,3,FALSE)","v":{"v":0,"d":"0.0"}},{"$f":"VLOOKUP($A10,'8'!$B$10:$D$45,3,FALSE)","v":{"v":0,"d":"0.0"}},{"$f":"VLOOKUP($A10,'9'!$B$10:$D$45,3,FALSE)","v":{"v":0,"d":"0.0"}},{"$f":"VLOOKUP($A10,'10'!$B$10:$D$45,3,FALSE)","v":{"v":0,"d":"0.0"}},{"$f":"VLOOKUP($A10,'11'!$B$10:$D$45,3,FALSE)","v":{"v":0,"d":"0.0"}},{"$f":"VLOOKUP($A10,'12'!$B$10:$D$45,3,FALSE)","v":{"v":0,"d":"0.0"}},{"v":0,"d":"0.0"},{"$f":"VLOOKUP(A10,Formelhilfe!$A$9:$O$44,15,FALSE)","v":{"v":0,"d":"0.0"}},{"v":0,"d":"0.0"},{"v":310.09999999999997,"d":"310.1"},{"$f":"VLOOKUP(A10,Formelhilfe!$A$9:$P$44,16,FALSE)","v":{"v":6,"d":"6.0"}},{"v":1860.6,"d":"1,860.6"}]
["Karl-Heinz Schrand",{"$f":"VLOOKUP(A11,'Wettkampf 1'!$B$10:$C$45,2,FALSE)","v":"Neuvrees II"},{"$f":"VLOOKUP(A11,'Wettkampf 1'!$B$10:$D$45,3,FALSE)","v":307.5},{"$f":"VLOOKUP($A11,'2'!$B$10:$D$45,3,FALSE)","v":308.7},{"$f":"VLOOKUP($A11,'3'!$B$10:$D$45,3,FALSE)","v":312.5},{"$f":"VLOOKUP($A11,'4'!$B$10:$D$45,3,FALSE)","v":311.1},{"$f":"VLOOKUP($A11,'5'!$B$10:$D$45,3,FALSE)","v":313.1},{"$f":"VLOOKUP($A11,'6'!$B$10:$D$45,3,FALSE)","v":307.6},{"v":310.0833333333333,"d":"310.1"},{"$f":"VLOOKUP(A11,Formelhilfe!$A$9:$H$44,8,FALSE)","v":{"v":6,"d":"6.0"}},{"v":1860.5,"d":"1,860.5"},{"$f":"VLOOKUP($A11,'7'!$B$10:$D$45,3,FALSE)","v":{"v":0,"d":"0.0"}},{"$f":"VLOOKUP($A11,'8'!$B$10:$D$45,3,FALSE)","v":{"v":0,"d":"0.0"}},{"$f":"VLOOKUP($A11,'9'!$B$10:$D$45,3,FALSE)","v":{"v":0,"d":"0.0"}},{"$f":"VLOOKUP($A11,'10'!$B$10:$D$45,3,FALSE)","v":{"v":0,"d":"0.0"}},{"$f":"VLOOKUP($A11,'11'!$B$10:$D$45,3,FALSE)","v":{"v":0,"d":"0.0"}},{"$f":"VLOOKUP($A11,'12'!$B$10:$D$45,3,FALSE)","v":{"v":0,"d":"0.0"}},{"v":0,"d":"0.0"},{"$f":"VLOOKUP(A11,Formelhilfe!$A$9:$O$44,15,FALSE)","v":{"v":0,"d":"0.0"}},{"v":0,"d":"0.0"},{"v":310.0833333333333,"d":"310.1"},{"$f":"VLOOKUP(A11,Formelhilfe!$A$9:$P$44,16,FALSE)","v":{"v":6,"d":"6.0"}},{"v":1860.5,"d":"1,860.5"}]
["Vitalij Schmidt",{"$f":"VLOOKUP(A12,'Wettkampf 1'!$B$10:$C$45,2,FALSE)","v":"Lahn IV"},{"$f":"VLOOKUP(A12,'Wettkampf 1'!$B$10:$D$45,3,FALSE)","v":308.8},{"$f":"VLOOKUP($A12,'2'!$B$10:$D$45,3,FALSE)","v":307.8},{"$f":"VLOOKUP($A12,'3'!$B$10:$D$45,3,FALSE)","v":310.4},{"$f":"VLOOKUP($A12,'4'!$B$10:$D$45,3,FALSE)","v":314.5},{"$f":"VLOOKUP($A12,'5'!$B$10:$D$45,3,FALSE)","v":306.7},{"$f":"VLOOKUP($A12,'6'!$B$10:$D$45,3,FALSE)","v":311.8},{"v":310,"d":"310.0"},{"$f":"VLOOKUP(A12,Formelhilfe!$A$9:$H$44,8,FALSE)","v":{"v":6,"d":"6.0"}},{"v":1860,"d":"1,860.0"},{"$f":"VLOOKUP($A12,'7'!$B$10:$D$45,3,FALSE)","v":{"v":0,"d":"0.0"}},{"$f":"VLOOKUP($A12,'8'!$B$10:$D$45,3,FALSE)","v":{"v":0,"d":"0.0"}},{"$f":"VLOOKUP($A12,'9'!$B$10:$D$45,3,FALSE)","v":{"v":0,"d":"0.0"}},{"$f":"VLOOKUP($A12,'10'!$B$10:$D$45,3,FALSE)","v":{"v":0,"d":"0.0"}},{"$f":"VLOOKUP($A12,'11'!$B$10:$D$45,3,FALSE)","v":{"v":0,"d":"0.0"}},{"$f":"VLOOKUP($A12,'12'!$B$10:$D$45,3,FALSE)","v":{"v":0,"d":"0.0"}},{"v":0,"d":"0.0"},{"$f":"VLOOKUP(A12,Formelhilfe!$A$9:$O$44,15,FALSE)","v":{"v":0,"d":"0.0"}},{"v":0,"d":"0.0"},{"v":310,"d":"310.0"},{"$f":"VLOOKUP(A12,Formelhilfe!$A$9:$P$44,16,FALSE)","v":{"v":6,"d":"6.0"}},{"v":1860,"d":"1,860.0"}]
["Jens Henzen",{"$f":"VLOOKUP(A13,'Wettkampf 1'!$B$10:$C$45,2,FALSE)","v":"Börger III"},{"$f":"VLOOKUP(A13,'Wettkampf 1'!$B$10:$D$45,3,FALSE)","v":305.6},{"$f":"VLOOKUP($A13,'2'!$B$10:$D$45,3,FALSE)","v":304.2},{"$f":"VLOOKUP($A13,'3'!$B$10:$D$45,3,FALSE)","v":309.7},{"$f":"VLOOKUP($A13,'4'!$B$10:$D$45,3,FALSE)","v":308.3},{"$f":"VLOOKUP($A13,'5'!$B$10:$D$45,3,FALSE)","v":313.1},{"$f":"VLOOKUP($A13,'6'!$B$10:$D$45,3,FALSE)","v":313.6},{"v":309.0833333333333,"d":"309.1"},{"$f":"VLOOKUP(A13,Formelhilfe!$A$9:$H$44,8,FALSE)","v":{"v":6,"d":"6.0"}},{"v":1854.5,"d":"1,854.5"},{"$f":"VLOOKUP($A13,'7'!$B$10:$D$45,3,FALSE)","v":{"v":0,"d":"0.0"}},{"$f":"VLOOKUP($A13,'8'!$B$10:$D$45,3,FALSE)","v":{"v":0,"d":"0.0"}},{"$f":"VLOOKUP($A13,'9'!$B$10:$D$45,3,FALSE)","v":{"v":0,"d":"0.0"}},{"$f":"VLOOKUP($A13,'10'!$B$10:$D$45,3,FALSE)","v":{"v":0,"d":"0.0"}},{"$f":"VLOOKUP($A13,'11'!$B$10:$D$45,3,FALSE)","v":{"v":0,"d":"0.0"}},{"$f":"VLOOKUP($A13,'12'!$B$10:$D$45,3,FALSE)","v":{"v":0,"d":"0.0"}},{"v":0,"d":"0.0"},{"$f":"VLOOKUP(A13,Formelhilfe!$A$9:$O$44,15,FALSE)","v":{"v":0,"d":"0.0"}},{"v":0,"d":"0.0"},{"v":309.0833333333333,"d":"309.1"},{"$f":"VLOOKUP(A13,Formelhilfe!$A$9:$P$44,16,FALSE)","v":{"v":6,"d":"6.0"}},{"v":1854.5,"d":"1,854.5"}]
["Hermann Benten",{"$f":"VLOOKUP(A14,'Wettkampf 1'!$B$10:$C$45,2,FALSE)","v":"Lahn IV"},{"$f":"VLOOKUP(A14,'Wettkampf 1'!$B$10:$D$45,3,FALSE)","v":307.6},{"$f":"VLOOKUP($A14,'2'!$B$10:$D$45,3,FALSE)","v":311.2},{"$f":"VLOOKUP($A14,'3'!$B$10:$D$45,3,FALSE)","v":310.1},{"$f":"VLOOKUP($A14,'4'!$B$10:$D$45,3,FALSE)","v":309.4},{"$f":"VLOOKUP($A14,'5'!$B$10:$D$45,3,FALSE)","v":309.4},{"$f":"VLOOKUP($A14,'6'!$B$10:$D$45,3,FALSE)","v":304.1},{"v":308.63333333333327,"d":"308.6"},{"$f":"VLOOKUP(A14,Formelhilfe!$A$9:$H$44,8,FALSE)","v":{"v":6,"d":"6.0"}},{"v":1851.7999999999997,"d":"1,851.8"},{"$f":"VLOOKUP($A14,'7'!$B$10:$D$45,3,FALSE)","v":{"v":0,"d":"0.0"}},{"$f":"VLOOKUP($A14,'8'!$B$10:$D$45,3,FALSE)","v":{"v":0,"d":"0.0"}},{"$f":"VLOOKUP($A14,'9'!$B$10:$D$45,3,FALSE)","v":{"v":0,"d":"0.0"}},{"$f":"VLOOKUP($A14,'10'!$B$10:$D$45,3,FALSE)","v":{"v":0,"d":"0.0"}},{"$f":"VLOOKUP($A14,'11'!$B$10:$D$45,3,FALSE)","v":{"v":0,"d":"0.0"}},{"$f":"VLOOKUP($A14,'12'!$B$10:$D$45,3,FALSE)","v":{"v":0,"d":"0.0"}},{"v":0,"d":"0.0"},{"$f":"VLOOKUP(A14,Formelhilfe!$A$9:$O$44,15,FALSE)","v":{"v":0,"d":"0.0"}},{"v":0,"d":"0.0"},{"v":308.63333333333327,"d":"308.6"},{"$f":"VLOOKUP(A14,Formelhilfe!$A$9:$P$44,16,FALSE)","v":{"v":6,"d":"6.0"}},{"v":1851.7999999999997,"d":"1,851.8"}]
["Friedhelm Schroer",{"$f":"VLOOKUP(A15,'Wettkampf 1'!$B$10:$C$45,2,FALSE)","v":"Börgerwald II"},{"$f":"VLOOKUP(A15,'Wettkampf 1'!$B$10:$D$45,3,FALSE)","v":{"v":307,"d":"307.0"}},{"$f":"VLOOKUP($A15,'2'!$B$10:$D$45,3,FALSE)","v":307.4},{"$f":"VLOOKUP($A15,'3'!$B$10:$D$45,3,FALSE)","v":311.3},{"$f":"VLOOKUP($A15,'4'!$B$10:$D$45,3,FALSE)","v":310.7},{"$f":"VLOOKUP($A15,'5'!$B$10:$D$45,3,FALSE)","v":305.4},{"$f":"VLOOKUP($A15,'6'!$B$10:$D$45,3,FALSE)","v":{"v":309,"d":"309.0"}},{"v":308.4666666666667,"d":"308.5"},{"$f":"VLOOKUP(A15,Formelhilfe!$A$9:$H$44,8,FALSE)","v":{"v":6,"d":"6.0"}},{"v":1850.8000000000002,"d":"1,850.8"},{"$f":"VLOOKUP($A15,'7'!$B$10:$D$45,3,FALSE)","v":{"v":0,"d":"0.0"}},{"$f":"VLOOKUP($A15,'8'!$B$10:$D$45,3,FALSE)","v":{"v":0,"d":"0.0"}},{"$f":"VLOOKUP($A15,'9'!$B$10:$D$45,3,FALSE)","v":{"v":0,"d":"0.0"}},{"$f":"VLOOKUP($A15,'10'!$B$10:$D$45,3,FALSE)","v":{"v":0,"d":"0.0"}},{"$f":"VLOOKUP($A15,'11'!$B$10:$D$45,3,FALSE)","v":{"v":0,"d":"0.0"}},{"$f":"VLOOKUP($A15,'12'!$B$10:$D$45,3,FALSE)","v":{"v":0,"d":"0.0"}},{"v":0,"d":"0.0"},{"$f":"VLOOKUP(A15,Formelhilfe!$A$9:$O$44,15,FALSE)","v":{"v":0,"d":"0.0"}},{"v":0,"d":"0.0"},{"v":308.4666666666667,"d":"308.5"},{"$f":"VLOOKUP(A15,Formelhilfe!$A$9:$P$44,16,FALSE)","v":{"v":6,"d":"6.0"}},{"v":1850.8000000000002,"d":"1,850.8"}]
["Holger Szczepanski",{"$f":"VLOOKUP(A16,'Wettkampf 1'!$B$10:$C$45,2,FALSE)","v":"Neuvrees II"},{"$f":"VLOOKUP(A16,'Wettkampf 1'!$B$10:$D$45,3,FALSE)","v":303.2},{"$f":"VLOOKUP($A16,'2'!$B$10:$D$45,3,FALSE)","v":311.6},{"$f":"VLOOKUP($A16,'3'!$B$10:$D$45,3,FALSE)","v":305.9},{"$f":"VLOOKUP($A16,'4'!$B$10:$D$45,3,FALSE)","v":309.2},{"$f":"VLOOKUP($A16,'5'!$B$10:$D$45,3,FALSE)","v":310.2},{"$f":"VLOOKUP($A16,'6'!$B$10:$D$45,3,FALSE)","v":309.6},{"v":308.2833333333333,"d":"308.3"},{"$f":"VLOOKUP(A16,Formelhilfe!$A$9:$H$44,8,FALSE)","v":{"v":6,"d":"6.0"}},{"v":1849.6999999999998,"d":"1,849.7"},{"$f":"VLOOKUP($A16,'7'!$B$10:$D$45,3,FALSE)","v":{"v":0,"d":"0.0"}},{"$f":"VLOOKUP($A16,'8'!$B$10:$D$45,3,FALSE)","v":{"v":0,"d":"0.0"}},{"$f":"VLOOKUP($A16,'9'!$B$10:$D$45,3,FALSE)","v":{"v":0,"d":"0.0"}},{"$f":"VLOOKUP($A16,'10'!$B$10:$D$45,3,FALSE)","v":{"v":0,"d":"0.0"}},{"$f":"VLOOKUP($A16,'11'!$B$10:$D$45,3,FALSE)","v":{"v":0,"d":"0.0"}},{"$f":"VLOOKUP($A16,'12'!$B$10:$D$45,3,FALSE)","v":{"v":0,"d":"0.0"}},{"v":0,"d":"0.0"},{"$f":"VLOOKUP(A16,Formelhilfe!$A$9:$O$44,15,FALSE)","v":{"v":0,"d":"0.0"}},{"v":0,"d":"0.0"},{"v":308.2833333333333,"d":"308.3"},{"$f":"VLOOKUP(A16,Formelhilfe!$A$9:$P$44,16,FALSE)","v":{"v":6,"d":"6.0"}},{"v":1849.6999999999998,"d":"1,849.7"}]
["Jürgen Schroer",{"$f":"VLOOKUP(A17,'Wettkampf 1'!$B$10:$C$45,2,FALSE)","v":"Börger III"},{"$f":"VLOOKUP(A17,'Wettkampf 1'!$B$10:$D$45,3,FALSE)","v":307.2},{"$f":"VLOOKUP($A17,'2'!$B$10:$D$45,3,FALSE)","v":310.3},{"$f":"VLOOKUP($A17,'3'!$B$10:$D$45,3,FALSE)","v":307.6},{"$f":"VLOOKUP($A17,'4'!$B$10:$D$45,3,FALSE)","v":307.1},{"$f":"VLOOKUP($A17,'5'!$B$10:$D$45,3,FALSE)","v":314.1},{"$f":"VLOOKUP($A17,'6'!$B$10:$D$45,3,FALSE)","v":303.3},{"v":308.2666666666667,"d":"308.3"},{"$f":"VLOOKUP(A17,Formelhilfe!$A$9:$H$44,8,FALSE)","v":{"v":6,"d":"6.0"}},{"v":1849.6000000000001,"d":"1,849.6"},{"$f":"VLOOKUP($A17,'7'!$B$10:$D$45,3,FALSE)","v":{"v":0,"d":"0.0"}},{"$f":"VLOOKUP($A17,'8'!$B$10:$D$45,3,FALSE)","v":{"v":0,"d":"0.0"}},{"$f":"VLOOKUP($A17,'9'!$B$10:$D$45,3,FALSE)","v":{"v":0,"d":"0.0"}},{"$f":"VLOOKUP($A17,'10'!$B$10:$D$45,3,FALSE)","v":{"v":0,"d":"0.0"}},{"$f":"VLOOKUP($A17,'11'!$B$10:$D$45,3,FALSE)","v":{"v":0,"d":"0.0"}},{"$f":"VLOOKUP($A17,'12'!$B$10:$D$45,3,FALSE)","v":{"v":0,"d":"0.0"}},{"v":0,"d":"0.0"},{"$f":"VLOOKUP(A17,Formelhilfe!$A$9:$O$44,15,FALSE)","v":{"v":0,"d":"0.0"}},{"v":0,"d":"0.0"},{"v":308.2666666666667,"d":"308.3"},{"$f":"VLOOKUP(A17,Formelhilfe!$A$9:$P$44,16,FALSE)","v":{"v":6,"d":"6.0"}},{"v":1849.6000000000001,"d":"1,849.6"}]
["Klaus Steenken",{"$f":"VLOOKUP(A18,'Wettkampf 1'!$B$10:$C$45,2,FALSE)","v":"Neuvrees I"},{"$f":"VLOOKUP(A18,'Wettkampf 1'!$B$10:$D$45,3,FALSE)","v":308.9},{"$f":"VLOOKUP($A18,'2'!$B$10:$D$45,3,FALSE)","v":{"v":305,"d":"305.0"}},{"$f":"VLOOKUP($A18,'3'!$B$10:$D$45,3,FALSE)","v":308.3},{"$f":"VLOOKUP($A18,'4'!$B$10:$D$45,3,FALSE)","v":309.2},{"$f":"VLOOKUP($A18,'5'!$B$10:$D$45,3,FALSE)","v":309.4},{"$f":"VLOOKUP($A18,'6'!$B$10:$D$45,3,FALSE)","v":308.2},{"v":308.1666666666667,"d":"308.2"},{"$f":"VLOOKUP(A18,Formelhilfe!$A$9:$H$44,8,FALSE)","v":{"v":6,"d":"6.0"}},{"v":1849.0000000000002,"d":"1,849.0"},{"$f":"VLOOKUP($A18,'7'!$B$10:$D$45,3,FALSE)","v":{"v":0,"d":"0.0"}},{"$f":"VLOOKUP($A18,'8'!$B$10:$D$45,3,FALSE)","v":{"v":0,"d":"0.0"}},{"$f":"VLOOKUP($A18,'9'!$B$10:$D$45,3,FALSE)","v":{"v":0,"d":"0.0"}},{"$f":"VLOOKUP($A18,'10'!$B$10:$D$45,3,FALSE)","v":{"v":0,"d":"0.0"}},{"$f":"VLOOKUP($A18,'11'!$B$10:$D$45,3,FALSE)","v":{"v":0,"d":"0.0"}},{"$f":"VLOOKUP($A18,'12'!$B$10:$D$45,3,FALSE)","v":{"v":0,"d":"0.0"}},{"v":0,"d":"0.0"},{"$f":"VLOOKUP(A18,Formelhilfe!$A$9:$O$44,15,FALSE)","v":{"v":0,"d":"0.0"}},{"v":0,"d":"0.0"},{"v":308.1666666666667,"d":"308.2"},{"$f":"VLOOKUP(A18,Formelhilfe!$A$9:$P$44,16,FALSE)","v":{"v":6,"d":"6.0"}},{"v":1849.0000000000002,"d":"1,849.0"}]
["Wilfried Breyer",{"$f":"VLOOKUP(A19,'Wettkampf 1'!$B$10:$C$45,2,FALSE)","v":"Neuvrees I"},{"$f":"VLOOKUP(A19,'Wettkampf 1'!$B$10:$D$45,3,FALSE)","v":311.3},{"$f":"VLOOKUP($A19,'2'!$B$10:$D$45,3,FALSE)","v":302.6},{"$f":"VLOOKUP($A19,'3'!$B$10:$D$45,3,FALSE)","v":308.6},{"$f":"VLOOKUP($A19,'4'!$B$10:$D$45,3,FALSE)","v":310.7},{"$f":"VLOOKUP($A19,'5'!$B$10:$D$45,3,FALSE)","v":312.1},{"$f":"VLOOKUP($A19,'6'!$B$10:$D$45,3,FALSE)","v":302.6},{"v":307.98333333333335,"d":"308.0"},{"$f":"VLOOKUP(A19,Formelhilfe!$A$9:$H$44,8,FALSE)","v":{"v":6,"d":"6.0"}},{"v":1847.9,"d":"1,847.9"},{"$f":"VLOOKUP($A19,'7'!$B$10:$D$45,3,FALSE)","v":{"v":0,"d":"0.0"}},{"$f":"VLOOKUP($A19,'8'!$B$10:$D$45,3,FALSE)","v":{"v":0,"d":"0.0"}},{"$f":"VLOOKUP($A19,'9'!$B$10:$D$45,3,FALSE)","v":{"v":0,"d":"0.0"}},{"$f":"VLOOKUP($A19,'10'!$B$10:$D$45,3,FALSE)","v":{"v":0,"d":"0.0"}},{"$f":"VLOOKUP($A19,'11'!$B$10:$D$45,3,FALSE)","v":{"v":0,"d":"0.0"}},{"$f":"VLOOKUP($A19,'12'!$B$10:$D$45,3,FALSE)","v":{"v":0,"d":"0.0"}},{"v":0,"d":"0.0"},{"$f":"VLOOKUP(A19,Formelhilfe!$A$9:$O$44,15,FALSE)","v":{"v":0,"d":"0.0"}},{"v":0,"d":"0.0"},{"v":307.98333333333335,"d":"308.0"},{"$f":"VLOOKUP(A19,Formelhilfe!$A$9:$P$44,16,FALSE)","v":{"v":6,"d":"6.0"}},{"v":1847.9,"d":"1,847.9"}]
["Markus Jungsthöfel",{"$f":"VLOOKUP(A20,'Wettkampf 1'!$B$10:$C$45,2,FALSE)","v":"Börger II"},{"$f":"VLOOKUP(A20,'Wettkampf 1'!$B$10:$D$45,3,FALSE)","v":312.5},{"$f":"VLOOKUP($A20,'2'!$B$10:$D$45,3,FALSE)","v":307.3},{"$f":"VLOOKUP($A20,'3'!$B$10:$D$45,3,FALSE)","v":308.1},{"$f":"VLOOKUP($A20,'4'!$B$10:$D$45,3,FALSE)","v":306.7},{"$f":"VLOOKUP($A20,'5'!$B$10:$D$45,3,FALSE)","v":305.4},{"$f":"VLOOKUP($A20,'6'!$B$10:$D$45,3,FALSE)","v":306.9},{"v":307.81666666666666,"d":"307.8"},{"$f":"VLOOKUP(A20,Formelhilfe!$A$9:$H$44,8,FALSE)","v":{"v":6,"d":"6.0"}},{"v":1846.9,"d":"1,846.9"},{"$f":"VLOOKUP($A20,'7'!$B$10:$D$45,3,FALSE)","v":{"v":0,"d":"0.0"}},{"$f":"VLOOKUP($A20,'8'!$B$10:$D$45,3,FALSE)","v":{"v":0,"d":"0.0"}},{"$f":"VLOOKUP($A20,'9'!$B$10:$D$45,3,FALSE)","v":{"v":0,"d":"0.0"}},{"$f":"VLOOKUP($A20,'10'!$B$10:$D$45,3,FALSE)","v":{"v":0,"d":"0.0"}},{"$f":"VLOOKUP($A20,'11'!$B$10:$D$45,3,FALSE)","v":{"v":0,"d":"0.0"}},{"$f":"VLOOKUP($A20,'12'!$B$10:$D$45,3,FALSE)","v":{"v":0,"d":"0.0"}},{"v":0,"d":"0.0"},{"$f":"VLOOKUP(A20,Formelhilfe!$A$9:$O$44,15,FALSE)","v":{"v":0,"d":"0.0"}},{"v":0,"d":"0.0"},{"v":307.81666666666666,"d":"307.8"},{"$f":"VLOOKUP(A20,Formelhilfe!$A$9:$P$44,16,FALSE)","v":{"v":6,"d":"6.0"}},{"v":1846.9,"d":"1,846.9"}]
["Daniel Sebers",{"$f":"VLOOKUP(A21,'Wettkampf 1'!$B$10:$C$45,2,FALSE)","v":"Börger III"},{"$f":"VLOOKUP(A21,'Wettkampf 1'!$B$10:$D$45,3,FALSE)","v":303.3},{"$f":"VLOOKUP($A21,'2'!$B$10:$D$45,3,FALSE)","v":307.4},{"$f":"VLOOKUP($A21,'3'!$B$10:$D$45,3,FALSE)","v":309.5},{"$f":"VLOOKUP($A21,'4'!$B$10:$D$45,3,FALSE)","v":{"v":312,"d":"312.0"}},{"$f":"VLOOKUP($A21,'5'!$B$10:$D$45,3,FALSE)","v":307.2},{"$f":"VLOOKUP($A21,'6'!$B$10:$D$45,3,FALSE)","v":306.4},{"v":307.6333333333334,"d":"307.6"},{"$f":"VLOOKUP(A21,Formelhilfe!$A$9:$H$44,8,FALSE)","v":{"v":6,"d":"6.0"}},{"v":1845.8000000000002,"d":"1,845.8"},{"$f":"VLOOKUP($A21,'7'!$B$10:$D$45,3,FALSE)","v":{"v":0,"d":"0.0"}},{"$f":"VLOOKUP($A21,'8'!$B$10:$D$45,3,FALSE)","v":{"v":0,"d":"0.0"}},{"$f":"VLOOKUP($A21,'9'!$B$10:$D$45,3,FALSE)","v":{"v":0,"d":"0.0"}},{"$f":"VLOOKUP($A21,'10'!$B$10:$D$45,3,FALSE)","v":{"v":0,"d":"0.0"}},{"$f":"VLOOKUP($A21,'11'!$B$10:$D$45,3,FALSE)","v":{"v":0,"d":"0.0"}},{"$f":"VLOOKUP($A21,'12'!$B$10:$D$45,3,FALSE)","v":{"v":0,"d":"0.0"}},{"v":0,"d":"0.0"},{"$f":"VLOOKUP(A21,Formelhilfe!$A$9:$O$44,15,FALSE)","v":{"v":0,"d":"0.0"}},{"v":0,"d":"0.0"},{"v":307.6333333333334,"d":"307.6"},{"$f":"VLOOKUP(A21,Formelhilfe!$A$9:$P$44,16,FALSE)","v":{"v":6,"d":"6.0"}},{"v":1845.8000000000002,"d":"1,845.8"}]
["Bernd Rode",{"$f":"VLOOKUP(A22,'Wettkampf 1'!$B$10:$C$45,2,FALSE)","v":"Börger III"},{"$f":"VLOOKUP(A22,'Wettkampf 1'!$B$10:$D$45,3,FALSE)","v":304.2},{"$f":"VLOOKUP($A22,'2'!$B$10:$D$45,3,FALSE)","v":304.9},{"$f":"VLOOKUP($A22,'3'!$B$10:$D$45,3,FALSE)","v":{"v":308,"d":"308.0"}},{"$f":"VLOOKUP($A22,'4'!$B$10:$D$45,3,FALSE)","v":308.2},{"$f":"VLOOKUP($A22,'5'!$B$10:$D$45,3,FALSE)","v":309.2},{"$f":"VLOOKUP($A22,'6'!$B$10:$D$45,3,FALSE)","v":308.7},307.2,{"$f":"VLOOKUP(A22,Formelhilfe!$A$9:$H$44,8,FALSE)","v":{"v":6,"d":"6.0"}},{"v":1843.2,"d":"1,843.2"},{"$f":"VLOOKUP($A22,'7'!$B$10:$D$45,3,FALSE)","v":{"v":0,"d":"0.0"}},{"$f":"VLOOKUP($A22,'8'!$B$10:$D$45,3,FALSE)","v":{"v":0,"d":"0.0"}},{"$f":"VLOOKUP($A22,'9'!$B$10:$D$45,3,FALSE)","v":{"v":0,"d":"0.0"}},{"$f":"VLOOKUP($A22,'10'!$B$10:$D$45,3,FALSE)","v":{"v":0,"d":"0.0"}},{"$f":"VLOOKUP($A22,'11'!$B$10:$D$45,3,FALSE)","v":{"v":0,"d":"0.0"}},{"$f":"VLOOKUP($A22,'12'!$B$10:$D$45,3,FALSE)","v":{"v":0,"d":"0.0"}},{"v":0,"d":"0.0"},{"$f":"VLOOKUP(A22,Formelhilfe!$A$9:$O$44,15,FALSE)","v":{"v":0,"d":"0.0"}},{"v":0,"d":"0.0"},307.2,{"$f":"VLOOKUP(A22,Formelhilfe!$A$9:$P$44,16,FALSE)","v":{"v":6,"d":"6.0"}},{"v":1843.2,"d":"1,843.2"}]
["Werner Thyen",{"$f":"VLOOKUP(A23,'Wettkampf 1'!$B$10:$C$45,2,FALSE)","v":"Neuvrees I"},{"$f":"VLOOKUP(A23,'Wettkampf 1'!$B$10:$D$45,3,FALSE)","v":311.2},{"$f":"VLOOKUP($A23,'2'!$B$10:$D$45,3,FALSE)","v":304.7},{"$f":"VLOOKUP($A23,'3'!$B$10:$D$45,3,FALSE)","v":309.1},{"$f":"VLOOKUP($A23,'4'!$B$10:$D$45,3,FALSE)","v":302.1},{"$f":"VLOOKUP($A23,'5'!$B$10:$D$45,3,FALSE)","v":308.9},{"$f":"VLOOKUP($A23,'6'!$B$10:$D$45,3,FALSE)","v":302.4},{"v":306.40000000000003,"d":"306.4"},{"$f":"VLOOKUP(A23,Formelhilfe!$A$9:$H$44,8,FALSE)","v":{"v":6,"d":"6.0"}},{"v":1838.4,"d":"1,838.4"},{"$f":"VLOOKUP($A23,'7'!$B$10:$D$45,3,FALSE)","v":{"v":0,"d":"0.0"}},{"$f":"VLOOKUP($A23,'8'!$B$10:$D$45,3,FALSE)","v":{"v":0,"d":"0.0"}},{"$f":"VLOOKUP($A23,'9'!$B$10:$D$45,3,FALSE)","v":{"v":0,"d":"0.0"}},{"$f":"VLOOKUP($A23,'10'!$B$10:$D$45,3,FALSE)","v":{"v":0,"d":"0.0"}},{"$f":"VLOOKUP($A23,'11'!$B$10:$D$45,3,FALSE)","v":{"v":0,"d":"0.0"}},{"$f":"VLOOKUP($A23,'12'!$B$10:$D$45,3,FALSE)","v":{"v":0,"d":"0.0"}},{"v":0,"d":"0.0"},{"$f":"VLOOKUP(A23,Formelhilfe!$A$9:$O$44,15,FALSE)","v":{"v":0,"d":"0.0"}},{"v":0,"d":"0.0"},{"v":306.40000000000003,"d":"306.4"},{"$f":"VLOOKUP(A23,Formelhilfe!$A$9:$P$44,16,FALSE)","v":{"v":6,"d":"6.0"}},{"v":1838.4,"d":"1,838.4"}]
["Oliver Reinelt",{"$f":"VLOOKUP(A24,'Wettkampf 1'!$B$10:$C$45,2,FALSE)","v":"Lahn IV"},{"$f":"VLOOKUP(A24,'Wettkampf 1'!$B$10:$D$45,3,FALSE)","v":302.3},{"$f":"VLOOKUP($A24,'2'!$B$10:$D$45,3,FALSE)","v":310.3},{"$f":"VLOOKUP($A24,'3'!$B$10:$D$45,3,FALSE)","v":307.2},{"$f":"VLOOKUP($A24,'4'!$B$10:$D$45,3,FALSE)","v":305.2},{"$f":"VLOOKUP($A24,'5'!$B$10:$D$45,3,FALSE)","v":304.6},{"$f":"VLOOKUP($A24,'6'!$B$10:$D$45,3,FALSE)","v":304.6},305.7,{"$f":"VLOOKUP(A24,Formelhilfe!$A$9:$H$44,8,FALSE)","v":{"v":6,"d":"6.0"}},{"v":1834.1999999999998,"d":"1,834.2"},{"$f":"VLOOKUP($A24,'7'!$B$10:$D$45,3,FALSE)","v":{"v":0,"d":"0.0"}},{"$f":"VLOOKUP($A24,'8'!$B$10:$D$45,3,FALSE)","v":{"v":0,"d":"0.0"}},{"$f":"VLOOKUP($A24,'9'!$B$10:$D$45,3,FALSE)","v":{"v":0,"d":"0.0"}},{"$f":"VLOOKUP($A24,'10'!$B$10:$D$45,3,FALSE)","v":{"v":0,"d":"0.0"}},{"$f":"VLOOKUP($A24,'11'!$B$10:$D$45,3,FALSE)","v":{"v":0,"d":"0.0"}},{"$f":"VLOOKUP($A24,'12'!$B$10:$D$45,3,FALSE)","v":{"v":0,"d":"0.0"}},{"v":0,"d":"0.0"},{"$f":"VLOOKUP(A24,Formelhilfe!$A$9:$O$44,15,FALSE)","v":{"v":0,"d":"0.0"}},{"v":0,"d":"0.0"},305.7,{"$f":"VLOOKUP(A24,Formelhilfe!$A$9:$P$44,16,FALSE)","v":{"v":6,"d":"6.0"}},{"v":1834.1999999999998,"d":"1,834.2"}]
["Uwe Goldenstein",{"$f":"VLOOKUP(A25,'Wettkampf 1'!$B$10:$C$45,2,FALSE)","v":"Börger II"},{"$f":"VLOOKUP(A25,'Wettkampf 1'!$B$10:$D$45,3,FALSE)","v":304.5},{"$f":"VLOOKUP($A25,'2'!$B$10:$D$45,3,FALSE)","v":{"v":304,"d":"304.0"}},{"$f":"VLOOKUP($A25,'3'!$B$10:$D$45,3,FALSE)","v":304.6},{"$f":"VLOOKUP($A25,'4'!$B$10:$D$45,3,FALSE)","v":302.8},{"$f":"VLOOKUP($A25,'5'!$B$10:$D$45,3,FALSE)","v":306.2},{"$f":"VLOOKUP($A25,'6'!$B$10:$D$45,3,FALSE)","v":{"v":299,"d":"299.0"}},{"v":303.5166666666667,"d":"303.5"},{"$f":"VLOOKUP(A25,Formelhilfe!$A$9:$H$44,8,FALSE)","v":{"v":6,"d":"6.0"}},{"v":1821.1000000000001,"d":"1,821.1"},{"$f":"VLOOKUP($A25,'7'!$B$10:$D$45,3,FALSE)","v":{"v":0,"d":"0.0"}},{"$f":"VLOOKUP($A25,'8'!$B$10:$D$45,3,FALSE)","v":{"v":0,"d":"0.0"}},{"$f":"VLOOKUP($A25,'9'!$B$10:$D$45,3,FALSE)","v":{"v":0,"d":"0.0"}},{"$f":"VLOOKUP($A25,'10'!$B$10:$D$45,3,FALSE)","v":{"v":0,"d":"0.0"}},{"$f":"VLOOKUP($A25,'11'!$B$10:$D$45,3,FALSE)","v":{"v":0,"d":"0.0"}},{"$f":"VLOOKUP($A25,'12'!$B$10:$D$45,3,FALSE)","v":{"v":0,"d":"0.0"}},{"v":0,"d":"0.0"},{"$f":"VLOOKUP(A25,Formelhilfe!$A$9:$O$44,15,FALSE)","v":{"v":0,"d":"0.0"}},{"v":0,"d":"0.0"},{"v":303.5166666666667,"d":"303.5"},{"$f":"VLOOKUP(A25,Formelhilfe!$A$9:$P$44,16,FALSE)","v":{"v":6,"d":"6.0"}},{"v":1821.1000000000001,"d":"1,821.1"}]
["Mathis Antons",{"$f":"VLOOKUP(A26,'Wettkampf 1'!$B$10:$C$45,2,FALSE)","v":"Börgerwald II"},{"$f":"VLOOKUP(A26,'Wettkampf 1'!$B$10:$D$45,3,FALSE)","v":314.1},{"$f":"VLOOKUP($A26,'2'!$B$10:$D$45,3,FALSE)","v":308.6},{"$f":"VLOOKUP($A26,'3'!$B$10:$D$45,3,FALSE)","v":310.9},{"$f":"VLOOKUP($A26,'4'!$B$10:$D$45,3,FALSE)","v":314.6},{"$f":"VLOOKUP($A26,'5'!$B$10:$D$45,3,FALSE)","v":310.8},{"$f":"VLOOKUP($A26,'6'!$B$10:$D$45,3,FALSE)","v":{"v":0,"d":"0.0"}},311.8,{"$f":"VLOOKUP(A26,Formelhilfe!$A$9:$H$44,8,FALSE)","v":{"v":5,"d":"5.0"}},{"v":1559,"d":"1,559.0"},{"$f":"VLOOKUP($A26,'7'!$B$10:$D$45,3,FALSE)","v":{"v":0,"d":"0.0"}},{"$f":"VLOOKUP($A26,'8'!$B$10:$D$45,3,FALSE)","v":{"v":0,"d":"0.0"}},{"$f":"VLOOKUP($A26,'9'!$B$10:$D$45,3,FALSE)","v":{"v":0,"d":"0.0"}},{"$f":"VLOOKUP($A26,'10'!$B$10:$D$45,3,FALSE)","v":{"v":0,"d":"0.0"}},{"$f":"VLOOKUP($A26,'11'!$B$10:$D$45,3,FALSE)","v":{"v":0,"d":"0.0"}},{"$f":"VLOOKUP($A26,'12'!$B$10:$D$45,3,FALSE)","v":{"v":0,"d":"0.0"}},{"v":0,"d":"0.0"},{"$f":"VLOOKUP(A26,Formelhilfe!$A$9:$O$44,15,FALSE)","v":{"v":0,"d":"0.0"}},{"v":0,"d":"0.0"},311.8,{"$f":"VLOOKUP(A26,Formelhilfe!$A$9:$P$44,16,FALSE)","v":{"v":5,"d":"5.0"}},{"v":1559,"d":"1,559.0"}]
["Hermann Schwarte",{"$f":"VLOOKUP(A27,'Wettkampf 1'!$B$10:$C$45,2,FALSE)","v":"Börger II"},{"$f":"VLOOKUP(A27,'Wettkampf 1'!$B$10:$D$45,3,FALSE)","v":305.8},{"$f":"VLOOKUP($A27,'2'!$B$10:$D$45,3,FALSE)","v":310.7},{"$f":"VLOOKUP($A27,'3'!$B$10:$D$45,3,FALSE)","v":304.4},{"$f":"VLOOKUP($A27,'4'!$B$10:$D$45,3,FALSE)","v":310.7},{"$f":"VLOOKUP($A27,'5'!$B$10:$D$45,3,FALSE)","v":302.1},{"$f":"VLOOKUP($A27,'6'!$B$10:$D$45,3,FALSE)","v":{"v":0,"d":"0.0"}},{"v":306.73999999999995,"d":"306.7"},{"$f":"VLOOKUP(A27,Formelhilfe!$A$9:$H$44,8,FALSE)","v":{"v":5,"d":"5.0"}},{"v":1533.6999999999998,"d":"1,533.7"},{"$f":"VLOOKUP($A27,'7'!$B$10:$D$45,3,FALSE)","v":{"v":0,"d":"0.0"}},{"$f":"VLOOKUP($A27,'8'!$B$10:$D$45,3,FALSE)","v":{"v":0,"d":"0.0"}},{"$f":"VLOOKUP($A27,'9'!$B$10:$D$45,3,FALSE)","v":{"v":0,"d":"0.0"}},{"$f":"VLOOKUP($A27,'10'!$B$10:$D$45,3,FALSE)","v":{"v":0,"d":"0.0"}},{"$f":"VLOOKUP($A27,'11'!$B$10:$D$45,3,FALSE)","v":{"v":0,"d":"0.0"}},{"$f":"VLOOKUP($A27,'12'!$B$10:$D$45,3,FALSE)","v":{"v":0,"d":"0.0"}},{"v":0,"d":"0.0"},{"$f":"VLOOKUP(A27,Formelhilfe!$A$9:$O$44,15,FALSE)","v":{"v":0,"d":"0.0"}},{"v":0,"d":"0.0"},{"v":306.73999999999995,"d":"306.7"},{"$f":"VLOOKUP(A27,Formelhilfe!$A$9:$P$44,16,FALSE)","v":{"v":5,"d":"5.0"}},{"v":1533.6999999999998,"d":"1,533.7"}]
["Marc Eckmann",{"$f":"VLOOKUP(A28,'Wettkampf 1'!$B$10:$C$45,2,FALSE)","v":"Börger II"},{"$f":"VLOOKUP(A28,'Wettkampf 1'!$B$10:$D$45,3,FALSE)","v":290.2},{"$f":"VLOOKUP($A28,'2'!$B$10:$D$45,3,FALSE)","v":303.8},{"$f":"VLOOKUP($A28,'3'!$B$10:$D$45,3,FALSE)","v":{"v":0,"d":"0.0"}},{"$f":"VLOOKUP($A28,'4'!$B$10:$D$45,3,FALSE)","v":304.4},{"$f":"VLOOKUP($A28,'5'!$B$10:$D$45,3,FALSE)","v":299.4},{"$f":"VLOOKUP($A28,'6'!$B$10:$D$45,3,FALSE)","v":304.5},{"v":300.46,"d":"300.5"},{"$f":"VLOOKUP(A28,Formelhilfe!$A$9:$H$44,8,FALSE)","v":{"v":5,"d":"5.0"}},{"v":1502.3,"d":"1,502.3"},{"$f":"VLOOKUP($A28,'7'!$B$10:$D$45,3,FALSE)","v":{"v":0,"d":"0.0"}},{"$f":"VLOOKUP($A28,'8'!$B$10:$D$45,3,FALSE)","v":{"v":0,"d":"0.0"}},{"$f":"VLOOKUP($A28,'9'!$B$10:$D$45,3,FALSE)","v":{"v":0,"d":"0.0"}},{"$f":"VLOOKUP($A28,'10'!$B$10:$D$45,3,FALSE)","v":{"v":0,"d":"0.0"}},{"$f":"VLOOKUP($A28,'11'!$B$10:$D$45,3,FALSE)","v":{"v":0,"d":"0.0"}},{"$f":"VLOOKUP($A28,'12'!$B$10:$D$45,3,FALSE)","v":{"v":0,"d":"0.0"}},{"v":0,"d":"0.0"},{"$f":"VLOOKUP(A28,Formelhilfe!$A$9:$O$44,15,FALSE)","v":{"v":0,"d":"0.0"}},{"v":0,"d":"0.0"},{"v":300.46,"d":"300.5"},{"$f":"VLOOKUP(A28,Formelhilfe!$A$9:$P$44,16,FALSE)","v":{"v":5,"d":"5.0"}},{"v":1502.3,"d":"1,502.3"}]
["Toni Stahl",{"$f":"VLOOKUP(A29,'Wettkampf 1'!$B$10:$C$45,2,FALSE)","v":"Börgerwald II"},{"$f":"VLOOKUP(A29,'Wettkampf 1'!$B$10:$D$45,3,FALSE)","v":296.7},{"$f":"VLOOKUP($A29,'2'!$B$10:$D$45,3,FALSE)","v":291.6},{"$f":"VLOOKUP($A29,'3'!$B$10:$D$45,3,FALSE)","v":277.7},{"$f":"VLOOKUP($A29,'4'!$B$10:$D$45,3,FALSE)","v":295.9},{"$f":"VLOOKUP($A29,'5'!$B$10:$D$45,3,FALSE)","v":{"v":0,"d":"0.0"}},{"$f":"VLOOKUP($A29,'6'!$B$10:$D$45,3,FALSE)","v":296.3},{"v":291.64,"d":"291.6"},{"$f":"VLOOKUP(A29,Formelhilfe!$A$9:$H$44,8,FALSE)","v":{"v":5,"d":"5.0"}},{"v":1458.2,"d":"1,458.2"},{"$f":"VLOOKUP($A29,'7'!$B$10:$D$45,3,FALSE)","v":{"v":0,"d":"0.0"}},{"$f":"VLOOKUP($A29,'8'!$B$10:$D$45,3,FALSE)","v":{"v":0,"d":"0.0"}},{"$f":"VLOOKUP($A29,'9'!$B$10:$D$45,3,FALSE)","v":{"v":0,"d":"0.0"}},{"$f":"VLOOKUP($A29,'10'!$B$10:$D$45,3,FALSE)","v":{"v":0,"d":"0.0"}},{"$f":"VLOOKUP($A29,'11'!$B$10:$D$45,3,FALSE)","v":{"v":0,"d":"0.0"}},{"$f":"VLOOKUP($A29,'12'!$B$10:$D$45,3,FALSE)","v":{"v":0,"d":"0.0"}},{"v":0,"d":"0.0"},{"$f":"VLOOKUP(A29,Formelhilfe!$A$9:$O$44,15,FALSE)","v":{"v":0,"d":"0.0"}},{"v":0,"d":"0.0"},{"v":291.64,"d":"291.6"},{"$f":"VLOOKUP(A29,Formelhilfe!$A$9:$P$44,16,FALSE)","v":{"v":5,"d":"5.0"}},{"v":1458.2,"d":"1,458.2"}]
["Carsten Peters",{"$f":"VLOOKUP(A30,'Wettkampf 1'!$B$10:$C$45,2,FALSE)","v":"Neuvrees I"},{"$f":"VLOOKUP(A30,'Wettkampf 1'!$B$10:$D$45,3,FALSE)","v":{"v":0,"d":"0.0"}},{"$f":"VLOOKUP($A30,'2'!$B$10:$D$45,3,FALSE)","v":307.9},{"$f":"VLOOKUP($A30,'3'!$B$10:$D$45,3,FALSE)","v":{"v":0,"d":"0.0"}},{"$f":"VLOOKUP($A30,'4'!$B$10:$D$45,3,FALSE)","v":308.3},{"$f":"VLOOKUP($A30,'5'!$B$10:$D$45,3,FALSE)","v":304.1},{"$f":"VLOOKUP($A30,'6'!$B$10:$D$45,3,FALSE)","v":299.1},{"v":304.85,"d":"304.9"},{"$f":"VLOOKUP(A30,Formelhilfe!$A$9:$H$44,8,FALSE)","v":{"v":4,"d":"4.0"}},{"v":1219.4,"d":"1,219.4"},{"$f":"VLOOKUP($A30,'7'!$B$10:$D$45,3,FALSE)","v":{"v":0,"d":"0.0"}},{"$f":"VLOOKUP($A30,'8'!$B$10:$D$45,3,FALSE)","v":{"v":0,"d":"0.0"}},{"$f":"VLOOKUP($A30,'9'!$B$10:$D$45,3,FALSE)","v":{"v":0,"d":"0.0"}},{"$f":"VLOOKUP($A30,'10'!$B$10:$D$45,3,FALSE)","v":{"v":0,"d":"0.0"}},{"$f":"VLOOKUP($A30,'11'!$B$10:$D$45,3,FALSE)","v":{"v":0,"d":"0.0"}},{"$f":"VLOOKUP($A30,'12'!$B$10:$D$45,3,FALSE)","v":{"v":0,"d":"0.0"}},{"v":0,"d":"0.0"},{"$f":"VLOOKUP(A30,Formelhilfe!$A$9:$O$44,15,FALSE)","v":{"v":0,"d":"0.0"}},{"v":0,"d":"0.0"},{"v":304.85,"d":"304.9"},{"$f":"VLOOKUP(A30,Formelhilfe!$A$9:$P$44,16,FALSE)","v":{"v":4,"d":"4.0"}},{"v":1219.4,"d":"1,219.4"}]
["Tobias Sebers",{"$f":"VLOOKUP(A31,'Wettkampf 1'!$B$10:$C$45,2,FALSE)","v":"Börgerwald II"},{"$f":"VLOOKUP(A31,'Wettkampf 1'!$B$10:$D$45,3,FALSE)","v":{"v":0,"d":"0.0"}},{"$f":"VLOOKUP($A31,'2'!$B$10:$D$45,3,FALSE)","v":300.8},{"$f":"VLOOKUP($A31,'3'!$B$10:$D$45,3,FALSE)","v":{"v":295,"d":"295.0"}},{"$f":"VLOOKUP($A31,'4'!$B$10:$D$45,3,FALSE)","v":{"v":0,"d":"0.0"}},{"$f":"VLOOKUP($A31,'5'!$B$10:$D$45,3,FALSE)","v":304.6},{"$f":"VLOOKUP($A31,'6'!$B$10:$D$45,3,FALSE)","v":298.6},{"v":299.75,"d":"299.8"},{"$f":"VLOOKUP(A31,Formelhilfe!$A$9:$H$44,8,FALSE)","v":{"v":4,"d":"4.0"}},{"v":1199,"d":"1,199.0"},{"$f":"VLOOKUP($A31,'7'!$B$10:$D$45,3,FALSE)","v":{"v":0,"d":"0.0"}},{"$f":"VLOOKUP($A31,'8'!$B$10:$D$45,3,FALSE)","v":{"v":0,"d":"0.0"}},{"$f":"VLOOKUP($A31,'9'!$B$10:$D$45,3,FALSE)","v":{"v":0,"d":"0.0"}},{"$f":"VLOOKUP($A31,'10'!$B$10:$D$45,3,FALSE)","v":{"v":0,"d":"0.0"}},{"$f":"VLOOKUP($A31,'11'!$B$10:$D$45,3,FALSE)","v":{"v":0,"d":"0.0"}},{"$f":"VLOOKUP($A31,'12'!$B$10:$D$45,3,FALSE)","v":{"v":0,"d":"0.0"}},{"v":0,"d":"0.0"},{"$f":"VLOOKUP(A31,Formelhilfe!$A$9:$O$44,15,FALSE)","v":{"v":0,"d":"0.0"}},{"v":0,"d":"0.0"},{"v":299.75,"d":"299.8"},{"$f":"VLOOKUP(A31,Formelhilfe!$A$9:$P$44,16,FALSE)","v":{"v":4,"d":"4.0"}},{"v":1199,"d":"1,199.0"}]
["Christian Robben",{"$f":"VLOOKUP(A32,'Wettkampf 1'!$B$10:$C$45,2,FALSE)","v":"Börgerwald II"},{"$f":"VLOOKUP(A32,'Wettkampf 1'!$B$10:$D$45,3,FALSE)","v":282.8},{"$f":"VLOOKUP($A32,'2'!$B$10:$D$45,3,FALSE)","v":{"v":0,"d":"0.0"}},{"$f":"VLOOKUP($A32,'3'!$B$10:$D$45,3,FALSE)","v":{"v":0,"d":"0.0"}},{"$f":"VLOOKUP($A32,'4'!$B$10:$D$45,3,FALSE)","v":296.8},{"$f":"VLOOKUP($A32,'5'!$B$10:$D$45,3,FALSE)","v":296.6},{"$f":"VLOOKUP($A32,'6'!$B$10:$D$45,3,FALSE)","v":301.6},{"v":294.45000000000005,"d":"294.5"},{"$f":"VLOOKUP(A32,Formelhilfe!$A$9:$H$44,8,FALSE)","v":{"v":4,"d":"4.0"}},{"v":1177.8000000000002,"d":"1,177.8"},{"$f":"VLOOKUP($A32,'7'!$B$10:$D$45,3,FALSE)","v":{"v":0,"d":"0.0"}},{"$f":"VLOOKUP($A32,'8'!$B$10:$D$45,3,FALSE)","v":{"v":0,"d":"0.0"}},{"$f":"VLOOKUP($A32,'9'!$B$10:$D$45,3,FALSE)","v":{"v":0,"d":"0.0"}},{"$f":"VLOOKUP($A32,'10'!$B$10:$D$45,3,FALSE)","v":{"v":0,"d":"0.0"}},{"$f":"VLOOKUP($A32,'11'!$B$10:$D$45,3,FALSE)","v":{"v":0,"d":"0.0"}},{"$f":"VLOOKUP($A32,'12'!$B$10:$D$45,3,FALSE)","v":{"v":0,"d":"0.0"}},{"v":0,"d":"0.0"},{"$f":"VLOOKUP(A32,Formelhilfe!$A$9:$O$44,15,FALSE)","v":{"v":0,"d":"0.0"}},{"v":0,"d":"0.0"},{"v":294.45000000000005,"d":"294.5"},{"$f":"VLOOKUP(A32,Formelhilfe!$A$9:$P$44,16,FALSE)","v":{"v":4,"d":"4.0"}},{"v":1177.8000000000002,"d":"1,177.8"}]
["Hans Preuth",{"$f":"VLOOKUP(A33,'Wettkampf 1'!$B$10:$C$45,2,FALSE)","v":"Neuvrees II"},{"$f":"VLOOKUP(A33,'Wettkampf 1'!$B$10:$D$45,3,FALSE)","v":307.6},{"$f":"VLOOKUP($A33,'2'!$B$10:$D$45,3,FALSE)","v":308.1},{"$f":"VLOOKUP($A33,'3'!$B$10:$D$45,3,FALSE)","v":{"v":0,"d":"0.0"}},{"$f":"VLOOKUP($A33,'4'!$B$10:$D$45,3,FALSE)","v":{"v":0,"d":"0.0"}},{"$f":"VLOOKUP($A33,'5'!$B$10:$D$45,3,FALSE)","v":{"v":0,"d":"0.0"}},{"$f":"VLOOKUP($A33,'6'!$B$10:$D$45,3,FALSE)","v":{"v":0,"d":"0.0"}},{"v":307.85,"d":"307.9"},{"$f":"VLOOKUP(A33,Formelhilfe!$A$9:$H$44,8,FALSE)","v":{"v":2,"d":"2.0"}},615.7,{"$f":"VLOOKUP($A33,'7'!$B$10:$D$45,3,FALSE)","v":{"v":0,"d":"0.0"}},{"$f":"VLOOKUP($A33,'8'!$B$10:$D$45,3,FALSE)","v":{"v":0,"d":"0.0"}},{"$f":"VLOOKUP($A33,'9'!$B$10:$D$45,3,FALSE)","v":{"v":0,"d":"0.0"}},{"$f":"VLOOKUP($A33,'10'!$B$10:$D$45,3,FALSE)","v":{"v":0,"d":"0.0"}},{"$f":"VLOOKUP($A33,'11'!$B$10:$D$45,3,FALSE)","v":{"v":0,"d":"0.0"}},{"$f":"VLOOKUP($A33,'12'!$B$10:$D$45,3,FALSE)","v":{"v":0,"d":"0.0"}},{"v":0,"d":"0.0"},{"$f":"VLOOKUP(A33,Formelhilfe!$A$9:$O$44,15,FALSE)","v":{"v":0,"d":"0.0"}},{"v":0,"d":"0.0"},{"v":307.85,"d":"307.9"},{"$f":"VLOOKUP(A33,Formelhilfe!$A$9:$P$44,16,FALSE)","v":{"v":2,"d":"2.0"}},615.7]
["Dietmar Spekker",{"$f":"VLOOKUP(A34,'Wettkampf 1'!$B$10:$C$45,2,FALSE)","v":"Neuvrees I"},{"$f":"VLOOKUP(A34,'Wettkampf 1'!$B$10:$D$45,3,FALSE)","v":{"v":0,"d":"0.0"}},{"$f":"VLOOKUP($A34,'2'!$B$10:$D$45,3,FALSE)","v":{"v":0,"d":"0.0"}},{"$f":"VLOOKUP($A34,'3'!$B$10:$D$45,3,FALSE)","v":293.4},{"$f":"VLOOKUP($A34,'4'!$B$10:$D$45,3,FALSE)","v":300.4},{"$f":"VLOOKUP($A34,'5'!$B$10:$D$45,3,FALSE)","v":{"v":0,"d":"0.0"}},{"$f":"VLOOKUP($A34,'6'!$B$10:$D$45,3,FALSE)","v":{"v":0,"d":"0.0"}},296.9,{"$f":"VLOOKUP(A34,Formelhilfe!$A$9:$H$44,8,FALSE)","v":{"v":2,"d":"2.0"}},593.8,{"$f":"VLOOKUP($A34,'7'!$B$10:$D$45,3,FALSE)","v":{"v":0,"d":"0.0"}},{"$f":"VLOOKUP($A34,'8'!$B$10:$D$45,3,FALSE)","v":{"v":0,"d":"0.0"}},{"$f":"VLOOKUP($A34,'9'!$B$10:$D$45,3,FALSE)","v":{"v":0,"d":"0.0"}},{"$f":"VLOOKUP($A34,'10'!$B$10:$D$45,3,FALSE)","v":{"v":0,"d":"0.0"}},{"$f":"VLOOKUP($A34,'11'!$B$10:$D$45,3,FALSE)","v":{"v":0,"d":"0.0"}},{"$f":"VLOOKUP($A34,'12'!$B$10:$D$45,3,FALSE)","v":{"v":0,"d":"0.0"}},{"v":0,"d":"0.0"},{"$f":"VLOOKUP(A34,Formelhilfe!$A$9:$O$44,15,FALSE)","v":{"v":0,"d":"0.0"}},{"v":0,"d":"0.0"},296.9,{"$f":"VLOOKUP(A34,Formelhilfe!$A$9:$P$44,16,FALSE)","v":{"v":2,"d":"2.0"}},593.8]
["Martin Hinrichs",{"$f":"VLOOKUP(A35,'Wettkampf 1'!$B$10:$C$45,2,FALSE)","v":"Börgerwald II"},{"$f":"VLOOKUP(A35,'Wettkampf 1'!$B$10:$D$45,3,FALSE)","v":270.5},{"$f":"VLOOKUP($A35,'2'!$B$10:$D$45,3,FALSE)","v":{"v":0,"d":"0.0"}},{"$f":"VLOOKUP($A35,'3'!$B$10:$D$45,3,FALSE)","v":{"v":0,"d":"0.0"}},{"$f":"VLOOKUP($A35,'4'!$B$10:$D$45,3,FALSE)","v":{"v":0,"d":"0.0"}},{"$f":"VLOOKUP($A35,'5'!$B$10:$D$45,3,FALSE)","v":{"v":0,"d":"0.0"}},{"$f":"VLOOKUP($A35,'6'!$B$10:$D$45,3,FALSE)","v":{"v":0,"d":"0.0"}},270.5,{"$f":"VLOOKUP(A35,Formelhilfe!$A$9:$H$44,8,FALSE)","v":{"v":1,"d":"1.0"}},270.5,{"$f":"VLOOKUP($A35,'7'!$B$10:$D$45,3,FALSE)","v":{"v":0,"d":"0.0"}},{"$f":"VLOOKUP($A35,'8'!$B$10:$D$45,3,FALSE)","v":{"v":0,"d":"0.0"}},{"$f":"VLOOKUP($A35,'9'!$B$10:$D$45,3,FALSE)","v":{"v":0,"d":"0.0"}},{"$f":"VLOOKUP($A35,'10'!$B$10:$D$45,3,FALSE)","v":{"v":0,"d":"0.0"}},{"$f":"VLOOKUP($A35,'11'!$B$10:$D$45,3,FALSE)","v":{"v":0,"d":"0.0"}},{"$f":"VLOOKUP($A35,'12'!$B$10:$D$45,3,FALSE)","v":{"v":0,"d":"0.0"}},{"v":0,"d":"0.0"},{"$f":"VLOOKUP(A35,Formelhilfe!$A$9:$O$44,15,FALSE)","v":{"v":0,"d":"0.0"}},{"v":0,"d":"0.0"},270.5,{"$f":"VLOOKUP(A35,Formelhilfe!$A$9:$P$44,16,FALSE)","v":{"v":1,"d":"1.0"}},270.5]
["Schütze 24",{"$f":"VLOOKUP(A36,'Wettkampf 1'!$B$10:$C$45,2,FALSE)","v":"Börger II"},{"$f":"VLOOKUP(A36,'Wettkampf 1'!$B$10:$D$45,3,FALSE)","v":{"v":0,"d":"0.0"}},{"$f":"VLOOKUP($A36,'2'!$B$10:$D$45,3,FALSE)","v":{"v":0,"d":"0.0"}},{"$f":"VLOOKUP($A36,'3'!$B$10:$D$45,3,FALSE)","v":{"v":0,"d":"0.0"}},{"$f":"VLOOKUP($A36,'4'!$B$10:$D$45,3,FALSE)","v":{"v":0,"d":"0.0"}},{"$f":"VLOOKUP($A36,'5'!$B$10:$D$45,3,FALSE)","v":{"v":0,"d":"0.0"}},{"$f":"VLOOKUP($A36,'6'!$B$10:$D$45,3,FALSE)","v":{"v":0,"d":"0.0"}},{"v":0,"d":"0.0"},{"$f":"VLOOKUP(A36,Formelhilfe!$A$9:$H$44,8,FALSE)","v":{"v":0,"d":"0.0"}},{"v":0,"d":"0.0"},{"$f":"VLOOKUP($A36,'7'!$B$10:$D$45,3,FALSE)","v":{"v":0,"d":"0.0"}},{"$f":"VLOOKUP($A36,'8'!$B$10:$D$45,3,FALSE)","v":{"v":0,"d":"0.0"}},{"$f":"VLOOKUP($A36,'9'!$B$10:$D$45,3,FALSE)","v":{"v":0,"d":"0.0"}},{"$f":"VLOOKUP($A36,'10'!$B$10:$D$45,3,FALSE)","v":{"v":0,"d":"0.0"}},{"$f":"VLOOKUP($A36,'11'!$B$10:$D$45,3,FALSE)","v":{"v":0,"d":"0.0"}},{"$f":"VLOOKUP($A36,'12'!$B$10:$D$45,3,FALSE)","v":{"v":0,"d":"0.0"}},{"v":0,"d":"0.0"},{"$f":"VLOOKUP(A36,Formelhilfe!$A$9:$O$44,15,FALSE)","v":{"v":0,"d":"0.0"}},{"v":0,"d":"0.0"},{"v":0,"d":"0.0"},{"$f":"VLOOKUP(A36,Formelhilfe!$A$9:$P$44,16,FALSE)","v":{"v":0,"d":"0.0"}},{"v":0,"d":"0.0"}]
["Schütze 29",{"$f":"VLOOKUP(A37,'Wettkampf 1'!$B$10:$C$45,2,FALSE)","v":"Lahn IV"},{"$f":"VLOOKUP(A37,'Wettkampf 1'!$B$10:$D$45,3,FALSE)","v":{"v":0,"d":"0.0"}},{"$f":"VLOOKUP($A37,'2'!$B$10:$D$45,3,FALSE)","v":{"v":0,"d":"0.0"}},{"$f":"VLOOKUP($A37,'3'!$B$10:$D$45,3,FALSE)","v":{"v":0,"d":"0.0"}},{"$f":"VLOOKUP($A37,'4'!$B$10:$D$45,3,FALSE)","v":{"v":0,"d":"0.0"}},{"$f":"VLOOKUP($A37,'5'!$B$10:$D$45,3,FALSE)","v":{"v":0,"d":"0.0"}},{"$f":"VLOOKUP($A37,'6'!$B$10:$D$45,3,FALSE)","v":{"v":0,"d":"0.0"}},{"v":0,"d":"0.0"},{"$f":"VLOOKUP(A37,Formelhilfe!$A$9:$H$44,8,FALSE)","v":{"v":0,"d":"0.0"}},{"v":0,"d":"0.0"},{"$f":"VLOOKUP($A37,'7'!$B$10:$D$45,3,FALSE)","v":{"v":0,"d":"0.0"}},{"$f":"VLOOKUP($A37,'8'!$B$10:$D$45,3,FALSE)","v":{"v":0,"d":"0.0"}},{"$f":"VLOOKUP($A37,'9'!$B$10:$D$45,3,FALSE)","v":{"v":0,"d":"0.0"}},{"$f":"VLOOKUP($A37,'10'!$B$10:$D$45,3,FALSE)","v":{"v":0,"d":"0.0"}},{"$f":"VLOOKUP($A37,'11'!$B$10:$D$45,3,FALSE)","v":{"v":0,"d":"0.0"}},{"$f":"VLOOKUP($A37,'12'!$B$10:$D$45,3,FALSE)","v":{"v":0,"d":"0.0"}},{"v":0,"d":"0.0"},{"$f":"VLOOKUP(A37,Formelhilfe!$A$9:$O$44,15,FALSE)","v":{"v":0,"d":"0.0"}},{"v":0,"d":"0.0"},{"v":0,"d":"0.0"},{"$f":"VLOOKUP(A37,Formelhilfe!$A$9:$P$44,16,FALSE)","v":{"v":0,"d":"0.0"}},{"v":0,"d":"0.0"}]

{"sheet":"Formelhilfe","index":16,"n_rows":45,"n_cols":21,"rows_kept":45,"hidden":true}
[null,1,2,3,4,5,6,"Hinrunde Schnitt",7,8,9,10,11,12,"Rückrunde Schnitt","Gesamt Schnitt",null,null,"Kreisoberliga","Schützen","2023/2024"]
[{"$f":"'Wettkampf 1'!B2","v":"Börgerwald II"},{"$f":"IF('Wettkampf 1'!D2>0,1,0)","v":1},{"$f":"IF('2'!$D2>0,1,0)","v":1},{"$f":"IF('3'!$D2>0,1,0)","v":1},{"$f":"IF('4'!$D2>0,1,0)","v":1},{"$f":"IF('5'!$D2>0,1,0)","v":1},{"$f":"IF('6'!$D2>0,1,0)","v":1},{"$f":"SUM(B2:G2)","v":6},{"$f":"IF('7'!$D2>0,1,0)","v":0},{"$f":"IF('8'!$D2>0,1,0)","v":0},{"$f":"IF('9'!$D2>0,1,0)","v":0},{"$f":"IF('10'!$D2>0,1,0)","v":0},{"$f":"IF('11'!$D2>0,1,0)","v":0},{"$f":"IF('12'!$D2>0,1,0)","v":0},{"$f":"SUM(I2:N2)","v":0},{"$f":"O2+H2","v":6},null,null,"1. Kreisliga","Damen","2024/2025"]
[{"$f":"'Wettkampf 1'!B3","v":"Neuvrees II"},{"$f":"IF('Wettkampf 1'!D3>0,1,0)","v":1},{"$f":"IF('2'!$D3>0,1,0)","v":1},{"$f":"IF('3'!$D3>0,1,0)","v":1},{"$f":"IF('4'!$D3>0,1,0)","v":1},{"$f":"IF('5'!$D3>0,1,0)","v":1},{"$f":"IF('6'!$D3>0,1,0)","v":1},{"$f":"SUM(B3:G3)","v":6},{"$f":"IF('7'!$D3>0,1,0)","v":0},{"$f":"IF('8'!$D3>0,1,0)","v":0},{"$f":"IF('9'!$D3>0,1,0)","v":0},{"$f":"IF('10'!$D3>0,1,0)","v":0},{"$f":"IF('11'!$D3>0,1,0)","v":0},{"$f":"IF('12'!$D3>0,1,0)","v":0},{"$f":"SUM(I3:N3)","v":0},{"$f":"O3+H3","v":6},null,null,"2. Kreisliga","Altersgruppe","2025/2026"]
[{"$f":"'Wettkampf 1'!B4","v":"Börger III"},{"$f":"IF('Wettkampf 1'!D4>0,1,0)","v":1},{"$f":"IF('2'!$D4>0,1,0)","v":1},{"$f":"IF('3'!$D4>0,1,0)","v":1},{"$f":"IF('4'!$D4>0,1,0)","v":1},{"$f":"IF('5'!$D4>0,1,0)","v":1},{"$f":"IF('6'!$D4>0,1,0)","v":1},6,{"$f":"IF('7'!$D4>0,1,0)","v":0},{"$f":"IF('8'!$D4>0,1,0)","v":0},{"$f":"IF('9'!$D4>0,1,0)","v":0},{"$f":"IF('10'!$D4>0,1,0)","v":0},{"$f":"IF('11'!$D4>0,1,0)","v":0},{"$f":"IF('12'!$D4>0,1,0)","v":0},0,6,null,null,"1. Kreisklasse","Senioren","2026/2027"]
[{"$f":"'Wettkampf 1'!B5","v":"Börger II"},{"$f":"IF('Wettkampf 1'!D5>0,1,0)","v":1},{"$f":"IF('2'!$D5>0,1,0)","v":1},{"$f":"IF('3'!$D5>0,1,0)","v":1},{"$f":"IF('4'!$D5>0,1,0)","v":1},{"$f":"IF('5'!$D5>0,1,0)","v":1},{"$f":"IF('6'!$D5>0,1,0)","v":1},6,{"$f":"IF('7'!$D5>0,1,0)","v":0},{"$f":"IF('8'!$D5>0,1,0)","v":0},{"$f":"IF('9'!$D5>0,1,0)","v":0},{"$f":"IF('10'!$D5>0,1,0)","v":0},{"$f":"IF('11'!$D5>0,1,0)","v":0},{"$f":"IF('12'!$D5>0,1,0)","v":0},0,6,null,null,"2. Kreisklasse","Jugend","2027/2028"]
[{"$f":"'Wettkampf 1'!B6","v":"Lahn IV"},{"$f":"IF('Wettkampf 1'!D6>0,1,0)","v":1},{"$f":"IF('2'!$D6>0,1,0)","v":1},{"$f":"IF('3'!$D6>0,1,0)","v":1},{"$f":"IF('4'!$D6>0,1,0)","v":1},{"$f":"IF('5'!$D6>0,1,0)","v":1},{"$f":"IF('6'!$D6>0,1,0)","v":1},6,{"$f":"IF('7'!$D6>0,1,0)","v":0},{"$f":"IF('8'!$D6>0,1,0)","v":0},{"$f":"IF('9'!$D6>0,1,0)","v":0},{"$f":"IF('10'!$D6>0,1,0)","v":0},{"$f":"IF('11'!$D6>0,1,0)","v":0},{"$f":"IF('12'!$D6>0,1,0)","v":0},0,6,null,null,"3. Kreisklasse","Schüler","2028/2029"]
[{"$f":"'Wettkampf 1'!B7","v":"Neuvrees I"},{"$f":"IF('Wettkampf 1'!D7>0,1,0)","v":1},{"$f":"IF('2'!$D7>0,1,0)","v":1},{"$f":"IF('3'!$D7>0,1,0)","v":1},{"$f":"IF('4'!$D7>0,1,0)","v":1},{"$f":"IF('5'!$D7>0,1,0)","v":1},{"$f":"IF('6'!$D7>0,1,0)","v":1},6,{"$f":"IF('7'!$D7>0,1,0)","v":0},{"$f":"IF('8'!$D7>0,1,0)","v":0},{"$f":"IF('9'!$D7>0,1,0)","v":0},{"$f":"IF('10'!$D7>0,1,0)","v":0},{"$f":"IF('11'!$D7>0,1,0)","v":0},{"$f":"IF('12'!$D7>0,1,0)","v":0},0,6,null,null,"4. Kreisklasse","offene Klasse FHLG","2039/2030"]
[{"$nulls":18},"5. Kreisklasse","Luftpistole"]
["Andre Hanenkamp",{"$f":"IF('Wettkampf 1'!D10>0,1,0)","v":1},{"$f":"IF('2'!$D10>0,1,0)","v":1},{"$f":"IF('3'!$D10>0,1,0)","v":1},{"$f":"IF('4'!$D10>0,1,0)","v":1},{"$f":"IF('5'!$D10>0,1,0)","v":1},{"$f":"IF('6'!$D10>0,1,0)","v":1},6,{"$f":"IF('7'!$D10>0,1,0)","v":0},{"$f":"IF('8'!$D10>0,1,0)","v":0},{"$f":"IF('9'!$D10>0,1,0)","v":0},{"$f":"IF('10'!$D10>0,1,0)","v":0},{"$f":"IF('11'!$D10>0,1,0)","v":0},{"$f":"IF('12'!$D10>0,1,0)","v":0},0,{"$f":"O9+H9","v":6},null,null,"6. Kreisklasse"]
["Horst Sabel",{"$f":"IF('Wettkampf 1'!D11>0,1,0)","v":1},{"$f":"IF('2'!$D11>0,1,0)","v":1},{"$f":"IF('3'!$D11>0,1,0)","v":1},{"$f":"IF('4'!$D11>0,1,0)","v":1},{"$f":"IF('5'!$D11>0,1,0)","v":1},{"$f":"IF('6'!$D11>0,1,0)","v":1},6,{"$f":"IF('7'!$D11>0,1,0)","v":0},{"$f":"IF('8'!$D11>0,1,0)","v":0},{"$f":"IF('9'!$D11>0,1,0)","v":0},{"$f":"IF('10'!$D11>0,1,0)","v":0},{"$f":"IF('11'!$D11>0,1,0)","v":0},{"$f":"IF('12'!$D11>0,1,0)","v":0},0,{"$f":"O10+H10","v":6},null,null,"7. Kreisklasse"]
["Christian Robben",{"$f":"IF('Wettkampf 1'!D12>0,1,0)","v":1},{"$f":"IF('2'!$D12>0,1,0)","v":0},{"$f":"IF('3'!$D12>0,1,0)","v":0},{"$f":"IF('4'!$D12>0,1,0)","v":1},{"$f":"IF('5'!$D12>0,1,0)","v":1},{"$f":"IF('6'!$D12>0,1,0)","v":1},4,{"$f":"IF('7'!$D12>0,1,0)","v":0},{"$f":"IF('8'!$D12>0,1,0)","v":0},{"$f":"IF('9'!$D12>0,1,0)","v":0},{"$f":"IF('10'!$D12>0,1,0)","v":0},{"$f":"IF('11'!$D12>0,1,0)","v":0},{"$f":"IF('12'!$D12>0,1,0)","v":0},0,4]
["Mathis Antons",{"$f":"IF('Wettkampf 1'!D13>0,1,0)","v":1},{"$f":"IF('2'!$D13>0,1,0)","v":1},{"$f":"IF('3'!$D13>0,1,0)","v":1},{"$f":"IF('4'!$D13>0,1,0)","v":1},{"$f":"IF('5'!$D13>0,1,0)","v":1},{"$f":"IF('6'!$D13>0,1,0)","v":0},5,{"$f":"IF('7'!$D13>0,1,0)","v":0},{"$f":"IF('8'!$D13>0,1,0)","v":0},{"$f":"IF('9'!$D13>0,1,0)","v":0},{"$f":"IF('10'!$D13>0,1,0)","v":0},{"$f":"IF('11'!$D13>0,1,0)","v":0},{"$f":"IF('12'!$D13>0,1,0)","v":0},0,5]
["Tobias Sebers",{"$f":"IF('Wettkampf 1'!D14>0,1,0)","v":0},{"$f":"IF('2'!$D14>0,1,0)","v":1},{"$f":"IF('3'!$D14>0,1,0)","v":1},{"$f":"IF('4'!$D14>0,1,0)","v":0},{"$f":"IF('5'!$D14>0,1,0)","v":1},{"$f":"IF('6'!$D14>0,1,0)","v":1},4,{"$f":"IF('7'!$D14>0,1,0)","v":0},{"$f":"IF('8'!$D14>0,1,0)","v":0},{"$f":"IF('9'!$D14>0,1,0)","v":0},{"$f":"IF('10'!$D14>0,1,0)","v":0},{"$f":"IF('11'!$D14>0,1,0)","v":0},{"$f":"IF('12'!$D14>0,1,0)","v":0},0,4]
["Friedhelm Schroer",{"$f":"IF('Wettkampf 1'!D15>0,1,0)","v":1},{"$f":"IF('2'!$D15>0,1,0)","v":1},{"$f":"IF('3'!$D15>0,1,0)","v":1},{"$f":"IF('4'!$D15>0,1,0)","v":1},{"$f":"IF('5'!$D15>0,1,0)","v":1},{"$f":"IF('6'!$D15>0,1,0)","v":1},6,{"$f":"IF('7'!$D15>0,1,0)","v":0},{"$f":"IF('8'!$D15>0,1,0)","v":0},{"$f":"IF('9'!$D15>0,1,0)","v":0},{"$f":"IF('10'!$D15>0,1,0)","v":0},{"$f":"IF('11'!$D15>0,1,0)","v":0},{"$f":"IF('12'!$D15>0,1,0)","v":0},0,6]
["Toni Stahl",{"$f":"IF('Wettkampf 1'!D16>0,1,0)","v":1},{"$f":"IF('2'!$D16>0,1,0)","v":1},{"$f":"IF('3'!$D16>0,1,0)","v":1},{"$f":"IF('4'!$D16>0,1,0)","v":1},{"$f":"IF('5'!$D16>0,1,0)","v":0},{"$f":"IF('6'!$D16>0,1,0)","v":1},5,{"$f":"IF('7'!$D16>0,1,0)","v":0},{"$f":"IF('8'!$D16>0,1,0)","v":0},{"$f":"IF('9'!$D16>0,1,0)","v":0},{"$f":"IF('10'!$D16>0,1,0)","v":0},{"$f":"IF('11'!$D16>0,1,0)","v":0},{"$f":"IF('12'!$D16>0,1,0)","v":0},0,5]
["Martin Hinrichs",{"$f":"IF('Wettkampf 1'!D17>0,1,0)","v":1},{"$f":"IF('2'!$D17>0,1,0)","v":0},{"$f":"IF('3'!$D17>0,1,0)","v":0},{"$f":"IF('4'!$D17>0,1,0)","v":0},{"$f":"IF('5'!$D17>0,1,0)","v":0},{"$f":"IF('6'!$D17>0,1,0)","v":0},1,{"$f":"IF('7'!$D17>0,1,0)","v":0},{"$f":"IF('8'!$D17>0,1,0)","v":0},{"$f":"IF('9'!$D17>0,1,0)","v":0},{"$f":"IF('10'!$D17>0,1,0)","v":0},{"$f":"IF('11'!$D17>0,1,0)","v":0},{"$f":"IF('12'!$D17>0,1,0)","v":0},0,1]
["Dirk Thunert",{"$f":"IF('Wettkampf 1'!D18>0,1,0)","v":1},{"$f":"IF('2'!$D18>0,1,0)","v":1},{"$f":"IF('3'!$D18>0,1,0)","v":1},{"$f":"IF('4'!$D18>0,1,0)","v":1},{"$f":"IF('5'!$D18>0,1,0)","v":1},{"$f":"IF('6'!$D18>0,1,0)","v":1},6,{"$f":"IF('7'!$D18>0,1,0)","v":0},{"$f":"IF('8'!$D18>0,1,0)","v":0},{"$f":"IF('9'!$D18>0,1,0)","v":0},{"$f":"IF('10'!$D18>0,1,0)","v":0},{"$f":"IF('11'!$D18>0,1,0)","v":0},{"$f":"IF('12'!$D18>0,1,0)","v":0},0,6]
["Hans Preuth",{"$f":"IF('Wettkampf 1'!D19>0,1,0)","v":1},{"$f":"IF('2'!$D19>0,1,0)","v":1},{"$f":"IF('3'!$D19>0,1,0)","v":0},{"$f":"IF('4'!$D19>0,1,0)","v":0},{"$f":"IF('5'!$D19>0,1,0)","v":0},{"$f":"IF('6'!$D19>0,1,0)","v":0},2,{"$f":"IF('7'!$D19>0,1,0)","v":0},{"$f":"IF('8'!$D19>0,1,0)","v":0},{"$f":"IF('9'!$D19>0,1,0)","v":0},{"$f":"IF('10'!$D19>0,1,0)","v":0},{"$f":"IF('11'!$D19>0,1,0)","v":0},{"$f":"IF('12'!$D19>0,1,0)","v":0},0,2]
["Karl-Heinz Schrand",{"$f":"IF('Wettkampf 1'!D20>0,1,0)","v":1},{"$f":"IF('2'!$D20>0,1,0)","v":1},{"$f":"IF('3'!$D20>0,1,0)","v":1},{"$f":"IF('4'!$D20>0,1,0)","v":1},{"$f":"IF('5'!$D20>0,1,0)","v":1},{"$f":"IF('6'!$D20>0,1,0)","v":1},6,{"$f":"IF('7'!$D20>0,1,0)","v":0},{"$f":"IF('8'!$D20>0,1,0)","v":0},{"$f":"IF('9'!$D20>0,1,0)","v":0},{"$f":"IF('10'!$D20>0,1,0)","v":0},{"$f":"IF('11'!$D20>0,1,0)","v":0},{"$f":"IF('12'!$D20>0,1,0)","v":0},0,6]
["Holger Szczepanski",{"$f":"IF('Wettkampf 1'!D21>0,1,0)","v":1},{"$f":"IF('2'!$D21>0,1,0)","v":1},{"$f":"IF('3'!$D21>0,1,0)","v":1},{"$f":"IF('4'!$D21>0,1,0)","v":1},{"$f":"IF('5'!$D21>0,1,0)","v":1},{"$f":"IF('6'!$D21>0,1,0)","v":1},6,{"$f":"IF('7'!$D21>0,1,0)","v":0},{"$f":"IF('8'!$D21>0,1,0)","v":0},{"$f":"IF('9'!$D21>0,1,0)","v":0},{"$f":"IF('10'!$D21>0,1,0)","v":0},{"$f":"IF('11'!$D21>0,1,0)","v":0},{"$f":"IF('12'!$D21>0,1,0)","v":0},0,6]
["Bernd Witting",{"$f":"IF('Wettkampf 1'!D22>0,1,0)","v":1},{"$f":"IF('2'!$D22>0,1,0)","v":1},{"$f":"IF('3'!$D22>0,1,0)","v":1},{"$f":"IF('4'!$D22>0,1,0)","v":1},{"$f":"IF('5'!$D22>0,1,0)","v":1},{"$f":"IF('6'!$D22>0,1,0)","v":1},6,{"$f":"IF('7'!$D22>0,1,0)","v":0},{"$f":"IF('8'!$D22>0,1,0)","v":0},{"$f":"IF('9'!$D22>0,1,0)","v":0},{"$f":"IF('10'!$D22>0,1,0)","v":0},{"$f":"IF('11'!$D22>0,1,0)","v":0},{"$f":"IF('12'!$D22>0,1,0)","v":0},0,6]
["Hermann Schwarte",{"$f":"IF('Wettkampf 1'!D23>0,1,0)","v":1},{"$f":"IF('2'!$D23>0,1,0)","v":1},{"$f":"IF('3'!$D23>0,1,0)","v":1},{"$f":"IF('4'!$D23>0,1,0)","v":1},{"$f":"IF('5'!$D23>0,1,0)","v":1},{"$f":"IF('6'!$D23>0,1,0)","v":0},5,{"$f":"IF('7'!$D23>0,1,0)","v":0},{"$f":"IF('8'!$D23>0,1,0)","v":0},{"$f":"IF('9'!$D23>0,1,0)","v":0},{"$f":"IF('10'!$D23>0,1,0)","v":0},{"$f":"IF('11'!$D23>0,1,0)","v":0},{"$f":"IF('12'!$D23>0,1,0)","v":0},0,5]
["Bernd Rode",{"$f":"IF('Wettkampf 1'!D24>0,1,0)","v":1},{"$f":"IF('2'!$D24>0,1,0)","v":1},{"$f":"IF('3'!$D24>0,1,0)","v":1},{"$f":"IF('4'!$D24>0,1,0)","v":1},{"$f":"IF('5'!$D24>0,1,0)","v":1},{"$f":"IF('6'!$D24>0,1,0)","v":1},6,{"$f":"IF('7'!$D24>0,1,0)","v":0},{"$f":"IF('8'!$D24>0,1,0)","v":0},{"$f":"IF('9'!$D24>0,1,0)","v":0},{"$f":"IF('10'!$D24>0,1,0)","v":0},{"$f":"IF('11'!$D24>0,1,0)","v":0},{"$f":"IF('12'!$D24>0,1,0)","v":0},0,6]
["Daniel Sebers",{"$f":"IF('Wettkampf 1'!D25>0,1,0)","v":1},{"$f":"IF('2'!$D25>0,1,0)","v":1},{"$f":"IF('3'!$D25>0,1,0)","v":1},{"$f":"IF('4'!$D25>0,1,0)","v":1},{"$f":"IF('5'!$D25>0,1,0)","v":1},{"$f":"IF('6'!$D25>0,1,0)","v":1},6,{"$f":"IF('7'!$D25>0,1,0)","v":0},{"$f":"IF('8'!$D25>0,1,0)","v":0},{"$f":"IF('9'!$D25>0,1,0)","v":0},{"$f":"IF('10'!$D25>0,1,0)","v":0},{"$f":"IF('11'!$D25>0,1,0)","v":0},{"$f":"IF('12'!$D25>0,1,0)","v":0},0,6]
["Simon Schutenbrock",{"$f":"IF('Wettkampf 1'!D26>0,1,0)","v":1},{"$f":"IF('2'!$D26>0,1,0)","v":1},{"$f":"IF('3'!$D26>0,1,0)","v":1},{"$f":"IF('4'!$D26>0,1,0)","v":1},{"$f":"IF('5'!$D26>0,1,0)","v":1},{"$f":"IF('6'!$D26>0,1,0)","v":1},6,{"$f":"IF('7'!$D26>0,1,0)","v":0},{"$f":"IF('8'!$D26>0,1,0)","v":0},{"$f":"IF('9'!$D26>0,1,0)","v":0},{"$f":"IF('10'!$D26>0,1,0)","v":0},{"$f":"IF('11'!$D26>0,1,0)","v":0},{"$f":"IF('12'!$D26>0,1,0)","v":0},0,6]
["Jürgen Schroer",{"$f":"IF('Wettkampf 1'!D27>0,1,0)","v":1},{"$f":"IF('2'!$D27>0,1,0)","v":1},{"$f":"IF('3'!$D27>0,1,0)","v":1},{"$f":"IF('4'!$D27>0,1,0)","v":1},{"$f":"IF('5'!$D27>0,1,0)","v":1},{"$f":"IF('6'!$D27>0,1,0)","v":1},6,{"$f":"IF('7'!$D27>0,1,0)","v":0},{"$f":"IF('8'!$D27>0,1,0)","v":0},{"$f":"IF('9'!$D27>0,1,0)","v":0},{"$f":"IF('10'!$D27>0,1,0)","v":0},{"$f":"IF('11'!$D27>0,1,0)","v":0},{"$f":"IF('12'!$D27>0,1,0)","v":0},0,6]
["Marc Eckmann",{"$f":"IF('Wettkampf 1'!D28>0,1,0)","v":1},{"$f":"IF('2'!$D28>0,1,0)","v":1},{"$f":"IF('3'!$D28>0,1,0)","v":0},{"$f":"IF('4'!$D28>0,1,0)","v":1},{"$f":"IF('5'!$D28>0,1,0)","v":1},{"$f":"IF('6'!$D28>0,1,0)","v":1},5,{"$f":"IF('7'!$D28>0,1,0)","v":0},{"$f":"IF('8'!$D28>0,1,0)","v":0},{"$f":"IF('9'!$D28>0,1,0)","v":0},{"$f":"IF('10'!$D28>0,1,0)","v":0},{"$f":"IF('11'!$D28>0,1,0)","v":0},{"$f":"IF('12'!$D28>0,1,0)","v":0},0,5]
["Markus Jungsthöfel",{"$f":"IF('Wettkampf 1'!D29>0,1,0)","v":1},{"$f":"IF('2'!$D29>0,1,0)","v":1},{"$f":"IF('3'!$D29>0,1,0)","v":1},{"$f":"IF('4'!$D29>0,1,0)","v":1},{"$f":"IF('5'!$D29>0,1,0)","v":1},{"$f":"IF('6'!$D29>0,1,0)","v":1},6,{"$f":"IF('7'!$D29>0,1,0)","v":0},{"$f":"IF('8'!$D29>0,1,0)","v":0},{"$f":"IF('9'!$D29>0,1,0)","v":0},{"$f":"IF('10'!$D29>0,1,0)","v":0},{"$f":"IF('11'!$D29>0,1,0)","v":0},{"$f":"IF('12'!$D29>0,1,0)","v":0},0,6]
["Jens Henzen",{"$f":"IF('Wettkampf 1'!D30>0,1,0)","v":1},{"$f":"IF('2'!$D30>0,1,0)","v":1},{"$f":"IF('3'!$D30>0,1,0)","v":1},{"$f":"IF('4'!$D30>0,1,0)","v":1},{"$f":"IF('5'!$D30>0,1,0)","v":1},{"$f":"IF('6'!$D30>0,1,0)","v":1},6,{"$f":"IF('7'!$D30>0,1,0)","v":0},{"$f":"IF('8'!$D30>0,1,0)","v":0},{"$f":"IF('9'!$D30>0,1,0)","v":0},{"$f":"IF('10'!$D30>0,1,0)","v":0},{"$f":"IF('11'!$D30>0,1,0)","v":0},{"$f":"IF('12'!$D30>0,1,0)","v":0},0,6]
["Uwe Goldenstein",{"$f":"IF('Wettkampf 1'!D31>0,1,0)","v":1},{"$f":"IF('2'!$D31>0,1,0)","v":1},{"$f":"IF('3'!$D31>0,1,0)","v":1},{"$f":"IF('4'!$D31>0,1,0)","v":1},{"$f":"IF('5'!$D31>0,1,0)","v":1},{"$f":"IF('6'!$D31>0,1,0)","v":1},6,{"$f":"IF('7'!$D31>0,1,0)","v":0},{"$f":"IF('8'!$D31>0,1,0)","v":0},{"$f":"IF('9'!$D31>0,1,0)","v":0},{"$f":"IF('10'!$D31>0,1,0)","v":0},{"$f":"IF('11'!$D31>0,1,0)","v":0},{"$f":"IF('12'!$D31>0,1,0)","v":0},0,6]
["Ingo Zdralik",{"$f":"IF('Wettkampf 1'!D32>0,1,0)","v":1},{"$f":"IF('2'!$D32>0,1,0)","v":1},{"$f":"IF('3'!$D32>0,1,0)","v":1},{"$f":"IF('4'!$D32>0,1,0)","v":1},{"$f":"IF('5'!$D32>0,1,0)","v":1},{"$f":"IF('6'!$D32>0,1,0)","v":1},6,{"$f":"IF('7'!$D32>0,1,0)","v":0},{"$f":"IF('8'!$D32>0,1,0)","v":0},{"$f":"IF('9'!$D32>0,1,0)","v":0},{"$f":"IF('10'!$D32>0,1,0)","v":0},{"$f":"IF('11'!$D32>0,1,0)","v":0},{"$f":"IF('12'!$D32>0,1,0)","v":0},0,6]
["Schütze 24",{"$f":"IF('Wettkampf 1'!D33>0,1,0)","v":0},{"$f":"IF('2'!$D33>0,1,0)","v":0},{"$f":"IF('3'!$D33>0,1,0)","v":0},{"$f":"IF('4'!$D33>0,1,0)","v":0},{"$f":"IF('5'!$D33>0,1,0)","v":0},{"$f":"IF('6'!$D33>0,1,0)","v":0},0,{"$f":"IF('7'!$D33>0,1,0)","v":0},{"$f":"IF('8'!$D33>0,1,0)","v":0},{"$f":"IF('9'!$D33>0,1,0)","v":0},{"$f":"IF('10'!$D33>0,1,0)","v":0},{"$f":"IF('11'!$D33>0,1,0)","v":0},{"$f":"IF('12'!$D33>0,1,0)","v":0},0,0]
["Oliver Reinelt",{"$f":"IF('Wettkampf 1'!D34>0,1,0)","v":1},{"$f":"IF('2'!$D34>0,1,0)","v":1},{"$f":"IF('3'!$D34>0,1,0)","v":1},{"$f":"IF('4'!$D34>0,1,0)","v":1},{"$f":"IF('5'!$D34>0,1,0)","v":1},{"$f":"IF('6'!$D34>0,1,0)","v":1},6,{"$f":"IF('7'!$D34>0,1,0)","v":0},{"$f":"IF('8'!$D34>0,1,0)","v":0},{"$f":"IF('9'!$D34>0,1,0)","v":0},{"$f":"IF('10'!$D34>0,1,0)","v":0},{"$f":"IF('11'!$D34>0,1,0)","v":0},{"$f":"IF('12'!$D34>0,1,0)","v":0},0,6]
["Vitalij Schmidt",{"$f":"IF('Wettkampf 1'!D35>0,1,0)","v":1},{"$f":"IF('2'!$D35>0,1,0)","v":1},{"$f":"IF('3'!$D35>0,1,0)","v":1},{"$f":"IF('4'!$D35>0,1,0)","v":1},{"$f":"IF('5'!$D35>0,1,0)","v":1},{"$f":"IF('6'!$D35>0,1,0)","v":1},6,{"$f":"IF('7'!$D35>0,1,0)","v":0},{"$f":"IF('8'!$D35>0,1,0)","v":0},{"$f":"IF('9'!$D35>0,1,0)","v":0},{"$f":"IF('10'!$D35>0,1,0)","v":0},{"$f":"IF('11'!$D35>0,1,0)","v":0},{"$f":"IF('12'!$D35>0,1,0)","v":0},0,6]
["Hermann Benten",{"$f":"IF('Wettkampf 1'!D36>0,1,0)","v":1},{"$f":"IF('2'!$D36>0,1,0)","v":1},{"$f":"IF('3'!$D36>0,1,0)","v":1},{"$f":"IF('4'!$D36>0,1,0)","v":1},{"$f":"IF('5'!$D36>0,1,0)","v":1},{"$f":"IF('6'!$D36>0,1,0)","v":1},6,{"$f":"IF('7'!$D36>0,1,0)","v":0},{"$f":"IF('8'!$D36>0,1,0)","v":0},{"$f":"IF('9'!$D36>0,1,0)","v":0},{"$f":"IF('10'!$D36>0,1,0)","v":0},{"$f":"IF('11'!$D36>0,1,0)","v":0},{"$f":"IF('12'!$D36>0,1,0)","v":0},0,6]
["Johannes Thesing",{"$f":"IF('Wettkampf 1'!D37>0,1,0)","v":1},{"$f":"IF('2'!$D37>0,1,0)","v":1},{"$f":"IF('3'!$D37>0,1,0)","v":1},{"$f":"IF('4'!$D37>0,1,0)","v":1},{"$f":"IF('5'!$D37>0,1,0)","v":1},{"$f":"IF('6'!$D37>0,1,0)","v":1},6,{"$f":"IF('7'!$D37>0,1,0)","v":0},{"$f":"IF('8'!$D37>0,1,0)","v":0},{"$f":"IF('9'!$D37>0,1,0)","v":0},{"$f":"IF('10'!$D37>0,1,0)","v":0},{"$f":"IF('11'!$D37>0,1,0)","v":0},{"$f":"IF('12'!$D37>0,1,0)","v":0},0,6]
["Schütze 29",{"$f":"IF('Wettkampf 1'!D38>0,1,0)","v":0},{"$f":"IF('2'!$D38>0,1,0)","v":0},{"$f":"IF('3'!$D38>0,1,0)","v":0},{"$f":"IF('4'!$D38>0,1,0)","v":0},{"$f":"IF('5'!$D38>0,1,0)","v":0},{"$f":"IF('6'!$D38>0,1,0)","v":0},0,{"$f":"IF('7'!$D38>0,1,0)","v":0},{"$f":"IF('8'!$D38>0,1,0)","v":0},{"$f":"IF('9'!$D38>0,1,0)","v":0},{"$f":"IF('10'!$D38>0,1,0)","v":0},{"$f":"IF('11'!$D38>0,1,0)","v":0},{"$f":"IF('12'!$D38>0,1,0)","v":0},0,0]
["Willi Rolfes",{"$f":"IF('Wettkampf 1'!D39>0,1,0)","v":1},{"$f":"IF('2'!$D39>0,1,0)","v":1},{"$f":"IF('3'!$D39>0,1,0)","v":1},{"$f":"IF('4'!$D39>0,1,0)","v":1},{"$f":"IF('5'!$D39>0,1,0)","v":1},{"$f":"IF('6'!$D39>0,1,0)","v":1},6,{"$f":"IF('7'!$D39>0,1,0)","v":0},{"$f":"IF('8'!$D39>0,1,0)","v":0},{"$f":"IF('9'!$D39>0,1,0)","v":0},{"$f":"IF('10'!$D39>0,1,0)","v":0},{"$f":"IF('11'!$D39>0,1,0)","v":0},{"$f":"IF('12'!$D39>0,1,0)","v":0},0,6]
["Werner Thyen",{"$f":"IF('Wettkampf 1'!D40>0,1,0)","v":1},{"$f":"IF('2'!$D40>0,1,0)","v":1},{"$f":"IF('3'!$D40>0,1,0)","v":1},{"$f":"IF('4'!$D40>0,1,0)","v":1},{"$f":"IF('5'!$D40>0,1,0)","v":1},{"$f":"IF('6'!$D40>0,1,0)","v":1},6,{"$f":"IF('7'!$D40>0,1,0)","v":0},{"$f":"IF('8'!$D40>0,1,0)","v":0},{"$f":"IF('9'!$D40>0,1,0)","v":0},{"$f":"IF('10'!$D40>0,1,0)","v":0},{"$f":"IF('11'!$D40>0,1,0)","v":0},{"$f":"IF('12'!$D40>0,1,0)","v":0},0,{"$f":"O39+H39","v":6}]
["Wilfried Breyer",{"$f":"IF('Wettkampf 1'!D41>0,1,0)","v":1},{"$f":"IF('2'!$D41>0,1,0)","v":1},{"$f":"IF('3'!$D41>0,1,0)","v":1},{"$f":"IF('4'!$D41>0,1,0)","v":1},{"$f":"IF('5'!$D41>0,1,0)","v":1},{"$f":"IF('6'!$D41>0,1,0)","v":1},6,{"$f":"IF('7'!$D41>0,1,0)","v":0},{"$f":"IF('8'!$D41>0,1,0)","v":0},{"$f":"IF('9'!$D41>0,1,0)","v":0},{"$f":"IF('10'!$D41>0,1,0)","v":0},{"$f":"IF('11'!$D41>0,1,0)","v":0},{"$f":"IF('12'!$D41>0,1,0)","v":0},0,6]
["Klaus Steenken",{"$f":"IF('Wettkampf 1'!D42>0,1,0)","v":1},{"$f":"IF('2'!$D42>0,1,0)","v":1},{"$f":"IF('3'!$D42>0,1,0)","v":1},{"$f":"IF('4'!$D42>0,1,0)","v":1},{"$f":"IF('5'!$D42>0,1,0)","v":1},{"$f":"IF('6'!$D42>0,1,0)","v":1},6,{"$f":"IF('7'!$D42>0,1,0)","v":0},{"$f":"IF('8'!$D42>0,1,0)","v":0},{"$f":"IF('9'!$D42>0,1,0)","v":0},{"$f":"IF('10'!$D42>0,1,0)","v":0},{"$f":"IF('11'!$D42>0,1,0)","v":0},{"$f":"IF('12'!$D42>0,1,0)","v":0},0,6]
["Markus Janßen",{"$f":"IF('Wettkampf 1'!D43>0,1,0)","v":1},{"$f":"IF('2'!$D43>0,1,0)","v":1},{"$f":"IF('3'!$D43>0,1,0)","v":1},{"$f":"IF('4'!$D43>0,1,0)","v":1},{"$f":"IF('5'!$D43>0,1,0)","v":1},{"$f":"IF('6'!$D43>0,1,0)","v":1},6,{"$f":"IF('7'!$D43>0,1,0)","v":0},{"$f":"IF('8'!$D43>0,1,0)","v":0},{"$f":"IF('9'!$D43>0,1,0)","v":0},{"$f":"IF('10'!$D43>0,1,0)","v":0},{"$f":"IF('11'!$D43>0,1,0)","v":0},{"$f":"IF('12'!$D43>0,1,0)","v":0},0,6]
["Carsten Peters",{"$f":"IF('Wettkampf 1'!D44>0,1,0)","v":0},{"$f":"IF('2'!$D44>0,1,0)","v":1},{"$f":"IF('3'!$D44>0,1,0)","v":0},{"$f":"IF('4'!$D44>0,1,0)","v":1},{"$f":"IF('5'!$D44>0,1,0)","v":1},{"$f":"IF('6'!$D44>0,1,0)","v":1},4,{"$f":"IF('7'!$D44>0,1,0)","v":0},{"$f":"IF('8'!$D44>0,1,0)","v":0},{"$f":"IF('9'!$D44>0,1,0)","v":0},{"$f":"IF('10'!$D44>0,1,0)","v":0},{"$f":"IF('11'!$D44>0,1,0)","v":0},{"$f":"IF('12'!$D44>0,1,0)","v":0},0,4]
["Dietmar Spekker",{"$f":"IF('Wettkampf 1'!D45>0,1,0)","v":0},{"$f":"IF('2'!$D45>0,1,0)","v":0},{"$f":"IF('3'!$D45>0,1,0)","v":1},{"$f":"IF('4'!$D45>0,1,0)","v":1},{"$f":"IF('5'!$D45>0,1,0)","v":0},{"$f":"IF('6'!$D45>0,1,0)","v":0},2,{"$f":"IF('7'!$D45>0,1,0)","v":0},{"$f":"IF('8'!$D45>0,1,0)","v":0},{"$f":"IF('9'!$D45>0,1,0)","v":0},{"$f":"IF('10'!$D45>0,1,0)","v":0},{"$f":"IF('11'!$D45>0,1,0)","v":0},{"$f":"IF('12'!$D45>0,1,0)","v":0},0,2]
[null,{"$f":"SUM(B9:B44)","v":{"v":31,"d":"31.00"}},{"$f":"SUM(C9:C44)","v":{"v":31,"d":"31.00"}},{"v":29,"d":"29.00"},{"v":31,"d":"31.00"},{"v":30,"d":"30.00"},{"v":29,"d":"29.00"},{"$f":"SUM(H9:H44)","v":{"v":181,"d":"181.00"}},{"$f":"SUM(I9:I44)","v":{"v":0,"d":"0.00"}},{"$f":"SUM(J9:J44)","v":{"v":0,"d":"0.00"}},{"v":0,"d":"0.00"},{"v":0,"d":"0.00"},{"v":0,"d":"0.00"},{"v":0,"d":"0.00"},{"$f":"SUM(O9:O44)","v":{"v":0,"d":"0.00"}},{"$f":"SUM(P9:P44)","v":{"v":181,"d":"181.00"}}]

{"sheet":"Übersicht Gruppen","index":17,"n_rows":7,"n_cols":20,"rows_kept":7,"hidden":true}
[]
[null,"Neuvrees II",{"$f":"VLOOKUP($B$2:$B$7,'Wettkampf 1'!$B$2:$D$7,3,FALSE)","v":932.5},{"$f":"VLOOKUP($B$2:$B$7,'2'!$B$2:$D$7,3,FALSE)","v":{"v":931.4000000000001,"d":"931.4"}},{"$f":"VLOOKUP($B$2:$B$7,'3'!$B$2:$D$7,3,FALSE)","v":{"v":938,"d":"938.0"}},{"$f":"VLOOKUP($B$2:$B$7,'4'!$B$2:$D$7,3,FALSE)","v":931.6},{"$f":"VLOOKUP($B$2:$B$7,'5'!$B$2:$D$7,3,FALSE)","v":{"v":935.9000000000001,"d":"935.9"}},{"$f":"VLOOKUP($B$2:$B$7,'6'!$B$2:$D$7,3,FALSE)","v":933.7},{"$f":"IF(Formelhilfe!H3 > 0,J2/Formelhilfe!H3,0)","v":{"v":933.8499999999999,"d":"933.9"}},{"$f":"SUM(C2:H2)","v":{"v":5603.099999999999,"d":"5,603.1"}},{"$f":"VLOOKUP($B$2:$B$7,'7'!$B$2:$D$7,3,FALSE)","v":{"v":0,"d":"0.0"}},{"$f":"VLOOKUP($B$2:$B$7,'8'!$B$2:$D$7,3,FALSE)","v":{"v":0,"d":"0.0"}},{"$f":"VLOOKUP($B$2:$B$7,'9'!$B$2:$D$7,3,FALSE)","v":{"v":0,"d":"0.0"}},{"$f":"VLOOKUP($B$2:$B$7,'10'!$B$2:$D$7,3,FALSE)","v":{"v":0,"d":"0.0"}},{"$f":"VLOOKUP($B$2:$B$7,'11'!$B$2:$D$7,3,FALSE)","v":{"v":0,"d":"0.0"}},{"$f":"VLOOKUP($B$2:$B$7,'12'!$B$2:$D$7,3,FALSE)","v":{"v":0,"d":"0.0"}},{"$f":"IF(Formelhilfe!O3>0,R2/Formelhilfe!O3,0)","v":{"v":0,"d":"0.0"}},{"$f":"SUM(K2:P2)","v":{"v":0,"d":"0.0"}},{"$f":"IF(Formelhilfe!P3>0,T2/Formelhilfe!P3,0)","v":{"v":933.8499999999999,"d":"933.9"}},{"$f":"SUM(C2:H2,K2:P2)","v":{"v":5603.099999999999,"d":"5,603.1"}}]
[null,"Lahn IV",{"$f":"VLOOKUP($B$2:$B$7,'Wettkampf 1'!$B$2:$D$7,3,FALSE)","v":{"v":929.5000000000001,"d":"929.5"}},{"$f":"VLOOKUP($B$2:$B$7,'2'!$B$2:$D$7,3,FALSE)","v":935.3},{"$f":"VLOOKUP($B$2:$B$7,'3'!$B$2:$D$7,3,FALSE)","v":{"v":933,"d":"933.0"}},{"$f":"VLOOKUP($B$2:$B$7,'4'!$B$2:$D$7,3,FALSE)","v":940.1},{"$f":"VLOOKUP($B$2:$B$7,'5'!$B$2:$D$7,3,FALSE)","v":{"v":933.4000000000001,"d":"933.4"}},{"$f":"VLOOKUP($B$2:$B$7,'6'!$B$2:$D$7,3,FALSE)","v":{"v":928.5000000000001,"d":"928.5"}},{"$f":"IF(Formelhilfe!H6 > 0,J3/Formelhilfe!H6,0)","v":{"v":933.3000000000001,"d":"933.3"}},{"v":5599.8,"d":"5,599.8"},{"$f":"VLOOKUP($B$2:$B$7,'7'!$B$2:$D$7,3,FALSE)","v":{"v":0,"d":"0.0"}},{"$f":"VLOOKUP($B$2:$B$7,'8'!$B$2:$D$7,3,FALSE)","v":{"v":0,"d":"0.0"}},{"$f":"VLOOKUP($B$2:$B$7,'9'!$B$2:$D$7,3,FALSE)","v":{"v":0,"d":"0.0"}},{"$f":"VLOOKUP($B$2:$B$7,'10'!$B$2:$D$7,3,FALSE)","v":{"v":0,"d":"0.0"}},{"$f":"VLOOKUP($B$2:$B$7,'11'!$B$2:$D$7,3,FALSE)","v":{"v":0,"d":"0.0"}},{"$f":"VLOOKUP($B$2:$B$7,'12'!$B$2:$D$7,3,FALSE)","v":{"v":0,"d":"0.0"}},{"$f":"IF(Formelhilfe!O6>0,R3/Formelhilfe!O6,0)","v":{"v":0,"d":"0.0"}},{"v":0,"d":"0.0"},{"$f":"IF(Formelhilfe!P6>0,T3/Formelhilfe!P6,0)","v":{"v":933.3000000000001,"d":"933.3"}},{"v":5599.8,"d":"5,599.8"}]
[null,"Börgerwald II",{"$f":"VLOOKUP($B$2:$B$7,'Wettkampf 1'!$B$2:$D$7,3,FALSE)","v":{"v":932.9000000000001,"d":"932.9"}},{"$f":"VLOOKUP($B$2:$B$7,'2'!$B$2:$D$7,3,FALSE)","v":935.1},{"$f":"VLOOKUP($B$2:$B$7,'3'!$B$2:$D$7,3,FALSE)","v":931.1},{"$f":"VLOOKUP($B$2:$B$7,'4'!$B$2:$D$7,3,FALSE)","v":936.7},{"$f":"VLOOKUP($B$2:$B$7,'5'!$B$2:$D$7,3,FALSE)","v":935.1},{"$f":"VLOOKUP($B$2:$B$7,'6'!$B$2:$D$7,3,FALSE)","v":927.8},{"$f":"IF(Formelhilfe!H4 > 0,J4/Formelhilfe!H4,0)","v":{"v":933.1166666666668,"d":"933.1"}},{"v":5598.700000000001,"d":"5,598.7"},{"$f":"VLOOKUP($B$2:$B$7,'7'!$B$2:$D$7,3,FALSE)","v":{"v":0,"d":"0.0"}},{"$f":"VLOOKUP($B$2:$B$7,'8'!$B$2:$D$7,3,FALSE)","v":{"v":0,"d":"0.0"}},{"$f":"VLOOKUP($B$2:$B$7,'9'!$B$2:$D$7,3,FALSE)","v":{"v":0,"d":"0.0"}},{"$f":"VLOOKUP($B$2:$B$7,'10'!$B$2:$D$7,3,FALSE)","v":{"v":0,"d":"0.0"}},{"$f":"VLOOKUP($B$2:$B$7,'11'!$B$2:$D$7,3,FALSE)","v":{"v":0,"d":"0.0"}},{"$f":"VLOOKUP($B$2:$B$7,'12'!$B$2:$D$7,3,FALSE)","v":{"v":0,"d":"0.0"}},{"$f":"IF(Formelhilfe!O4>0,R4/Formelhilfe!O4,0)","v":{"v":0,"d":"0.0"}},{"v":0,"d":"0.0"},{"$f":"IF(Formelhilfe!P4>0,T4/Formelhilfe!P4,0)","v":{"v":933.1166666666668,"d":"933.1"}},{"v":5598.700000000001,"d":"5,598.7"}]
[null,"Neuvrees I",{"$f":"VLOOKUP($B$2:$B$7,'Wettkampf 1'!$B$2:$D$7,3,FALSE)","v":933.2},{"$f":"VLOOKUP($B$2:$B$7,'2'!$B$2:$D$7,3,FALSE)","v":{"v":929.1000000000001,"d":"929.1"}},{"$f":"VLOOKUP($B$2:$B$7,'3'!$B$2:$D$7,3,FALSE)","v":926.2},{"$f":"VLOOKUP($B$2:$B$7,'4'!$B$2:$D$7,3,FALSE)","v":{"v":931.6999999999999,"d":"931.7"}},{"$f":"VLOOKUP($B$2:$B$7,'5'!$B$2:$D$7,3,FALSE)","v":{"v":932.1999999999999,"d":"932.2"}},{"$f":"VLOOKUP($B$2:$B$7,'6'!$B$2:$D$7,3,FALSE)","v":{"v":932.9000000000001,"d":"932.9"}},{"$f":"IF(Formelhilfe!H7 > 0,J5/Formelhilfe!H7,0)","v":{"v":930.8833333333332,"d":"930.9"}},{"v":5585.299999999999,"d":"5,585.3"},{"$f":"VLOOKUP($B$2:$B$7,'7'!$B$2:$D$7,3,FALSE)","v":{"v":0,"d":"0.0"}},{"$f":"VLOOKUP($B$2:$B$7,'8'!$B$2:$D$7,3,FALSE)","v":{"v":0,"d":"0.0"}},{"$f":"VLOOKUP($B$2:$B$7,'9'!$B$2:$D$7,3,FALSE)","v":{"v":0,"d":"0.0"}},{"$f":"VLOOKUP($B$2:$B$7,'10'!$B$2:$D$7,3,FALSE)","v":{"v":0,"d":"0.0"}},{"$f":"VLOOKUP($B$2:$B$7,'11'!$B$2:$D$7,3,FALSE)","v":{"v":0,"d":"0.0"}},{"$f":"VLOOKUP($B$2:$B$7,'12'!$B$2:$D$7,3,FALSE)","v":{"v":0,"d":"0.0"}},{"$f":"IF(Formelhilfe!O7>0,R5/Formelhilfe!O7,0)","v":{"v":0,"d":"0.0"}},{"v":0,"d":"0.0"},{"$f":"IF(Formelhilfe!P7>0,T5/Formelhilfe!P7,0)","v":{"v":930.8833333333332,"d":"930.9"}},{"v":5585.299999999999,"d":"5,585.3"}]
[null,"Börger II",{"$f":"VLOOKUP($B$2:$B$7,'Wettkampf 1'!$B$2:$D$7,3,FALSE)","v":{"v":934.4000000000001,"d":"934.4"}},{"$f":"VLOOKUP($B$2:$B$7,'2'!$B$2:$D$7,3,FALSE)","v":934.2},{"$f":"VLOOKUP($B$2:$B$7,'3'!$B$2:$D$7,3,FALSE)","v":925.6},{"$f":"VLOOKUP($B$2:$B$7,'4'!$B$2:$D$7,3,FALSE)","v":{"v":934,"d":"934.0"}},{"$f":"VLOOKUP($B$2:$B$7,'5'!$B$2:$D$7,3,FALSE)","v":921.6},{"$f":"VLOOKUP($B$2:$B$7,'6'!$B$2:$D$7,3,FALSE)","v":929.2},{"$f":"IF(Formelhilfe!H2 > 0,J6/Formelhilfe!H2,0)","v":{"v":929.8333333333334,"d":"929.8"}},{"v":5579,"d":"5,579.0"},{"$f":"VLOOKUP($B$2:$B$7,'7'!$B$2:$D$7,3,FALSE)","v":{"v":0,"d":"0.0"}},{"$f":"VLOOKUP($B$2:$B$7,'8'!$B$2:$D$7,3,FALSE)","v":{"v":0,"d":"0.0"}},{"$f":"VLOOKUP($B$2:$B$7,'9'!$B$2:$D$7,3,FALSE)","v":{"v":0,"d":"0.0"}},{"$f":"VLOOKUP($B$2:$B$7,'10'!$B$2:$D$7,3,FALSE)","v":{"v":0,"d":"0.0"}},{"$f":"VLOOKUP($B$2:$B$7,'11'!$B$2:$D$7,3,FALSE)","v":{"v":0,"d":"0.0"}},{"$f":"VLOOKUP($B$2:$B$7,'12'!$B$2:$D$7,3,FALSE)","v":{"v":0,"d":"0.0"}},{"$f":"IF(Formelhilfe!O2>0,R6/Formelhilfe!O2,0)","v":{"v":0,"d":"0.0"}},{"v":0,"d":"0.0"},{"$f":"IF(Formelhilfe!P2>0,T6/Formelhilfe!P2,0)","v":{"v":929.8333333333334,"d":"929.8"}},{"v":5579,"d":"5,579.0"}]
[null,"Börger III",{"$f":"VLOOKUP($B$2:$B$7,'Wettkampf 1'!$B$2:$D$7,3,FALSE)","v":{"v":923.6000000000001,"d":"923.6"}},{"$f":"VLOOKUP($B$2:$B$7,'2'!$B$2:$D$7,3,FALSE)","v":{"v":926.3000000000001,"d":"926.3"}},{"$f":"VLOOKUP($B$2:$B$7,'3'!$B$2:$D$7,3,FALSE)","v":927.2},{"$f":"VLOOKUP($B$2:$B$7,'4'!$B$2:$D$7,3,FALSE)","v":934.7},{"$f":"VLOOKUP($B$2:$B$7,'5'!$B$2:$D$7,3,FALSE)","v":{"v":931.9000000000001,"d":"931.9"}},{"$f":"VLOOKUP($B$2:$B$7,'6'!$B$2:$D$7,3,FALSE)","v":933.3},{"$f":"IF(Formelhilfe!H5 > 0,J7/Formelhilfe!H5,0)","v":{"v":929.5000000000001,"d":"929.5"}},{"v":5577.000000000001,"d":"5,577.0"},{"$f":"VLOOKUP($B$2:$B$7,'7'!$B$2:$D$7,3,FALSE)","v":{"v":0,"d":"0.0"}},{"$f":"VLOOKUP($B$2:$B$7,'8'!$B$2:$D$7,3,FALSE)","v":{"v":0,"d":"0.0"}},{"$f":"VLOOKUP($B$2:$B$7,'9'!$B$2:$D$7,3,FALSE)","v":{"v":0,"d":"0.0"}},{"$f":"VLOOKUP($B$2:$B$7,'10'!$B$2:$D$7,3,FALSE)","v":{"v":0,"d":"0.0"}},{"$f":"VLOOKUP($B$2:$B$7,'11'!$B$2:$D$7,3,FALSE)","v":{"v":0,"d":"0.0"}},{"$f":"VLOOKUP($B$2:$B$7,'12'!$B$2:$D$7,3,FALSE)","v":{"v":0,"d":"0.0"}},{"$f":"IF(Formelhilfe!O5>0,R7/Formelhilfe!O5,0)","v":{"v":0,"d":"0.0"}},{"v":0,"d":"0.0"},{"$f":"IF(Formelhilfe!P5>0,T7/Formelhilfe!P5,0)","v":{"v":929.5000000000001,"d":"929.5"}},{"v":5577.000000000001,"d":"5,577.0"}]