{"text_format":"3","workbook":"xlsx","n_sheets":18,"sheets":["Übersicht","Wettkampf 1","2","3","4","5","6","7","8","9","10","11","12","Ausdruck","Ausdruck blank","Übersicht Schützen","Formelhilfe","Übersicht Gruppen"],"not_rendered":{"images":3,"macros":1,"defined_names":12,"comments":3},"read":"whole","date_system":"1900"}

{"sheet":"Übersicht","index":0,"n_rows":54,"n_cols":22,"rows_kept":54,"merged":[[0,10,0,11],[0,12,0,14],[0,15,0,16],[2,9,2,10],[2,17,2,18],[2,19,2,20],[3,1,3,2],[3,21,5,21],[5,1,5,2],[6,1,6,2],[7,1,7,2],[8,1,8,2],[9,1,9,2],[10,1,10,2],[14,9,14,10],[14,17,14,18],[14,19,14,20],[14,21,16,21]]}
[{"$nulls":3},"Kreisrundenwettkampf",{"$nulls":5},"Saison","2019/2020",null,"4. Kreisklasse",null,null,"Schützen"]
[]
[null,null,"Wettkampftag:","15.09","06.10.","20.10.","10.11.","24.11.","08.12.","Hinrunde",null,"19.01.","02.02.","16.02.","01.03.","15.03.","29.03.","Rückrunde",null,"Serie komplett"]
["Pos.","Verein / Gruppe",null,"Spahnharrenstätte","Esterwegen","Neubörger","Lahn","Spahnharrenstätte","Eisten","Schnitt","Gesamt ","Neubörger",{"$f":"E4","v":"Esterwegen"},"Spahnharrenstätte","Lahn","Spahnharrenstätte","Eisten","Schnitt","Gesamt ","Schnitt","Gesamt","Differenz"]
[]
[1,{"$f":"'Übersicht Gruppen'!B2","v":"Eisten II "},null,{"$f":"'Übersicht Gruppen'!C2","v":{"v":937.0999999999999,"d":"937.1"}},{"$f":"'Übersicht Gruppen'!D2","v":935.1},{"$f":"'Übersicht Gruppen'!E2","v":{"v":939.0999999999999,"d":"939.1"}},{"$f":"'Übersicht Gruppen'!F2","v":937.5},{"$f":"'Übersicht Gruppen'!G2","v":{"v":936.6999999999999,"d":"936.7"}},{"$f":"'Übersicht Gruppen'!H2","v":935.4},{"$f":"'Übersicht Gruppen'!I2","v":{"v":936.8166666666666,"d":"936.82"}},{"$f":"SUM(D6:I6)","v":{"v":5620.9,"d":"5,620.9"}},{"$f":"'Übersicht Gruppen'!K2","v":935.4},{"$f":"'Übersicht Gruppen'!L2","v":932.4},{"$f":"'Übersicht Gruppen'!M2","v":937.3},{"$f":"'Übersicht Gruppen'!N2","v":936.1},{"$f":"'Übersicht Gruppen'!O2","v":944.5},{"$f":"'Übersicht Gruppen'!P2","v":{"v":0,"d":"0.0"}},{"$f":"IF(Formelhilfe!O2=0,0,'Übersicht Gruppen'!Q2)","v":937.14},{"$f":"SUM(L6:Q6)","v":{"v":4685.7,"d":"4,685.7"}},{"$f":"'Übersicht Gruppen'!S2","v":{"v":936.9636363636363,"d":"936.96"}},{"$f":"SUM(S6+K6)","v":{"v":10306.599999999999,"d":"10,306.6"}}]
[2,{"$f":"'Übersicht Gruppen'!B3","v":"Spahnharrenstätte III"},null,{"$f":"'Übersicht Gruppen'!C3","v":{"v":927.3000000000001,"d":"927.3"}},{"$f":"'Übersicht Gruppen'!D3","v":934.8},{"$f":"'Übersicht Gruppen'!E3","v":928.5},{"$f":"'Übersicht Gruppen'!F3","v":{"v":935.5999999999999,"d":"935.6"}},{"$f":"'Übersicht Gruppen'!G3","v":{"v":937.5000000000001,"d":"937.5"}},{"$f":"'Übersicht Gruppen'!H3","v":927.2},{"$f":"'Übersicht Gruppen'!I3","v":{"v":931.8166666666666,"d":"931.82"}},{"v":5590.9,"d":"5,590.9"},{"$f":"'Übersicht Gruppen'!K3","v":921.1},{"$f":"'Übersicht Gruppen'!L3","v":{"v":928,"d":"928.0"}},{"$f":"'Übersicht Gruppen'!M3","v":935.4},{"$f":"'Übersicht Gruppen'!N3","v":934.9},{"$f":"'Übersicht Gruppen'!O3","v":{"v":938.9000000000001,"d":"938.9"}},{"$f":"'Übersicht Gruppen'!P3","v":{"v":0,"d":"0.0"}},{"$f":"IF(Formelhilfe!O3=0,0,'Übersicht Gruppen'!Q3)","v":{"v":931.6600000000001,"d":"931.66"}},{"v":4658.3,"d":"4,658.3"},{"$f":"'Übersicht Gruppen'!S3","v":{"v":931.7454545454544,"d":"931.75"}},{"$f":"SUM(S7+K7)","v":{"v":10249.2,"d":"10,249.2"}},{"$f":"(U6-U7)*-1","v":{"v":-57.39999999999782,"d":"-57.4"}}]
[3,{"$f":"'Übersicht Gruppen'!B4","v":"Spahnharrenstätte II"},null,{"$f":"'Übersicht Gruppen'!C4","v":{"v":925.0999999999999,"d":"925.1"}},{"$f":"'Übersicht Gruppen'!D4","v":{"v":929.1999999999999,"d":"929.2"}},{"$f":"'Übersicht Gruppen'!E4","v":921.6},{"$f":"'Übersicht Gruppen'!F4","v":929.7},{"$f":"'Übersicht Gruppen'!G4","v":930.9},{"$f":"'Übersicht Gruppen'!H4","v":934.5},{"$f":"'Übersicht Gruppen'!I4","v":{"v":928.4999999999999,"d":"928.50"}},{"v":5570.999999999999,"d":"5,571.0"},{"$f":"'Übersicht Gruppen'!K4","v":{"v":931.9000000000001,"d":"931.9"}},{"$f":"'Übersicht Gruppen'!L4","v":928.5},{"$f":"'Übersicht Gruppen'!M4","v":{"v":929.6999999999999,"d":"929.7"}},{"$f":"'Übersicht Gruppen'!N4","v":929.7},{"$f":"'Übersicht Gruppen'!O4","v":{"v":928,"d":"928.0"}},{"$f":"'Übersicht Gruppen'!P4","v":{"v":0,"d":"0.0"}},{"$f":"IF(Formelhilfe!O4=0,0,'Übersicht Gruppen'!Q4)","v":{"v":929.5600000000001,"d":"929.56"}},{"v":4647.8,"d":"4,647.8"},{"$f":"'Übersicht Gruppen'!S4","v":{"v":928.9818181818183,"d":"928.98"}},{"v":10218.8,"d":"10,218.8"},{"$f":"(U7-U8)*-1","v":{"v":-30.400000000001455,"d":"-30.4"}}]
[4,{"$f":"'Übersicht Gruppen'!B5","v":"Neubörger II"},null,{"$f":"'Übersicht Gruppen'!C5","v":928.7},{"$f":"'Übersicht Gruppen'!D5","v":918.8},{"$f":"'Übersicht Gruppen'!E5","v":{"v":927.8999999999999,"d":"927.9"}},{"$f":"'Übersicht Gruppen'!F5","v":{"v":928,"d":"928.0"}},{"$f":"'Übersicht Gruppen'!G5","v":935.3},{"$f":"'Übersicht Gruppen'!H5","v":918.9},{"$f":"'Übersicht Gruppen'!I5","v":{"v":926.2666666666665,"d":"926.27"}},{"v":5557.599999999999,"d":"5,557.6"},{"$f":"'Übersicht Gruppen'!K5","v":921.3},{"$f":"'Übersicht Gruppen'!L5","v":{"v":921.3000000000001,"d":"921.3"}},{"$f":"'Übersicht Gruppen'!M5","v":924.4},{"$f":"'Übersicht Gruppen'!N5","v":920.5},{"$f":"'Übersicht Gruppen'!O5","v":927.6},{"$f":"'Übersicht Gruppen'!P5","v":{"v":0,"d":"0.0"}},{"$f":"IF(Formelhilfe!O5=0,0,'Übersicht Gruppen'!Q5)","v":{"v":923.0200000000001,"d":"923.02"}},{"v":4615.1,"d":"4,615.1"},{"$f":"'Übersicht Gruppen'!S5","v":{"v":924.7909090909092,"d":"924.79"}},{"v":10172.7,"d":"10,172.7"},{"v":-46.099999999998545,"d":"-46.1"}]
[5,{"$f":"'Übersicht Gruppen'!B6","v":"Esterwegen II"},null,{"$f":"'Übersicht Gruppen'!C6","v":916.1},{"$f":"'Übersicht Gruppen'!D6","v":{"v":919,"d":"919.0"}},{"$f":"'Übersicht Gruppen'!E6","v":931.5},{"$f":"'Übersicht Gruppen'!F6","v":{"v":921.6999999999999,"d":"921.7"}},{"$f":"'Übersicht Gruppen'!G6","v":925.4},{"$f":"'Übersicht Gruppen'!H6","v":925.8},{"$f":"'Übersicht Gruppen'!I6","v":923.25},{"v":5539.5,"d":"5,539.5"},{"$f":"'Übersicht Gruppen'!K6","v":926.1},{"$f":"'Übersicht Gruppen'!L6","v":926.9},{"$f":"'Übersicht Gruppen'!M6","v":926.7},{"$f":"'Übersicht Gruppen'!N6","v":920.3},{"$f":"'Übersicht Gruppen'!O6","v":{"v":923.6000000000001,"d":"923.6"}},{"$f":"'Übersicht Gruppen'!P6","v":{"v":0,"d":"0.0"}},{"$f":"IF(Formelhilfe!O6=0,0,'Übersicht Gruppen'!Q6)","v":924.72},{"v":4623.6,"d":"4,623.6"},{"$f":"'Übersicht Gruppen'!S6","v":{"v":923.9181818181819,"d":"923.92"}},{"v":10163.1,"d":"10,163.1"},{"v":-9.600000000000364,"d":"-9.6"}]
[6,{"$f":"'Übersicht Gruppen'!B7","v":"Lahn V"},null,{"$f":"'Übersicht Gruppen'!C7","v":{"v":911.3000000000001,"d":"911.3"}},{"$f":"'Übersicht Gruppen'!D7","v":{"v":910.4000000000001,"d":"910.4"}},{"$f":"'Übersicht Gruppen'!E7","v":903.7},{"$f":"'Übersicht Gruppen'!F7","v":915.3},{"$f":"'Übersicht Gruppen'!G7","v":925.3},{"$f":"'Übersicht Gruppen'!H7","v":910.4},{"$f":"'Übersicht Gruppen'!I7","v":{"v":912.7333333333335,"d":"912.73"}},{"v":5476.400000000001,"d":"5,476.4"},{"$f":"'Übersicht Gruppen'!K7","v":{"v":915.6999999999999,"d":"915.7"}},{"$f":"'Übersicht Gruppen'!L7","v":{"v":915.1999999999999,"d":"915.2"}},{"$f":"'Übersicht Gruppen'!M7","v":{"v":920.4000000000001,"d":"920.4"}},{"$f":"'Übersicht Gruppen'!N7","v":911.9},{"$f":"'Übersicht Gruppen'!O7","v":608.1},{"$f":"'Übersicht Gruppen'!P7","v":{"v":0,"d":"0.0"}},{"$f":"IF(Formelhilfe!O7=0,0,'Übersicht Gruppen'!Q7)","v":854.26},{"v":4271.3,"d":"4,271.3"},{"$f":"'Übersicht Gruppen'!S7","v":{"v":886.1545454545455,"d":"886.15"}},{"v":9747.7,"d":"9,747.7"},{"v":-415.39999999999964,"d":"-415.4"}]
[]
[null,null,"Schnitt:",{"$f":"AVERAGE(D6:D11)","v":{"v":924.2666666666668,"d":"924.3"}},{"$f":"AVERAGE(E6:E11)","v":{"v":924.5499999999998,"d":"924.6"}},{"v":925.3833333333332,"d":"925.4"},{"v":927.9666666666667,"d":"928.0"},{"v":931.8499999999999,"d":"931.9"},{"v":925.3666666666667,"d":"925.4"},{"v":926.5638888888889,"d":"926.56"},{"$f":"SUM(K6:K11)/6","v":{"v":5559.383333333332,"d":"5,559.4"}},{"v":925.25,"d":"925.3"},{"v":925.3833333333333,"d":"925.4"},{"v":928.9833333333332,"d":"929.0"},{"v":925.5666666666666,"d":"925.6"},{"v":878.4500000000002,"d":"878.5"},{"v":0,"d":"0.0"},{"v":916.7266666666668,"d":"916.73"},{"v":4583.633333333333,"d":"4583.6"},{"v":922.0924242424243,"d":"922.09"},{"v":10143.016666666668,"d":"10,143.0"}]
[]
[{"$nulls":9},"Hinrunde",{"$nulls":7},"Rückrunde",null,"Serie komplett",null,"Differenz"]
["Pos.","Vorname Name","Verein / Gruppe",{"$nulls":6},"Schnitt","Gesamt",{"$nulls":6},"Schnitt","Gesamt","Schnitt","Gesamt"]
[1,{"$f":"'Übersicht Schützen'!A2","v":"Günther Baalmann"},{"$f":"'Übersicht Schützen'!B2","v":"Eisten II "},{"$f":"'Übersicht Schützen'!C2","v":315.3},{"$f":"'Übersicht Schützen'!D2","v":312.1},{"$f":"'Übersicht Schützen'!E2","v":316.7},{"$f":"'Übersicht Schützen'!F2","v":313.7},{"$f":"'Übersicht Schützen'!G2","v":312.8},{"$f":"'Übersicht Schützen'!H2","v":311.4},{"$f":"'Übersicht Schützen'!I2","v":{"v":313.6666666666667,"d":"313.67"}},{"$f":"SUM(D17:I17)","v":{"v":1882,"d":"1,882.0"}},{"$f":"'Übersicht Schützen'!L2","v":315.4},{"$f":"'Übersicht Schützen'!M2","v":313.8},{"$f":"'Übersicht Schützen'!N2","v":314.5},{"$f":"'Übersicht Schützen'!O2","v":311.3},{"$f":"'Übersicht Schützen'!P2","v":315.7},{"$f":"'Übersicht Schützen'!Q2","v":{"v":0,"d":"0.0"}},{"$f":"IF(Formelhilfe!O9=0,0,'Übersicht Schützen'!R2)","v":314.14},{"$f":"SUM(L17:Q17)","v":{"v":1570.7,"d":"1,570.7"}},{"$f":"'Übersicht Schützen'!U2","v":{"v":313.88181818181823,"d":"313.88"}},{"$f":"SUM(K17+S17)","v":{"v":3452.7,"d":"3,452.7"}}]
[2,{"$f":"'Übersicht Schützen'!A3","v":"Achim Will"},{"$f":"'Übersicht Schützen'!B3","v":"Spahnharrenstätte III"},{"$f":"'Übersicht Schützen'!C3","v":307.9},{"$f":"'Übersicht Schützen'!D3","v":313.7},{"$f":"'Übersicht Schützen'!E3","v":310.4},{"$f":"'Übersicht Schützen'!F3","v":313.7},{"$f":"'Übersicht Schützen'!G3","v":315.1},{"$f":"'Übersicht Schützen'!H3","v":308.4},{"$f":"'Übersicht Schützen'!I3","v":{"v":311.5333333333333,"d":"311.53"}},{"$f":"SUM(D18:I18)","v":{"v":1869.1999999999998,"d":"1,869.2"}},{"$f":"'Übersicht Schützen'!L3","v":314.4},{"$f":"'Übersicht Schützen'!M3","v":308.4},{"$f":"'Übersicht Schützen'!N3","v":312.7},{"$f":"'Übersicht Schützen'!O3","v":315.3},{"$f":"'Übersicht Schützen'!P3","v":316.3},{"$f":"'Übersicht Schützen'!Q3","v":{"v":0,"d":"0.0"}},{"$f":"IF(Formelhilfe!O10=0,0,'Übersicht Schützen'!R3)","v":{"v":313.41999999999996,"d":"313.42"}},{"$f":"SUM(L18:Q18)","v":{"v":1567.1,"d":"1,567.1"}},{"$f":"'Übersicht Schützen'!U3","v":{"v":312.39090909090913,"d":"312.39"}},{"$f":"SUM(K18+S18)","v":{"v":3436.2999999999997,"d":"3,436.3"}},{"$f":"(U17-U18)*-1","v":{"v":-16.40000000000009,"d":"-16.4"}}]
[3,{"$f":"'Übersicht Schützen'!A4","v":"Martin Hackmann"},{"$f":"'Übersicht Schützen'!B4","v":"Eisten II "},{"$f":"'Übersicht Schützen'!C4","v":313.5},{"$f":"'Übersicht Schützen'!D4","v":307.5},{"$f":"'Übersicht Schützen'!E4","v":311.4},{"$f":"'Übersicht Schützen'!F4","v":313.3},{"$f":"'Übersicht Schützen'!G4","v":{"v":313,"d":"313.0"}},{"$f":"'Übersicht Schützen'!H4","v":311.1},{"$f":"'Übersicht Schützen'!I4","v":{"v":311.6333333333334,"d":"311.63"}},{"$f":"SUM(D19:I19)","v":{"v":1869.8000000000002,"d":"1,869.8"}},{"$f":"'Übersicht Schützen'!L4","v":307.4},{"$f":"'Übersicht Schützen'!M4","v":308.9},{"$f":"'Übersicht Schützen'!N4","v":{"v":311,"d":"311.0"}},{"$f":"'Übersicht Schützen'!O4","v":310.6},{"$f":"'Übersicht Schützen'!P4","v":315.5},{"$f":"'Übersicht Schützen'!Q4","v":{"v":0,"d":"0.0"}},{"$f":"IF(Formelhilfe!O11=0,0,'Übersicht Schützen'!R4)","v":310.68},{"v":1553.4,"d":"1,553.4"},{"$f":"'Übersicht Schützen'!U4","v":{"v":311.20000000000005,"d":"311.20"}},{"v":3423.2000000000003,"d":"3,423.2"},{"$f":"(U18-U19)*-1","v":{"v":-13.099999999999454,"d":"-13.1"}}]
[4,{"$f":"'Übersicht Schützen'!A5","v":"Martin Poker"},{"$f":"'Übersicht Schützen'!B5","v":"Eisten II "},{"$f":"'Übersicht Schützen'!C5","v":307.3},{"$f":"'Übersicht Schützen'!D5","v":313.4},{"$f":"'Übersicht Schützen'!E5","v":{"v":311,"d":"311.0"}},{"$f":"'Übersicht Schützen'!F5","v":310.5},{"$f":"'Übersicht Schützen'!G5","v":310.9},{"$f":"'Übersicht Schützen'!H5","v":311.8},{"$f":"'Übersicht Schützen'!I5","v":{"v":310.81666666666666,"d":"310.82"}},{"v":1864.8999999999999,"d":"1,864.9"},{"$f":"'Übersicht Schützen'!L5","v":312.6},{"$f":"'Übersicht Schützen'!M5","v":305.4},{"$f":"'Übersicht Schützen'!N5","v":311.8},{"$f":"'Übersicht Schützen'!O5","v":314.2},{"$f":"'Übersicht Schützen'!P5","v":313.3},{"$f":"'Übersicht Schützen'!Q5","v":{"v":0,"d":"0.0"}},{"$f":"IF(Formelhilfe!O12=0,0,'Übersicht Schützen'!R5)","v":311.46},{"v":1557.3,"d":"1,557.3"},{"$f":"'Übersicht Schützen'!U5","v":{"v":311.1090909090909,"d":"311.11"}},{"v":3422.2,"d":"3,422.2"},{"v":-1.0000000000004547,"d":"-1.0"}]
[5,{"$f":"'Übersicht Schützen'!A6","v":"Dieter Hanekamp"},{"$f":"'Übersicht Schützen'!B6","v":"Spahnharrenstätte II"},{"$f":"'Übersicht Schützen'!C6","v":311.2},{"$f":"'Übersicht Schützen'!D6","v":308.7},{"$f":"'Übersicht Schützen'!E6","v":309.8},{"$f":"'Übersicht Schützen'!F6","v":310.7},{"$f":"'Übersicht Schützen'!G6","v":{"v":312,"d":"312.0"}},{"$f":"'Übersicht Schützen'!H6","v":313.7},{"$f":"'Übersicht Schützen'!I6","v":{"v":311.0166666666667,"d":"311.02"}},{"v":1866.1000000000001,"d":"1,866.1"},{"$f":"'Übersicht Schützen'!L6","v":312.5},{"$f":"'Übersicht Schützen'!M6","v":311.5},{"$f":"'Übersicht Schützen'!N6","v":310.7},{"$f":"'Übersicht Schützen'!O6","v":309.5},{"$f":"'Übersicht Schützen'!P6","v":311.3},{"$f":"'Übersicht Schützen'!Q6","v":{"v":0,"d":"0.0"}},{"$f":"IF(Formelhilfe!O13=0,0,'Übersicht Schützen'!R6)","v":{"v":311.1,"d":"311.10"}},{"v":1555.5,"d":"1,555.5"},{"$f":"'Übersicht Schützen'!U6","v":{"v":311.05454545454546,"d":"311.05"}},{"v":3421.6000000000004,"d":"3,421.6"},{"v":-0.5999999999994543,"d":"-0.6"}]
[6,{"$f":"'Übersicht Schützen'!A7","v":"Alois Schmitz"},{"$f":"'Übersicht Schützen'!B7","v":"Neubörger II"},{"$f":"'Übersicht Schützen'!C7","v":{"v":311,"d":"311.0"}},{"$f":"'Übersicht Schützen'!D7","v":{"v":310,"d":"310.0"}},{"$f":"'Übersicht Schützen'!E7","v":308.7},{"$f":"'Übersicht Schützen'!F7","v":311.8},{"$f":"'Übersicht Schützen'!G7","v":313.2},{"$f":"'Übersicht Schützen'!H7","v":305.6},{"$f":"'Übersicht Schützen'!I7","v":310.05},{"v":1860.3000000000002,"d":"1,860.3"},{"$f":"'Übersicht Schützen'!L7","v":307.5},{"$f":"'Übersicht Schützen'!M7","v":304.9},{"$f":"'Übersicht Schützen'!N7","v":310.5},{"$f":"'Übersicht Schützen'!O7","v":306.4},{"$f":"'Übersicht Schützen'!P7","v":311.8},{"$f":"'Übersicht Schützen'!Q7","v":{"v":0,"d":"0.0"}},{"$f":"IF(Formelhilfe!O14=0,0,'Übersicht Schützen'!R7)","v":{"v":308.21999999999997,"d":"308.22"}},{"v":1541.1,"d":"1,541.1"},{"$f":"'Übersicht Schützen'!U7","v":{"v":309.21818181818185,"d":"309.22"}},{"v":3401.4,"d":"3,401.4"},{"v":-20.200000000000273,"d":"-20.2"}]
[7,{"$f":"'Übersicht Schützen'!A8","v":"Heiner Kröger"},{"$f":"'Übersicht Schützen'!B8","v":"Spahnharrenstätte II"},{"$f":"'Übersicht Schützen'!C8","v":307.9},{"$f":"'Übersicht Schützen'!D8","v":308.1},{"$f":"'Übersicht Schützen'!E8","v":306.9},{"$f":"'Übersicht Schützen'!F8","v":310.2},{"$f":"'Übersicht Schützen'!G8","v":306.9},{"$f":"'Übersicht Schützen'!H8","v":309.3},{"$f":"'Übersicht Schützen'!I8","v":{"v":308.21666666666664,"d":"308.22"}},{"v":1849.3,"d":"1,849.3"},{"$f":"'Übersicht Schützen'!L8","v":311.6},{"$f":"'Übersicht Schützen'!M8","v":307.5},{"$f":"'Übersicht Schützen'!N8","v":308.9},{"$f":"'Übersicht Schützen'!O8","v":311.7},{"$f":"'Übersicht Schützen'!P8","v":311.7},{"$f":"'Übersicht Schützen'!Q8","v":{"v":0,"d":"0.0"}},{"$f":"IF(Formelhilfe!O15=0,0,'Übersicht Schützen'!R8)","v":{"v":310.28000000000003,"d":"310.28"}},{"v":1551.4,"d":"1,551.4"},{"$f":"'Übersicht Schützen'!U8","v":{"v":309.1545454545454,"d":"309.15"}},{"v":3400.7,"d":"3,400.7"},{"v":-0.7000000000002728,"d":"-0.7"}]
[8,{"$f":"'Übersicht Schützen'!A9","v":"Meik Sieger"},{"$f":"'Übersicht Schützen'!B9","v":"Esterwegen II"},{"$f":"'Übersicht Schützen'!C9","v":307.8},{"$f":"'Übersicht Schützen'!D9","v":305.8},{"$f":"'Übersicht Schützen'!E9","v":309.2},{"$f":"'Übersicht Schützen'!F9","v":312.3},{"$f":"'Übersicht Schützen'!G9","v":{"v":311,"d":"311.0"}},{"$f":"'Übersicht Schützen'!H9","v":306.5},{"$f":"'Übersicht Schützen'!I9","v":{"v":308.76666666666665,"d":"308.77"}},{"v":1852.6,"d":"1,852.6"},{"$f":"'Übersicht Schützen'!L9","v":311.1},{"$f":"'Übersicht Schützen'!M9","v":306.6},{"$f":"'Übersicht Schützen'!N9","v":311.7},{"$f":"'Übersicht Schützen'!O9","v":306.8},{"$f":"'Übersicht Schützen'!P9","v":310.1},{"$f":"'Übersicht Schützen'!Q9","v":{"v":0,"d":"0.0"}},{"$f":"IF(Formelhilfe!O16=0,0,'Übersicht Schützen'!R9)","v":{"v":309.26000000000005,"d":"309.26"}},{"v":1546.3000000000002,"d":"1,546.3"},{"$f":"'Übersicht Schützen'!U9","v":{"v":308.99090909090904,"d":"308.99"}},{"v":3398.9,"d":"3,398.9"},{"v":-1.7999999999997272,"d":"-1.8"}]
[9,{"$f":"'Übersicht Schützen'!A10","v":"Ludger Hermes"},{"$f":"'Übersicht Schützen'!B10","v":"Neubörger II"},{"$f":"'Übersicht Schützen'!C10","v":311.9},{"$f":"'Übersicht Schützen'!D10","v":309.3},{"$f":"'Übersicht Schützen'!E10","v":312.9},{"$f":"'Übersicht Schützen'!F10","v":308.2},{"$f":"'Übersicht Schützen'!G10","v":309.9},{"$f":"'Übersicht Schützen'!H10","v":301.6},{"$f":"'Übersicht Schützen'!I10","v":{"v":308.96666666666664,"d":"308.97"}},{"v":1853.7999999999997,"d":"1,853.8"},{"$f":"'Übersicht Schützen'!L10","v":309.1},{"$f":"'Übersicht Schützen'!M10","v":310.6},{"$f":"'Übersicht Schützen'!N10","v":304.5},{"$f":"'Übersicht Schützen'!O10","v":305.8},{"$f":"'Übersicht Schützen'!P10","v":310.9},{"$f":"'Übersicht Schützen'!Q10","v":{"v":0,"d":"0.0"}},{"$f":"IF(Formelhilfe!O17=0,0,'Übersicht Schützen'!R10)","v":308.18},{"v":1540.9,"d":"1,540.9"},{"$f":"'Übersicht Schützen'!U10","v":{"v":308.60909090909087,"d":"308.61"}},{"v":3394.7,"d":"3,394.7"},{"v":-4.200000000000273,"d":"-4.2"}]
[10,{"$f":"'Übersicht Schützen'!A11","v":"Johannes Hülsmann"},{"$f":"'Übersicht Schützen'!B11","v":"Spahnharrenstätte II"},{"$f":"'Übersicht Schützen'!C11","v":305.6},{"$f":"'Übersicht Schützen'!D11","v":312.4},{"$f":"'Übersicht Schützen'!E11","v":303.4},{"$f":"'Übersicht Schützen'!F11","v":308.8},{"$f":"'Übersicht Schützen'!G11","v":{"v":312,"d":"312.0"}},{"$f":"'Übersicht Schützen'!H11","v":311.5},{"$f":"'Übersicht Schützen'!I11","v":308.95},{"v":1853.7,"d":"1,853.7"},{"$f":"'Übersicht Schützen'!L11","v":307.8},{"$f":"'Übersicht Schützen'!M11","v":309.5},{"$f":"'Übersicht Schützen'!N11","v":310.1},{"$f":"'Übersicht Schützen'!O11","v":308.5},{"$f":"'Übersicht Schützen'!P11","v":{"v":305,"d":"305.0"}},{"$f":"'Übersicht Schützen'!Q11","v":{"v":0,"d":"0.0"}},{"$f":"IF(Formelhilfe!O18=0,0,'Übersicht Schützen'!R11)","v":308.18},{"v":1540.9,"d":"1,540.9"},{"$f":"'Übersicht Schützen'!U11","v":{"v":308.59999999999997,"d":"308.60"}},{"v":3394.6000000000004,"d":"3,394.6"},{"v":-0.0999999999994543,"d":"-0.1"}]
[11,{"$f":"'Übersicht Schützen'!A12","v":"Dennis Lindemann"},{"$f":"'Übersicht Schützen'!B12","v":"Esterwegen II"},{"$f":"'Übersicht Schützen'!C12","v":302.4},{"$f":"'Übersicht Schützen'!D12","v":306.6},{"$f":"'Übersicht Schützen'!E12","v":310.3},{"$f":"'Übersicht Schützen'!F12","v":306.5},{"$f":"'Übersicht Schützen'!G12","v":311.5},{"$f":"'Übersicht Schützen'!H12","v":308.9},{"$f":"'Übersicht Schützen'!I12","v":{"v":307.7,"d":"307.70"}},{"v":1846.1999999999998,"d":"1,846.2"},{"$f":"'Übersicht Schützen'!L12","v":310.4},{"$f":"'Übersicht Schützen'!M12","v":312.5},{"$f":"'Übersicht Schützen'!N12","v":308.2},{"$f":"'Übersicht Schützen'!O12","v":{"v":307,"d":"307.0"}},{"$f":"'Übersicht Schützen'!P12","v":306.7},{"$f":"'Übersicht Schützen'!Q12","v":{"v":0,"d":"0.0"}},{"$f":"IF(Formelhilfe!O19=0,0,'Übersicht Schützen'!R12)","v":308.96},{"v":1544.8,"d":"1,544.8"},{"$f":"'Übersicht Schützen'!U12","v":{"v":308.27272727272725,"d":"308.27"}},{"v":3391,"d":"3,391.0"},{"v":-3.600000000000364,"d":"-3.6"}]
[12,{"$f":"'Übersicht Schützen'!A13","v":"Christian Grönheim"},{"$f":"'Übersicht Schützen'!B13","v":"Spahnharrenstätte III"},{"$f":"'Übersicht Schützen'!C13","v":310.8},{"$f":"'Übersicht Schützen'!D13","v":309.9},{"$f":"'Übersicht Schützen'!E13","v":307.7},{"$f":"'Übersicht Schützen'!F13","v":{"v":310,"d":"310.0"}},{"$f":"'Übersicht Schützen'!G13","v":309.6},{"$f":"'Übersicht Schützen'!H13","v":302.6},{"$f":"'Übersicht Schützen'!I13","v":{"v":308.43333333333334,"d":"308.43"}},{"v":1850.6,"d":"1,850.6"},{"$f":"'Übersicht Schützen'!L13","v":303.1},{"$f":"'Übersicht Schützen'!M13","v":{"v":308,"d":"308.0"}},{"$f":"'Übersicht Schützen'!N13","v":{"v":310,"d":"310.0"}},{"$f":"'Übersicht Schützen'!O13","v":303.1},{"$f":"'Übersicht Schützen'!P13","v":311.2},{"$f":"'Übersicht Schützen'!Q13","v":{"v":0,"d":"0.0"}},{"$f":"IF(Formelhilfe!O20=0,0,'Übersicht Schützen'!R13)","v":{"v":307.08000000000004,"d":"307.08"}},{"v":1535.4,"d":"1,535.4"},{"$f":"'Übersicht Schützen'!U13","v":{"v":307.81818181818176,"d":"307.82"}},{"v":3386,"d":"3,386.0"},{"v":-5,"d":"-5.0"}]
[13,{"$f":"'Übersicht Schützen'!A14","v":"Franz Ostermann"},{"$f":"'Übersicht Schützen'!B14","v":"Eisten II "},{"$f":"'Übersicht Schützen'!C14","v":308.3},{"$f":"'Übersicht Schützen'!D14","v":309.6},{"$f":"'Übersicht Schützen'!E14","v":306.8},{"$f":"'Übersicht Schützen'!F14","v":300.2},{"$f":"'Übersicht Schützen'!G14","v":310.3},{"$f":"'Übersicht Schützen'!H14","v":312.2},{"$f":"'Übersicht Schützen'!I14","v":{"v":307.90000000000003,"d":"307.90"}},{"v":1847.4,"d":"1,847.4"},{"$f":"'Übersicht Schützen'!L14","v":307.4},{"$f":"'Übersicht Schützen'!M14","v":309.7},{"$f":"'Übersicht Schützen'!N14","v":308.2},{"$f":"'Übersicht Schützen'!O14","v":297.8},{"$f":"'Übersicht Schützen'!P14","v":306.5},{"$f":"'Übersicht Schützen'!Q14","v":{"v":0,"d":"0.0"}},306.05,{"v":1529.6,"d":"1,529.6"},{"$f":"'Übersicht Schützen'!U14","v":{"v":307,"d":"307.00"}},{"v":3377,"d":"3,377.0"},{"v":-9,"d":"-9.0"}]
[14,{"$f":"'Übersicht Schützen'!A15","v":"Ludwig Langen"},{"$f":"'Übersicht Schützen'!B15","v":"Neubörger II"},{"$f":"'Übersicht Schützen'!C15","v":305.8},{"$f":"'Übersicht Schützen'!D15","v":299.5},{"$f":"'Übersicht Schützen'!E15","v":305.8},{"$f":"'Übersicht Schützen'!F15","v":{"v":308,"d":"308.0"}},{"$f":"'Übersicht Schützen'!G15","v":312.2},{"$f":"'Übersicht Schützen'!H15","v":307.9},{"$f":"'Übersicht Schützen'!I15","v":{"v":306.5333333333333,"d":"306.53"}},{"v":1839.1999999999998,"d":"1,839.2"},{"$f":"'Übersicht Schützen'!L15","v":304.4},{"$f":"'Übersicht Schützen'!M15","v":305.8},{"$f":"'Übersicht Schützen'!N15","v":309.4},{"$f":"'Übersicht Schützen'!O15","v":308.3},{"$f":"'Übersicht Schützen'!P15","v":304.9},{"$f":"'Übersicht Schützen'!Q15","v":{"v":0,"d":"0.0"}},{"$f":"IF(Formelhilfe!O22=0,0,'Übersicht Schützen'!R15)","v":{"v":306.56000000000006,"d":"306.56"}},{"v":1532.8000000000002,"d":"1,532.8"},{"$f":"'Übersicht Schützen'!U15","v":{"v":306.54545454545456,"d":"306.55"}},{"v":3372,"d":"3,372.0"},{"v":-5,"d":"-5.0"}]
[15,{"$f":"'Übersicht Schützen'!A16","v":"Sebastian Albers"},{"$f":"'Übersicht Schützen'!B16","v":"Spahnharrenstätte III"},{"$f":"'Übersicht Schützen'!C16","v":304.5},{"$f":"'Übersicht Schützen'!D16","v":303.8},{"$f":"'Übersicht Schützen'!E16","v":307.5},{"$f":"'Übersicht Schützen'!F16","v":304.7},{"$f":"'Übersicht Schützen'!G16","v":305.7},{"$f":"'Übersicht Schützen'!H16","v":307.4},{"$f":"'Übersicht Schützen'!I16","v":{"v":305.59999999999997,"d":"305.60"}},{"v":1833.6,"d":"1,833.6"},{"$f":"'Übersicht Schützen'!L16","v":308.6},{"$f":"'Übersicht Schützen'!M16","v":307.2},{"$f":"'Übersicht Schützen'!N16","v":306.3},{"$f":"'Übersicht Schützen'!O16","v":304.8},{"$f":"'Übersicht Schützen'!P16","v":311.3},{"$f":"'Übersicht Schützen'!Q16","v":{"v":0,"d":"0.0"}},{"$f":"IF(Formelhilfe!O23=0,0,'Übersicht Schützen'!R16)","v":307.64},{"v":1538.1999999999998,"d":"1,538.2"},{"$f":"'Übersicht Schützen'!U16","v":{"v":306.52727272727276,"d":"306.53"}},{"v":3371.7999999999997,"d":"3,371.8"},{"v":-0.20000000000027285,"d":"-0.2"}]
[16,{"$f":"'Übersicht Schützen'!A17","v":"Heiko Micksch"},{"$f":"'Übersicht Schützen'!B17","v":"Spahnharrenstätte III"},{"$f":"'Übersicht Schützen'!C17","v":302.8},{"$f":"'Übersicht Schützen'!D17","v":302.5},{"$f":"'Übersicht Schützen'!E17","v":309.4},{"$f":"'Übersicht Schützen'!F17","v":303.6},{"$f":"'Übersicht Schützen'!G17","v":304.3},{"$f":"'Übersicht Schützen'!H17","v":306.5},{"$f":"'Übersicht Schützen'!I17","v":{"v":304.84999999999997,"d":"304.85"}},{"v":1829.1,"d":"1,829.1"},{"$f":"'Übersicht Schützen'!L17","v":303.6},{"$f":"'Übersicht Schützen'!M17","v":305.7},{"$f":"'Übersicht Schützen'!N17","v":306.3},{"$f":"'Übersicht Schützen'!O17","v":306.9},{"$f":"'Übersicht Schützen'!P17","v":309.6},{"$f":"'Übersicht Schützen'!Q17","v":{"v":0,"d":"0.0"}},{"$f":"IF(Formelhilfe!O24=0,0,'Übersicht Schützen'!R17)","v":{"v":306.41999999999996,"d":"306.42"}},{"v":1532.1,"d":"1,532.1"},{"$f":"'Übersicht Schützen'!U17","v":{"v":305.56363636363636,"d":"305.56"}},{"v":3361.2,"d":"3,361.2"},{"v":-10.599999999999909,"d":"-10.6"}]
[17,{"$f":"'Übersicht Schützen'!A18","v":"Bernd Nortmann"},{"$f":"'Übersicht Schützen'!B18","v":"Lahn V"},{"$f":"'Übersicht Schützen'!C18","v":307.8},{"$f":"'Übersicht Schützen'!D18","v":302.2},{"$f":"'Übersicht Schützen'!E18","v":301.5},{"$f":"'Übersicht Schützen'!F18","v":308.6},{"$f":"'Übersicht Schützen'!G18","v":309.7},{"$f":"'Übersicht Schützen'!H18","v":{"v":306,"d":"306.0"}},{"$f":"'Übersicht Schützen'!I18","v":{"v":305.96666666666664,"d":"305.97"}},{"v":1835.8,"d":"1,835.8"},{"$f":"'Übersicht Schützen'!L18","v":304.1},{"$f":"'Übersicht Schützen'!M18","v":308.9},{"$f":"'Übersicht Schützen'!N18","v":302.7},{"$f":"'Übersicht Schützen'!O18","v":304.5},{"$f":"'Übersicht Schützen'!P18","v":303.8},{"$f":"'Übersicht Schützen'!Q18","v":{"v":0,"d":"0.0"}},{"$f":"IF(Formelhilfe!O25=0,0,'Übersicht Schützen'!R18)","v":{"v":304.8,"d":"304.80"}},{"v":1524,"d":"1,524.0"},{"$f":"'Übersicht Schützen'!U18","v":{"v":305.43636363636364,"d":"305.44"}},{"v":3359.8,"d":"3,359.8"},{"v":-1.3999999999996362,"d":"-1.4"}]
[18,{"$f":"'Übersicht Schützen'!A19","v":"Josef Langen"},{"$f":"'Übersicht Schützen'!B19","v":"Spahnharrenstätte II"},{"$f":"'Übersicht Schützen'!C19","v":{"v":306,"d":"306.0"}},{"$f":"'Übersicht Schützen'!D19","v":304.9},{"$f":"'Übersicht Schützen'!E19","v":304.9},{"$f":"'Übersicht Schützen'!F19","v":300.3},{"$f":"'Übersicht Schützen'!G19","v":302.2},{"$f":"'Übersicht Schützen'!H19","v":308.2},{"$f":"'Übersicht Schützen'!I19","v":{"v":304.4166666666667,"d":"304.42"}},{"v":1826.5,"d":"1,826.5"},{"$f":"'Übersicht Schützen'!L19","v":302.9},{"$f":"'Übersicht Schützen'!M19","v":306.7},{"$f":"'Übersicht Schützen'!N19","v":305.8},{"$f":"'Übersicht Schützen'!O19","v":307.9},{"$f":"'Übersicht Schützen'!P19","v":304.9},{"$f":"'Übersicht Schützen'!Q19","v":{"v":0,"d":"0.0"}},{"$f":"IF(Formelhilfe!O26=0,0,'Übersicht Schützen'!R19)","v":305.64},{"v":1528.1999999999998,"d":"1,528.2"},{"$f":"'Übersicht Schützen'!U19","v":{"v":304.9727272727273,"d":"304.97"}},{"v":3354.7,"d":"3,354.7"},{"v":-5.100000000000364,"d":"-5.1"}]
[19,{"$f":"'Übersicht Schützen'!A20","v":"Andreas Lindemann"},{"$f":"'Übersicht Schützen'!B20","v":"Esterwegen II"},{"$f":"'Übersicht Schützen'!C20","v":301.3},{"$f":"'Übersicht Schützen'!D20","v":{"v":308,"d":"308.0"}},{"$f":"'Übersicht Schützen'!E20","v":{"v":312,"d":"312.0"}},{"$f":"'Übersicht Schützen'!F20","v":301.7},{"$f":"'Übersicht Schützen'!G20","v":282.1},{"$f":"'Übersicht Schützen'!H20","v":304.9},{"$f":"'Übersicht Schützen'!I20","v":{"v":301.6666666666667,"d":"301.67"}},{"v":1810,"d":"1,810.0"},{"$f":"'Übersicht Schützen'!L20","v":{"v":303,"d":"303.0"}},{"$f":"'Übersicht Schützen'!M20","v":307.8},{"$f":"'Übersicht Schützen'!N20","v":305.5},{"$f":"'Übersicht Schützen'!O20","v":302.7},{"$f":"'Übersicht Schützen'!P20","v":305.8},{"$f":"'Übersicht Schützen'!Q20","v":{"v":0,"d":"0.0"}},{"$f":"IF(Formelhilfe!O27=0,0,'Übersicht Schützen'!R20)","v":304.96},{"v":1524.8,"d":"1,524.8"},{"$f":"'Übersicht Schützen'!U20","v":{"v":303.1636363636364,"d":"303.16"}},{"v":3334.8,"d":"3,334.8"},{"v":-19.899999999999636,"d":"-19.9"}]
[20,{"$f":"'Übersicht Schützen'!A21","v":"Rudi Fromme"},{"$f":"'Übersicht Schützen'!B21","v":"Neubörger II"},{"$f":"'Übersicht Schützen'!C21","v":303.4},{"$f":"'Übersicht Schützen'!D21","v":298.5},{"$f":"'Übersicht Schützen'!E21","v":306.3},{"$f":"'Übersicht Schützen'!F21","v":302.3},{"$f":"'Übersicht Schützen'!G21","v":301.4},{"$f":"'Übersicht Schützen'!H21","v":305.4},{"$f":"'Übersicht Schützen'!I21","v":{"v":302.8833333333334,"d":"302.88"}},{"v":1817.3000000000002,"d":"1,817.3"},{"$f":"'Übersicht Schützen'!L21","v":304.7},{"$f":"'Übersicht Schützen'!M21","v":303.2},{"$f":"'Übersicht Schützen'!N21","v":300.8},{"$f":"'Übersicht Schützen'!O21","v":304.2},{"$f":"'Übersicht Schützen'!P21","v":303.8},{"$f":"'Übersicht Schützen'!Q21","v":{"v":0,"d":"0.0"}},{"$f":"IF(Formelhilfe!O28=0,0,'Übersicht Schützen'!R21)","v":{"v":303.34000000000003,"d":"303.34"}},{"v":1516.7,"d":"1,516.7"},{"$f":"'Übersicht Schützen'!U21","v":{"v":303.09090909090907,"d":"303.09"}},{"v":3334,"d":"3,334.0"},{"v":-0.8000000000001819,"d":"-0.8"}]
[21,{"$f":"'Übersicht Schützen'!A22","v":"Oliver Reinelt"},{"$f":"'Übersicht Schützen'!B22","v":"Lahn V"},{"$f":"'Übersicht Schützen'!C22","v":294.1},{"$f":"'Übersicht Schützen'!D22","v":299.7},{"$f":"'Übersicht Schützen'!E22","v":293.1},{"$f":"'Übersicht Schützen'!F22","v":298.5},{"$f":"'Übersicht Schützen'!G22","v":303.3},{"$f":"'Übersicht Schützen'!H22","v":294.5},{"$f":"'Übersicht Schützen'!I22","v":{"v":297.2,"d":"297.20"}},{"v":1783.2,"d":"1,783.2"},{"$f":"'Übersicht Schützen'!L22","v":301.4},{"$f":"'Übersicht Schützen'!M22","v":304.4},{"$f":"'Übersicht Schützen'!N22","v":305.8},{"$f":"'Übersicht Schützen'!O22","v":{"v":299,"d":"299.0"}},{"$f":"'Übersicht Schützen'!P22","v":304.3},{"$f":"'Übersicht Schützen'!Q22","v":{"v":0,"d":"0.0"}},{"$f":"IF(Formelhilfe!O29=0,0,'Übersicht Schützen'!R22)","v":{"v":302.97999999999996,"d":"302.98"}},{"v":1514.8999999999999,"d":"1,514.9"},{"$f":"'Übersicht Schützen'!U22","v":{"v":299.82727272727277,"d":"299.83"}},{"v":3298.1,"d":"3,298.1"},{"v":-35.90000000000009,"d":"-35.9"}]
[22,{"$f":"'Übersicht Schützen'!A23","v":"Dirk Meyer"},{"$f":"'Übersicht Schützen'!B23","v":"Spahnharrenstätte III"},{"$f":"'Übersicht Schützen'!C23","v":308.6},{"$f":"'Übersicht Schützen'!D23","v":311.2},{"$f":"'Übersicht Schützen'!E23","v":310.4},{"$f":"'Übersicht Schützen'!F23","v":311.9},{"$f":"'Übersicht Schützen'!G23","v":312.8},{"$f":"'Übersicht Schützen'!H23","v":312.3},{"$f":"'Übersicht Schützen'!I23","v":{"v":311.2,"d":"311.20"}},{"v":1867.1999999999998,"d":"1,867.2"},{"$f":"'Übersicht Schützen'!L23","v":{"v":0,"d":"0.0"}},{"$f":"'Übersicht Schützen'!M23","v":311.6},{"$f":"'Übersicht Schützen'!N23","v":312.7},{"$f":"'Übersicht Schützen'!O23","v":312.7},{"$f":"'Übersicht Schützen'!P23","v":311.4},{"$f":"'Übersicht Schützen'!Q23","v":{"v":0,"d":"0.0"}},302.65,{"v":1248.4,"d":"1,248.4"},{"$f":"'Übersicht Schützen'!U23","v":{"v":311.55999999999995,"d":"311.56"}},{"v":3115.6,"d":"3,115.6"},-182.5]
[23,{"$f":"'Übersicht Schützen'!A24","v":"Simon Schukenbrock"},{"$f":"'Übersicht Schützen'!B24","v":"Lahn V"},{"$f":"'Übersicht Schützen'!C24","v":309.4},{"$f":"'Übersicht Schützen'!D24","v":308.5},{"$f":"'Übersicht Schützen'!E24","v":309.1},{"$f":"'Übersicht Schützen'!F24","v":308.2},{"$f":"'Übersicht Schützen'!G24","v":312.3},{"$f":"'Übersicht Schützen'!H24","v":309.9},{"$f":"'Übersicht Schützen'!I24","v":{"v":309.56666666666666,"d":"309.57"}},{"v":1857.4,"d":"1,857.4"},{"$f":"'Übersicht Schützen'!L24","v":310.2},{"$f":"'Übersicht Schützen'!M24","v":301.9},{"$f":"'Übersicht Schützen'!N24","v":311.9},{"$f":"'Übersicht Schützen'!O24","v":308.4},{"$f":"'Übersicht Schützen'!P24","v":{"v":0,"d":"0.0"}},{"$f":"'Übersicht Schützen'!Q24","v":{"v":0,"d":"0.0"}},312.33,{"v":1232.3999999999999,"d":"1,232.4"},{"$f":"'Übersicht Schützen'!U24","v":308.98},{"v":3089.8,"d":"3,089.8"},{"v":-25.799999999999727,"d":"-25.8"}]
[24,{"$f":"'Übersicht Schützen'!A25","v":"Stefan Burlager"},{"$f":"'Übersicht Schützen'!B25","v":"Esterwegen II"},{"$f":"'Übersicht Schützen'!C25","v":304.3},{"$f":"'Übersicht Schützen'!D25","v":301.4},{"$f":"'Übersicht Schützen'!E25","v":296.8},{"$f":"'Übersicht Schützen'!F25","v":{"v":0,"d":"0.0"}},{"$f":"'Übersicht Schützen'!G25","v":306.5},{"$f":"'Übersicht Schützen'!H25","v":310.4},{"$f":"'Übersicht Schützen'!I25","v":303.88},{"v":1519.4,"d":"1,519.4"},{"$f":"'Übersicht Schützen'!L25","v":304.6},{"$f":"'Übersicht Schützen'!M25","v":303.5},{"$f":"'Übersicht Schützen'!N25","v":306.8},{"$f":"'Übersicht Schützen'!O25","v":306.5},{"$f":"'Übersicht Schützen'!P25","v":306.8},{"$f":"'Übersicht Schützen'!Q25","v":{"v":0,"d":"0.0"}},{"$f":"IF(Formelhilfe!O32=0,0,'Übersicht Schützen'!R25)","v":305.64},{"v":1528.2,"d":"1,528.2"},{"$f":"'Übersicht Schützen'!U25","v":{"v":304.76000000000005,"d":"304.76"}},{"v":3047.6000000000004,"d":"3,047.6"},{"v":-42.19999999999982,"d":"-42.2"}]
[25,{"$f":"'Übersicht Schützen'!A26","v":"Rainer Wielenberg"},{"$f":"'Übersicht Schützen'!B26","v":"Esterwegen II"},{"$f":"'Übersicht Schützen'!C26","v":305.9},{"$f":"'Übersicht Schützen'!D26","v":306.6},{"$f":"'Übersicht Schützen'!E26","v":306.4},{"$f":"'Übersicht Schützen'!F26","v":302.9},{"$f":"'Übersicht Schützen'!G26","v":302.9},{"$f":"'Übersicht Schützen'!H26","v":299.6},{"$f":"'Übersicht Schützen'!I26","v":{"v":304.04999999999995,"d":"304.05"}},{"v":1824.2999999999997,"d":"1,824.3"},{"$f":"'Übersicht Schützen'!L26","v":{"v":0,"d":"0.0"}},{"$f":"'Übersicht Schützen'!M26","v":298.3},{"$f":"'Übersicht Schützen'!N26","v":303.5},{"$f":"'Übersicht Schützen'!O26","v":299.5},{"$f":"'Übersicht Schützen'!P26","v":{"v":0,"d":"0.0"}},{"$f":"'Übersicht Schützen'!Q26","v":{"v":0,"d":"0.0"}},{"$f":"IF(Formelhilfe!O33=0,0,'Übersicht Schützen'!R26)","v":{"v":300.43333333333334,"d":"300.43"}},901.3,{"$f":"'Übersicht Schützen'!U26","v":{"v":302.84444444444443,"d":"302.84"}},{"v":2725.5999999999995,"d":"2,725.6"},{"v":-322.0000000000009,"d":"-322.0"}]
[26,{"$f":"'Übersicht Schützen'!A27","v":"Johannes Gebken"},{"$f":"'Übersicht Schützen'!B27","v":"Esterwegen II"},{"$f":"'Übersicht Schützen'!C27","v":299.9},{"$f":"'Übersicht Schützen'!D27","v":291.1},{"$f":"'Übersicht Schützen'!E27","v":290.6},{"$f":"'Übersicht Schützen'!F27","v":{"v":0,"d":"0.0"}},{"$f":"'Übersicht Schützen'!G27","v":{"v":0,"d":"0.0"}},{"$f":"'Übersicht Schützen'!H27","v":{"v":0,"d":"0.0"}},{"$f":"'Übersicht Schützen'!I27","v":{"v":293.8666666666667,"d":"293.87"}},881.6,{"$f":"'Übersicht Schützen'!L27","v":{"v":0,"d":"0.0"}},{"$f":"'Übersicht Schützen'!M27","v":{"v":0,"d":"0.0"}},{"$f":"'Übersicht Schützen'!N27","v":{"v":0,"d":"0.0"}},{"$f":"'Übersicht Schützen'!O27","v":{"v":0,"d":"0.0"}},{"$f":"'Übersicht Schützen'!P27","v":{"v":0,"d":"0.0"}},{"$f":"'Übersicht Schützen'!Q27","v":{"v":0,"d":"0.0"}},{"v":0,"d":"0.00"},{"v":0,"d":"0.0"},{"$f":"'Übersicht Schützen'!U27","v":{"v":293.8666666666667,"d":"293.87"}},881.6,{"v":-1843.9999999999995,"d":"-1,844.0"}]
[27,{"$f":"'Übersicht Schützen'!A28","v":"Michael Boje"},{"$f":"'Übersicht Schützen'!B28","v":"Lahn V"},{"$f":"'Übersicht Schützen'!C28","v":{"v":0,"d":"0.0"}},{"$f":"'Übersicht Schützen'!D28","v":298.7},{"$f":"'Übersicht Schützen'!E28","v":{"v":0,"d":"0.0"}},{"$f":"'Übersicht Schützen'!F28","v":{"v":0,"d":"0.0"}},{"$f":"'Übersicht Schützen'!G28","v":{"v":0,"d":"0.0"}},{"$f":"'Übersicht Schützen'!H28","v":{"v":0,"d":"0.0"}},{"$f":"'Übersicht Schützen'!I28","v":{"v":298.7,"d":"298.70"}},298.7,{"$f":"'Übersicht Schützen'!L28","v":{"v":0,"d":"0.0"}},{"$f":"'Übersicht Schützen'!M28","v":{"v":0,"d":"0.0"}},{"$f":"'Übersicht Schützen'!N28","v":{"v":0,"d":"0.0"}},{"$f":"'Übersicht Schützen'!O28","v":{"v":0,"d":"0.0"}},{"$f":"'Übersicht Schützen'!P28","v":{"v":0,"d":"0.0"}},{"$f":"'Übersicht Schützen'!Q28","v":{"v":0,"d":"0.0"}},{"v":0,"d":"0.00"},{"v":0,"d":"0.0"},{"$f":"'Übersicht Schützen'!U28","v":{"v":298.7,"d":"298.70"}},298.7,{"v":-582.9000000000001,"d":"-582.9"}]
[28,{"$f":"'Übersicht Schützen'!A29","v":"Jan-Niklas Lindemann"},{"$f":"'Übersicht Schützen'!B29","v":"Esterwegen II"},{"$f":"'Übersicht Schützen'!C29","v":{"v":0,"d":"0.0"}},{"$f":"'Übersicht Schützen'!D29","v":{"v":0,"d":"0.0"}},{"$f":"'Übersicht Schützen'!E29","v":{"v":0,"d":"0.0"}},{"$f":"'Übersicht Schützen'!F29","v":{"v":0,"d":"0.0"}},{"$f":"'Übersicht Schützen'!G29","v":{"v":0,"d":"0.0"}},{"$f":"'Übersicht Schützen'!H29","v":{"v":0,"d":"0.0"}},{"v":0,"d":"0.00"},{"v":0,"d":"0.0"},{"$f":"'Übersicht Schützen'!L29","v":{"v":0,"d":"0.0"}},{"$f":"'Übersicht Schützen'!M29","v":{"v":0,"d":"0.0"}},{"$f":"'Übersicht Schützen'!N29","v":{"v":0,"d":"0.0"}},{"$f":"'Übersicht Schützen'!O29","v":{"v":0,"d":"0.0"}},{"$f":"'Übersicht Schützen'!P29","v":{"v":0,"d":"0.0"}},{"$f":"'Übersicht Schützen'!Q29","v":{"v":0,"d":"0.0"}},{"v":0,"d":"0.00"},{"v":0,"d":"0.0"},{"v":0,"d":"0.00"},{"v":0,"d":"0.0"},{"v":0,"d":"0.0"}]
[29,{"$f":"'Übersicht Schützen'!A30","v":"Schütze 29"},{"$f":"'Übersicht Schützen'!B30","v":0},{"$f":"'Übersicht Schützen'!C30","v":{"v":0,"d":"0.0"}},{"$f":"'Übersicht Schützen'!D30","v":{"v":0,"d":"0.0"}},{"$f":"'Übersicht Schützen'!E30","v":{"v":0,"d":"0.0"}},{"$f":"'Übersicht Schützen'!F30","v":{"v":0,"d":"0.0"}},{"$f":"'Übersicht Schützen'!G30","v":{"v":0,"d":"0.0"}},{"$f":"'Übersicht Schützen'!H30","v":{"v":0,"d":"0.0"}},{"v":0,"d":"0.00"},{"v":0,"d":"0.0"},{"$f":"'Übersicht Schützen'!L30","v":{"v":0,"d":"0.0"}},{"$f":"'Übersicht Schützen'!M30","v":{"v":0,"d":"0.0"}},{"$f":"'Übersicht Schützen'!N30","v":{"v":0,"d":"0.0"}},{"$f":"'Übersicht Schützen'!O30","v":{"v":0,"d":"0.0"}},{"$f":"'Übersicht Schützen'!P30","v":{"v":0,"d":"0.0"}},{"$f":"'Übersicht Schützen'!Q30","v":{"v":0,"d":"0.0"}},{"$f":"IF(Formelhilfe!O37=0,0,'Übersicht Schützen'!R30)","v":{"v":0,"d":"0.00"}},{"v":0,"d":"0.0"},{"v":0,"d":"0.00"},{"v":0,"d":"0.0"},{"v":0,"d":"0.0"}]
[30,{"$f":"'Übersicht Schützen'!A31","v":"Schütze 30"},{"$f":"'Übersicht Schützen'!B31","v":0},{"$f":"'Übersicht Schützen'!C31","v":{"v":0,"d":"0.0"}},{"$f":"'Übersicht Schützen'!D31","v":{"v":0,"d":"0.0"}},{"$f":"'Übersicht Schützen'!E31","v":{"v":0,"d":"0.0"}},{"$f":"'Übersicht Schützen'!F31","v":{"v":0,"d":"0.0"}},{"$f":"'Übersicht Schützen'!G31","v":{"v":0,"d":"0.0"}},{"$f":"'Übersicht Schützen'!H31","v":{"v":0,"d":"0.0"}},{"v":0,"d":"0.00"},{"v":0,"d":"0.0"},{"$f":"'Übersicht Schützen'!L31","v":{"v":0,"d":"0.0"}},{"$f":"'Übersicht Schützen'!M31","v":{"v":0,"d":"0.0"}},{"$f":"'Übersicht Schützen'!N31","v":{"v":0,"d":"0.0"}},{"$f":"'Übersicht Schützen'!O31","v":{"v":0,"d":"0.0"}},{"$f":"'Übersicht Schützen'!P31","v":{"v":0,"d":"0.0"}},{"$f":"'Übersicht Schützen'!Q31","v":{"v":0,"d":"0.0"}},{"$f":"IF(Formelhilfe!O38=0,0,'Übersicht Schützen'!R31)","v":{"v":0,"d":"0.00"}},{"v":0,"d":"0.0"},{"v":0,"d":"0.00"},{"v":0,"d":"0.0"},{"v":0,"d":"0.0"}]
[31,{"$f":"'Übersicht Schützen'!A32","v":"Schütze 31"},{"$f":"'Übersicht Schützen'!B32","v":0},{"$f":"'Übersicht Schützen'!C32","v":{"v":0,"d":"0.0"}},{"$f":"'Übersicht Schützen'!D32","v":{"v":0,"d":"0.0"}},{"$f":"'Übersicht Schützen'!E32","v":{"v":0,"d":"0.0"}},{"$f":"'Übersicht Schützen'!F32","v":{"v":0,"d":"0.0"}},{"$f":"'Übersicht Schützen'!G32","v":{"v":0,"d":"0.0"}},{"$f":"'Übersicht Schützen'!H32","v":{"v":0,"d":"0.0"}},{"v":0,"d":"0.00"},{"v":0,"d":"0.0"},{"$f":"'Übersicht Schützen'!L32","v":{"v":0,"d":"0.0"}},{"$f":"'Übersicht Schützen'!M32","v":{"v":0,"d":"0.0"}},{"$f":"'Übersicht Schützen'!N32","v":{"v":0,"d":"0.0"}},{"$f":"'Übersicht Schützen'!O32","v":{"v":0,"d":"0.0"}},{"$f":"'Übersicht Schützen'!P32","v":{"v":0,"d":"0.0"}},{"$f":"'Übersicht Schützen'!Q32","v":{"v":0,"d":"0.0"}},{"$f":"IF(Formelhilfe!O39=0,0,'Übersicht Schützen'!R32)","v":{"v":0,"d":"0.00"}},{"v":0,"d":"0.0"},{"v":0,"d":"0.00"},{"v":0,"d":"0.0"},{"$f":"(U46-U47)*-1","v":{"v":0,"d":"0.0"}}]
[32,{"$f":"'Übersicht Schützen'!A33","v":"Schütze 32"},{"$f":"'Übersicht Schützen'!B33","v":0},{"$f":"'Übersicht Schützen'!C33","v":{"v":0,"d":"0.0"}},{"$f":"'Übersicht Schützen'!D33","v":{"v":0,"d":"0.0"}},{"$f":"'Übersicht Schützen'!E33","v":{"v":0,"d":"0.0"}},{"$f":"'Übersicht Schützen'!F33","v":{"v":0,"d":"0.0"}},{"$f":"'Übersicht Schützen'!G33","v":{"v":0,"d":"0.0"}},{"$f":"'Übersicht Schützen'!H33","v":{"v":0,"d":"0.0"}},{"v":0,"d":"0.00"},{"v":0,"d":"0.0"},{"$f":"'Übersicht Schützen'!L33","v":{"v":0,"d":"0.0"}},{"$f":"'Übersicht Schützen'!M33","v":{"v":0,"d":"0.0"}},{"$f":"'Übersicht Schützen'!N33","v":{"v":0,"d":"0.0"}},{"$f":"'Übersicht Schützen'!O33","v":{"v":0,"d":"0.0"}},{"$f":"'Übersicht Schützen'!P33","v":{"v":0,"d":"0.0"}},{"$f":"'Übersicht Schützen'!Q33","v":{"v":0,"d":"0.0"}},{"$f":"IF(Formelhilfe!O40=0,0,'Übersicht Schützen'!R33)","v":{"v":0,"d":"0.00"}},{"v":0,"d":"0.0"},{"v":0,"d":"0.00"},{"v":0,"d":"0.0"},{"v":0,"d":"0.0"}]
[33,{"$f":"'Übersicht Schützen'!A34","v":"Schütze 33"},{"$f":"'Übersicht Schützen'!B34","v":0},{"$f":"'Übersicht Schützen'!C34","v":{"v":0,"d":"0.0"}},{"$f":"'Übersicht Schützen'!D34","v":{"v":0,"d":"0.0"}},{"$f":"'Übersicht Schützen'!E34","v":{"v":0,"d":"0.0"}},{"$f":"'Übersicht Schützen'!F34","v":{"v":0,"d":"0.0"}},{"$f":"'Übersicht Schützen'!G34","v":{"v":0,"d":"0.0"}},{"$f":"'Übersicht Schützen'!H34","v":{"v":0,"d":"0.0"}},{"v":0,"d":"0.00"},{"v":0,"d":"0.0"},{"$f":"'Übersicht Schützen'!L34","v":{"v":0,"d":"0.0"}},{"$f":"'Übersicht Schützen'!M34","v":{"v":0,"d":"0.0"}},{"$f":"'Übersicht Schützen'!N34","v":{"v":0,"d":"0.0"}},{"$f":"'Übersicht Schützen'!O34","v":{"v":0,"d":"0.0"}},{"$f":"'Übersicht Schützen'!P34","v":{"v":0,"d":"0.0"}},{"$f":"'Übersicht Schützen'!Q34","v":{"v":0,"d":"0.0"}},{"$f":"IF(Formelhilfe!O41=0,0,'Übersicht Schützen'!R34)","v":{"v":0,"d":"0.00"}},{"v":0,"d":"0.0"},{"v":0,"d":"0.00"},{"v":0,"d":"0.0"},{"v":0,"d":"0.0"}]
[34,{"$f":"'Übersicht Schützen'!A35","v":"Schütze 34"},{"$f":"'Übersicht Schützen'!B35","v":0},{"$f":"'Übersicht Schützen'!C35","v":{"v":0,"d":"0.0"}},{"$f":"'Übersicht Schützen'!D35","v":{"v":0,"d":"0.0"}},{"$f":"'Übersicht Schützen'!E35","v":{"v":0,"d":"0.0"}},{"$f":"'Übersicht Schützen'!F35","v":{"v":0,"d":"0.0"}},{"$f":"'Übersicht Schützen'!G35","v":{"v":0,"d":"0.0"}},{"$f":"'Übersicht Schützen'!H35","v":{"v":0,"d":"0.0"}},{"v":0,"d":"0.00"},{"v":0,"d":"0.0"},{"$f":"'Übersicht Schützen'!L35","v":{"v":0,"d":"0.0"}},{"$f":"'Übersicht Schützen'!M35","v":{"v":0,"d":"0.0"}},{"$f":"'Übersicht Schützen'!N35","v":{"v":0,"d":"0.0"}},{"$f":"'Übersicht Schützen'!O35","v":{"v":0,"d":"0.0"}},{"$f":"'Übersicht Schützen'!P35","v":{"v":0,"d":"0.0"}},{"$f":"'Übersicht Schützen'!Q35","v":{"v":0,"d":"0.0"}},{"$f":"IF(Formelhilfe!O42=0,0,'Übersicht Schützen'!R35)","v":{"v":0,"d":"0.00"}},{"v":0,"d":"0.0"},{"v":0,"d":"0.00"},{"v":0,"d":"0.0"},{"v":0,"d":"0.0"}]
[35,{"$f":"'Übersicht Schützen'!A36","v":"Schütze 35"},{"$f":"'Übersicht Schützen'!B36","v":0},{"$f":"'Übersicht Schützen'!C36","v":{"v":0,"d":"0.0"}},{"$f":"'Übersicht Schützen'!D36","v":{"v":0,"d":"0.0"}},{"$f":"'Übersicht Schützen'!E36","v":{"v":0,"d":"0.0"}},{"$f":"'Übersicht Schützen'!F36","v":{"v":0,"d":"0.0"}},{"$f":"'Übersicht Schützen'!G36","v":{"v":0,"d":"0.0"}},{"$f":"'Übersicht Schützen'!H36","v":{"v":0,"d":"0.0"}},{"v":0,"d":"0.00"},{"v":0,"d":"0.0"},{"$f":"'Übersicht Schützen'!L36","v":{"v":0,"d":"0.0"}},{"$f":"'Übersicht Schützen'!M36","v":{"v":0,"d":"0.0"}},{"$f":"'Übersicht Schützen'!N36","v":{"v":0,"d":"0.0"}},{"$f":"'Übersicht Schützen'!O36","v":{"v":0,"d":"0.0"}},{"$f":"'Übersicht Schützen'!P36","v":{"v":0,"d":"0.0"}},{"$f":"'Übersicht Schützen'!Q36","v":{"v":0,"d":"0.0"}},{"$f":"IF(Formelhilfe!O43=0,0,'Übersicht Schützen'!R36)","v":{"v":0,"d":"0.00"}},{"v":0,"d":"0.0"},{"v":0,"d":"0.00"},{"v":0,"d":"0.0"},{"$f":"(U50-U51)*-1","v":{"v":0,"d":"0.0"}}]
[36,{"$f":"'Übersicht Schützen'!A37","v":"Schütze 36"},{"$f":"'Übersicht Schützen'!B37","v":0},{"$f":"'Übersicht Schützen'!C37","v":{"v":0,"d":"0.0"}},{"$f":"'Übersicht Schützen'!D37","v":{"v":0,"d":"0.0"}},{"$f":"'Übersicht Schützen'!E37","v":{"v":0,"d":"0.0"}},{"$f":"'Übersicht Schützen'!F37","v":{"v":0,"d":"0.0"}},{"$f":"'Übersicht Schützen'!G37","v":{"v":0,"d":"0.0"}},{"$f":"'Übersicht Schützen'!H37","v":{"v":0,"d":"0.0"}},{"v":0,"d":"0.00"},{"v":0,"d":"0.0"},{"$f":"'Übersicht Schützen'!L37","v":{"v":0,"d":"0.0"}},{"$f":"'Übersicht Schützen'!M37","v":{"v":0,"d":"0.0"}},{"$f":"'Übersicht Schützen'!N37","v":{"v":0,"d":"0.0"}},{"$f":"'Übersicht Schützen'!O37","v":{"v":0,"d":"0.0"}},{"$f":"'Übersicht Schützen'!P37","v":{"v":0,"d":"0.0"}},{"$f":"'Übersicht Schützen'!Q37","v":{"v":0,"d":"0.0"}},{"$f":"IF(Formelhilfe!O44=0,0,'Übersicht Schützen'!R37)","v":{"v":0,"d":"0.00"}},{"v":0,"d":"0.0"},{"v":0,"d":"0.00"},{"v":0,"d":"0.0"},{"v":0,"d":"0.0"}]
[]
[null,null,"Schnitt:",{"$f":"SUM(D17:D52)/Formelhilfe!B45","v":{"v":306.7192307692308,"d":"306.7"}},{"$f":"SUM(E17:E52)/Formelhilfe!C45","v":{"v":306.062962962963,"d":"306.1"}},{"$f":"SUM(F17:F52)/Formelhilfe!D45","v":{"v":306.88461538461536,"d":"306.9"}},{"$f":"SUM(G17:G52)/Formelhilfe!E45","v":{"v":307.525,"d":"307.5"}},{"$f":"SUM(H17:H52)/Formelhilfe!F45","v":{"v":308.144,"d":"308.1"}},{"$f":"SUM(I17:I52)/Formelhilfe!G45","v":{"v":307.50399999999996,"d":"307.5"}},{"$f":"AVERAGE(J17:J52)","v":{"v":229.9452777777778,"d":"229.95"}},{"$f":"AVERAGE(K17:K52)","v":{"v":1305.2555555555555,"d":"1305.26"}},{"$f":"SUM(L17:L52)/Formelhilfe!I45","v":{"v":307.7304347826087,"d":"307.7"}},{"$f":"SUM(M17:M52)/Formelhilfe!J45","v":{"v":307.2919999999999,"d":"307.3"}},{"$f":"SUM(N17:N52)/Formelhilfe!K45","v":{"v":308.412,"d":"308.4"}},{"$f":"SUM(O17:O52)/Formelhilfe!L45","v":{"v":306.9359999999999,"d":"306.9"}},{"$f":"SUM(P17:P52)/Formelhilfe!M45","v":{"v":309.2434782608696,"d":"309.2"}},{"$f":"SUM(Q17:Q52)/Formelhilfe!N45","v":{"$error":"#DIV/0!"}},{"$f":"AVERAGE(R17:R52)","v":{"v":213.62231481481484,"d":"213.62"}},{"$f":"AVERAGE(S17:S52)","v":{"v":1034.9,"d":"1034.90"}},{"$f":"AVERAGE(T17:T52)","v":{"v":230.087177328844,"d":"230.09"}},{"$f":"(K54+S54)","v":{"v":2340.1555555555556,"d":"2,340.16 "}}]

{"sheet":"Wettkampf 1","index":1,"n_rows":47,"n_cols":29,"rows_kept":47,"merged":[[0,24,0,25],[1,24,1,25],[4,24,4,25],[5,24,5,25],[6,24,6,25],[8,22,8,25]]}
[null,"Verein / Gruppe",null,"Ergebnisse",{"$nulls":19},"Austragungsort:",{"$f":"Übersicht!D4","v":"Spahnharrenstätte"}]
[1,"Spahnharrenstätte III",null,{"$f":"G46","v":{"v":927.3000000000001,"d":"927.3"}},{"$f":"IF(H46>4,\"Es sind zu viele Schützen in Wertung!\",\" \")","v":" "},{"$nulls":18},"Wettkampftag:",{"$f":"Übersicht!D3","v":"15.09"}]
[2,"Esterwegen II",null,{"$f":"I46","v":916.1},{"$f":"IF(J46>4,\"Es sind zu viele Schützen in Wertung!\",\" \")","v":" "}]
[3,"Neubörger II",null,{"$f":"K46","v":928.7},{"$f":"IF(L46>4,\"Es sind zu viele Schützen in Wertung!\",\" \")","v":" "},{"$nulls":20},"Ansprechpartner für Rückfragen:"]
[4,"Lahn V",null,{"$f":"M46","v":{"v":911.3000000000001,"d":"911.3"}},{"$f":"IF(N46>4,\"Es sind zu viele Schützen in Wertung!\",\" \")","v":" "},{"$nulls":18},"Name:","Achim Will"]
[5,"Spahnharrenstätte II",null,{"$f":"O46","v":{"v":925.0999999999999,"d":"925.1"}},{"$f":"IF(P46>4,\"Es sind zu viele Schützen in Wertung!\",\" \")","v":" "},{"$nulls":18},"Tel:"]
[6,"Eisten II ",null,{"$f":"Q46","v":{"v":937.0999999999999,"d":"937.1"}},{"$f":"IF(R46>4,\"Es sind zu viele Schützen in Wertung!\",\" \")","v":" "},{"$nulls":18},"Standaufsicht:","Achim Will"]
[]
[null,"Einzelergebnisse:","Verein/Gruppe (per Dropdown-Feld einzutragen)","Ergebnisse","AW? Dann x eintippen",null,"Verein 1",null,"Verein 2",null,"Verein 3",null,"Verein 4",null,"Verein 5",null,"Verein 6",{"$nulls":3},"Geburtsdatum",null,"Proberechnung bei Streifen:"]
[1,"Heiko Micksch","Spahnharrenstätte III",302.8,"x",{"$f":"IF(E10=\"x\",\"0\",D10)","v":"0"},{"$f":"IF(C10=$B$2,F10,0)","v":"0"},{"$f":"(IF(AND($E10=\"\",$C10=$B$2),1,0))","v":0},{"$f":"IF($C10=$B$3,F10,0)","v":0},{"$f":"(IF(AND($E10=\"\",$C10=$B$3),1,0))","v":0},{"$f":"IF($C10=$B$4,F10,0)","v":0},{"$f":"(IF(AND($E10=\"\",$C10=$B$4),1,0))","v":0},{"$f":"IF($C10=$B$5,F10,0)","v":0},{"$f":"(IF(AND($E10=\"\",$C10=$B$5),1,0))","v":0},{"$f":"IF($C10=$B$6,F10,0)","v":0},{"$f":"(IF(AND($E10=\"\",$C10=$B$6),1,0))","v":0},{"$f":"IF($C10=$B$7,F10,0)","v":0},{"$f":"(IF(AND($E10=\"\",$C10=$B$7),1,0))","v":0},{"$nulls":7},{"$f":"W10+X10+Y10","v":{"v":0,"d":"0.0"}},{"$f":"IF(Z10=D10,1,0)","v":0},{"$f":"IF(Z10=0,0,1)","v":0},{"$f":"IF(AA10+AB10=2,\"Korrekt\",\"\")","v":""}]
[2,"Dirk Meyer","Spahnharrenstätte III",308.6,null,{"$f":"IF(E11=\"x\",\"0\",D11)","v":308.6},{"$f":"IF(C11=$B$2,F11,0)","v":308.6},{"$f":"(IF(AND($E11=\"\",$C11=$B$2),1,0))","v":1},{"$f":"IF($C11=$B$3,F11,0)","v":0},{"$f":"(IF(AND($E11=\"\",$C11=$B$3),1,0))","v":0},{"$f":"IF($C11=$B$4,F11,0)","v":0},{"$f":"(IF(AND($E11=\"\",$C11=$B$4),1,0))","v":0},{"$f":"IF($C11=$B$5,F11,0)","v":0},{"$f":"(IF(AND($E11=\"\",$C11=$B$5),1,0))","v":0},{"$f":"IF($C11=$B$6,F11,0)","v":0},{"$f":"(IF(AND($E11=\"\",$C11=$B$6),1,0))","v":0},{"$f":"IF($C11=$B$7,F11,0)","v":0},{"$f":"(IF(AND($E11=\"\",$C11=$B$7),1,0))","v":0},{"$nulls":7},{"$f":"W11+X11+Y11","v":{"v":0,"d":"0.0"}},{"$f":"IF(Z11=D11,1,0)","v":0},{"$f":"IF(Z11=0,0,1)","v":0},{"$f":"IF(AA11+AB11=2,\"Korrekt\",\"\")","v":""}]
[3,"Sebastian Albers","Spahnharrenstätte III",304.5,null,304.5,304.5,1,0,0,0,0,0,0,0,0,0,0,{"$nulls":7},{"v":0,"d":"0.0"},0,0,""]
[4,"Achim Will","Spahnharrenstätte III",307.9,null,307.9,307.9,1,0,0,0,0,0,0,0,0,0,0,{"$nulls":7},{"v":0,"d":"0.0"},0,0,""]
[5,"Christian Grönheim","Spahnharrenstätte III",310.8,null,310.8,310.8,1,0,0,0,0,0,0,0,0,0,0,{"$nulls":7},{"v":0,"d":"0.0"},0,0,""]
[6,"Dieter Hanekamp","Spahnharrenstätte II",311.2,null,311.2,0,0,0,0,0,0,0,0,311.2,1,0,0,{"$nulls":7},{"v":0,"d":"0.0"},0,0,""]
[7,"Josef Langen","Spahnharrenstätte II",{"v":306,"d":"306.0"},null,306,0,0,0,0,0,0,0,0,306,1,0,0,{"$nulls":7},{"v":0,"d":"0.0"},0,0,""]
[8,"Johannes Hülsmann","Spahnharrenstätte II",305.6,null,305.6,0,0,0,0,0,0,0,0,305.6,1,0,0,{"$nulls":7},{"v":0,"d":"0.0"},0,0,""]
[9,"Heiner Kröger","Spahnharrenstätte II",307.9,null,307.9,0,0,0,0,0,0,0,0,307.9,1,0,0,{"$nulls":7},{"v":0,"d":"0.0"},0,0,""]
[10,"Bernd Nortmann","Lahn V",307.8,null,307.8,0,0,0,0,0,0,307.8,1,0,0,0,0,{"$nulls":7},{"v":0,"d":"0.0"},0,0,""]
[11,"Oliver Reinelt","Lahn V",294.1,null,294.1,0,0,0,0,0,0,294.1,1,0,0,0,0,{"$nulls":7},{"v":0,"d":"0.0"},0,0,""]
[12,"Simon Schukenbrock","Lahn V",309.4,null,309.4,0,0,0,0,0,0,309.4,1,0,0,0,0,{"$nulls":7},{"v":0,"d":"0.0"},0,0,""]
[13,"Michael Boje","Lahn V",{"v":0,"d":"0.0"},null,0,0,0,0,0,0,0,0,1,0,0,0,0,{"$nulls":7},{"v":0,"d":"0.0"},1,0,""]
[14,"Ludger Hermes","Neubörger II",311.9,null,311.9,0,0,0,0,311.9,1,0,0,0,0,0,0,{"$nulls":7},{"v":0,"d":"0.0"},0,0,""]
[15,"Rudi Fromme","Neubörger II",303.4,null,303.4,0,0,0,0,303.4,1,0,0,0,0,0,0,{"$nulls":7},{"v":0,"d":"0.0"},0,0,""]
[16,"Alois Schmitz","Neubörger II",{"v":311,"d":"311.0"},null,311,0,0,0,0,311,1,0,0,0,0,0,0,{"$nulls":7},{"v":0,"d":"0.0"},0,0,""]
[17,"Ludwig Langen","Neubörger II",305.8,null,305.8,0,0,0,0,305.8,1,0,0,0,0,0,0,{"$nulls":7},{"v":0,"d":"0.0"},0,0,""]
[18,"Rainer Wielenberg","Esterwegen II",305.9,null,305.9,0,0,305.9,1,0,0,0,0,0,0,0,0,{"$nulls":7},{"v":0,"d":"0.0"},0,0,""]
[19,"Meik Sieger","Esterwegen II",307.8,null,307.8,0,0,307.8,1,0,0,0,0,0,0,0,0,{"$nulls":7},{"v":0,"d":"0.0"},0,0,""]
[20,"Dennis Lindemann","Esterwegen II",302.4,null,302.4,0,0,302.4,1,0,0,0,0,0,0,0,0,{"$nulls":7},{"v":0,"d":"0.0"},0,0,""]
[21,"Andreas Lindemann","Esterwegen II",301.3,null,301.3,0,0,301.3,1,0,0,0,0,0,0,0,0,{"$nulls":7},{"v":0,"d":"0.0"},0,0,""]
[22,"Johannes Gebken","Esterwegen II",299.9,"x","0",0,0,"0",0,0,0,0,0,0,0,0,0,{"$nulls":7},{"v":0,"d":"0.0"},0,0,""]
[23,"Jan-Niklas Lindemann","Esterwegen II",{"v":0,"d":"0.0"},"x","0",0,0,"0",0,0,0,0,0,0,0,0,0,{"$nulls":7},{"v":0,"d":"0.0"},1,0,""]
[24,"Stefan Burlager","Esterwegen II",304.3,"x","0",0,0,"0",0,0,0,0,0,0,0,0,0,{"$nulls":7},{"v":0,"d":"0.0"},0,0,""]
[25,"Franz Ostermann","Eisten II ",308.3,null,308.3,0,0,0,0,0,0,0,0,0,0,308.3,1,{"$nulls":7},{"v":0,"d":"0.0"},0,0,""]
[26,"Martin Hackmann","Eisten II ",313.5,null,313.5,0,0,0,0,0,0,0,0,0,0,313.5,1,{"$nulls":7},{"v":0,"d":"0.0"},0,0,""]
[27,"Günther Baalmann","Eisten II ",315.3,null,315.3,0,0,0,0,0,0,0,0,0,0,315.3,1,{"$nulls":7},{"v":0,"d":"0.0"},0,0,""]
[28,"Martin Poker","Eisten II ",307.3,null,307.3,0,0,0,0,0,0,0,0,0,0,307.3,1,{"$nulls":7},{"v":0,"d":"0.0"},0,0,""]
[29,"Schütze 29",{"$nulls":3},0,0,0,0,0,0,0,0,0,0,0,0,0,{"$nulls":7},{"v":0,"d":"0.0"},1,0,""]
[30,"Schütze 30",{"$nulls":3},0,0,0,0,0,0,0,0,0,0,0,0,0,{"$nulls":7},{"v":0,"d":"0.0"},1,0,""]
[31,"Schütze 31",{"$nulls":3},0,0,0,0,0,0,0,0,0,0,0,0,0,{"$nulls":7},{"$f":"W40+X40+Y40","v":{"v":0,"d":"0.0"}},{"$f":"IF(Z40=D40,1,0)","v":1},{"$f":"IF(Z40=0,0,1)","v":0},{"$f":"IF(AA40+AB40=2,\"Korrekt\",\"\")","v":""}]
[32,"Schütze 32",{"$nulls":3},0,0,0,0,0,0,0,0,0,0,0,0,0,{"$nulls":7},{"v":0,"d":"0.0"},1,0,""]
[33,"Schütze 33",{"$nulls":3},0,0,0,0,0,0,0,0,0,0,0,0,0,{"$nulls":7},{"v":0,"d":"0.0"},1,0,""]
[34,"Schütze 34",{"$nulls":3},0,0,0,0,0,0,0,0,0,0,0,0,0,{"$nulls":7},{"v":0,"d":"0.0"},1,0,""]
[35,"Schütze 35",{"$nulls":3},0,0,0,0,0,0,0,0,0,0,0,0,0,{"$nulls":7},{"v":0,"d":"0.0"},1,0,""]
[36,"Schütze 36",{"$nulls":3},0,0,0,0,0,0,0,0,0,0,0,0,0,{"$nulls":7},{"$f":"W45+X45+Y45","v":{"v":0,"d":"0.0"}},{"$f":"IF(Z45=D45,1,0)","v":1},{"$f":"IF(Z45=0,0,1)","v":0},{"$f":"IF(AA45+AB45=2,\"Korrekt\",\"\")","v":""}]
[{"$nulls":6},{"$f":"LARGE(G10:G45,1)+LARGE(G10:G45,2)+LARGE(G10:G45,3)","v":927.3000000000001},{"$f":"SUM(H10:H45)","v":4},{"$f":"LARGE(I10:I45,1)+LARGE(I10:I45,2)+LARGE(I10:I45,3)","v":916.1},{"$f":"SUM(J10:J45)","v":4},{"$f":"LARGE(K10:K45,1)+LARGE(K10:K45,2)+LARGE(K10:K45,3)","v":928.7},{"$f":"SUM(L10:L45)","v":4},{"$f":"LARGE(M10:M45,1)+LARGE(M10:M45,2)+LARGE(M10:M45,3)","v":911.3000000000001},{"$f":"SUM(N10:N45)","v":4},{"$f":"LARGE(O10:O45,1)+LARGE(O10:O45,2)+LARGE(O10:O45,3)","v":925.0999999999999},{"$f":"SUM(P10:P45)","v":4},{"$f":"LARGE(Q10:Q45,1)+LARGE(Q10:Q45,2)+LARGE(Q10:Q45,3)","v":937.0999999999999},{"$f":"SUM(R10:S45)","v":4}]
[null,null,"per Email an: sk-huemmling@gmx.de"]

{"sheet":"2","index":2,"n_rows":47,"n_cols":27,"rows_kept":47,"merged":[[0,22,0,23],[1,22,1,23],[4,22,4,23],[5,22,5,23],[6,22,6,23],[8,20,8,23]]}
[null,"Verein / Gruppe",null,"Ergebnisse",{"$nulls":17},"Austragungsort:",{"$f":"Übersicht!E4","v":"Esterwegen"}]
[1,{"$f":"'Wettkampf 1'!B2","v":"Spahnharrenstätte III"},null,{"$f":"G46","v":934.8},{"$f":"IF(H46>4,\"Es sind zu viele Schützen in Wertung!\",\" \")","v":" "},{"$nulls":16},"Wettkampftag:",{"$f":"Übersicht!E3","v":"06.10."}]
[2,{"$f":"'Wettkampf 1'!B3","v":"Esterwegen II"},null,{"$f":"I46","v":{"v":919,"d":"919.0"}},{"$f":"IF(J46>4,\"Es sind zu viele Schützen in Wertung!\",\" \")","v":" "}]
[3,{"$f":"'Wettkampf 1'!B4","v":"Neubörger II"},null,{"$f":"K46","v":918.8},{"$f":"IF(L46>4,\"Es sind zu viele Schützen in Wertung!\",\" \")","v":" "},{"$nulls":18},"Ansprechpartner für Rückfragen:"]
[4,{"$f":"'Wettkampf 1'!B5","v":"Lahn V"},null,{"$f":"M46","v":{"v":910.4000000000001,"d":"910.4"}},{"$f":"IF(N46>4,\"Es sind zu viele Schützen in Wertung!\",\" \")","v":" "},{"$nulls":16},"Name:","Esterwegen II"]
[5,{"$f":"'Wettkampf 1'!B6","v":"Spahnharrenstätte II"},null,{"$f":"O46","v":{"v":929.1999999999999,"d":"929.2"}},{"$f":"IF(P46>4,\"Es sind zu viele Schützen in Wertung!\",\" \")","v":" "},{"$nulls":16},"Tel:"]
[6,{"$f":"'Wettkampf 1'!B7","v":"Eisten II "},null,{"$f":"Q46","v":935.1},{"$f":"IF(R46>4,\"Es sind zu viele Schützen in Wertung!\",\" \")","v":" "},{"$nulls":16},"Standaufsicht:","Esterwegen II"]
[]
[null,"Einzelergebnisse:","Verein / Gruppe","Ergebnisse (mindestens 0 eintragen)","AW? Dann x eintippen",null,"Verein 1",null,"Verein 2",null,"Verein 3",null,"Verein 4",null,"Verein 5",null,"Verein 6",{"$nulls":3},"Proberechnung bei Streifen:"]
[1,{"$f":"'Wettkampf 1'!B10","v":"Heiko Micksch"},{"$f":"'Wettkampf 1'!C10","v":"Spahnharrenstätte III"},302.5,null,{"$f":"IF(E10=\"x\",\"0\",D10)","v":302.5},{"$f":"IF(C10=$B$2,F10,0)","v":302.5},{"$f":"(IF(AND($E10=\"\",$C10=$B$2),1,0))","v":1},{"$f":"IF($C10=$B$3,F10,0)","v":0},{"$f":"(IF(AND($E10=\"\",$C10=$B$3),1,0))","v":0},{"$f":"IF($C10=$B$4,F10,0)","v":0},{"$f":"(IF(AND($E10=\"\",$C10=$B$4),1,0))","v":0},{"$f":"IF($C10=$B$5,F10,0)","v":0},{"$f":"(IF(AND($E10=\"\",$C10=$B$5),1,0))","v":0},{"$f":"IF($C10=$B$6,F10,0)","v":0},{"$f":"(IF(AND($E10=\"\",$C10=$B$6),1,0))","v":0},{"$f":"IF($C10=$B$7,F10,0)","v":0},{"$f":"(IF(AND($E10=\"\",$C10=$B$7),1,0))","v":0},{"$nulls":5},{"$f":"U10+V10+W10","v":{"v":0,"d":"0.0"}},{"$f":"IF(X10=D10,1,0)","v":0},{"$f":"IF(X10=0,0,1)","v":0},{"$f":"IF(Y10+Z10=2,\"Korrekt\",\"\")","v":""}]
[2,{"$f":"'Wettkampf 1'!B11","v":"Dirk Meyer"},{"$f":"'Wettkampf 1'!C11","v":"Spahnharrenstätte III"},311.2,null,{"$f":"IF(E11=\"x\",\"0\",D11)","v":311.2},{"$f":"IF(C11=$B$2,F11,0)","v":311.2},{"$f":"(IF(AND($E11=\"\",$C11=$B$2),1,0))","v":1},{"$f":"IF($C11=$B$3,F11,0)","v":0},{"$f":"(IF(AND($E11=\"\",$C11=$B$3),1,0))","v":0},{"$f":"IF($C11=$B$4,F11,0)","v":0},{"$f":"(IF(AND($E11=\"\",$C11=$B$4),1,0))","v":0},{"$f":"IF($C11=$B$5,F11,0)","v":0},{"$f":"(IF(AND($E11=\"\",$C11=$B$5),1,0))","v":0},{"$f":"IF($C11=$B$6,F11,0)","v":0},{"$f":"(IF(AND($E11=\"\",$C11=$B$6),1,0))","v":0},{"$f":"IF($C11=$B$7,F11,0)","v":0},{"$f":"(IF(AND($E11=\"\",$C11=$B$7),1,0))","v":0},{"$nulls":5},{"$f":"U11+V11+W11","v":{"v":0,"d":"0.0"}},{"$f":"IF(X11=D11,1,0)","v":0},{"$f":"IF(X11=0,0,1)","v":0},{"$f":"IF(Y11+Z11=2,\"Korrekt\",\"\")","v":""}]
[3,{"$f":"'Wettkampf 1'!B12","v":"Sebastian Albers"},{"$f":"'Wettkampf 1'!C12","v":"Spahnharrenstätte III"},303.8,"x","0","0",0,0,0,0,0,0,0,0,0,0,0,{"$nulls":5},{"v":0,"d":"0.0"},0,0,""]
[4,{"$f":"'Wettkampf 1'!B13","v":"Achim Will"},{"$f":"'Wettkampf 1'!C13","v":"Spahnharrenstätte III"},313.7,null,313.7,313.7,1,0,0,0,0,0,0,0,0,0,0,{"$nulls":5},{"v":0,"d":"0.0"},0,0,""]
[5,{"$f":"'Wettkampf 1'!B14","v":"Christian Grönheim"},{"$f":"'Wettkampf 1'!C14","v":"Spahnharrenstätte III"},309.9,null,309.9,309.9,1,0,0,0,0,0,0,0,0,0,0,{"$nulls":5},{"v":0,"d":"0.0"},0,0,""]
[6,{"$f":"'Wettkampf 1'!B15","v":"Dieter Hanekamp"},{"$f":"'Wettkampf 1'!C15","v":"Spahnharrenstätte II"},308.7,null,308.7,0,0,0,0,0,0,0,0,308.7,1,0,0,{"$nulls":5},{"v":0,"d":"0.0"},0,0,""]
[7,{"$f":"'Wettkampf 1'!B16","v":"Josef Langen"},{"$f":"'Wettkampf 1'!C16","v":"Spahnharrenstätte II"},304.9,null,304.9,0,0,0,0,0,0,0,0,304.9,1,0,0,{"$nulls":5},{"v":0,"d":"0.0"},0,0,""]
[8,{"$f":"'Wettkampf 1'!B17","v":"Johannes Hülsmann"},{"$f":"'Wettkampf 1'!C17","v":"Spahnharrenstätte II"},312.4,null,312.4,0,0,0,0,0,0,0,0,312.4,1,0,0,{"$nulls":5},{"v":0,"d":"0.0"},0,0,""]
[9,{"$f":"'Wettkampf 1'!B18","v":"Heiner Kröger"},{"$f":"'Wettkampf 1'!C18","v":"Spahnharrenstätte II"},308.1,null,308.1,0,0,0,0,0,0,0,0,308.1,1,0,0,{"$nulls":5},{"v":0,"d":"0.0"},0,0,""]
[10,{"$f":"'Wettkampf 1'!B19","v":"Bernd Nortmann"},{"$f":"'Wettkampf 1'!C19","v":"Lahn V"},302.2,null,302.2,0,0,0,0,0,0,302.2,1,0,0,0,0,{"$nulls":5},{"v":0,"d":"0.0"},0,0,""]
[11,{"$f":"'Wettkampf 1'!B20","v":"Oliver Reinelt"},{"$f":"'Wettkampf 1'!C20","v":"Lahn V"},299.7,null,299.7,0,0,0,0,0,0,299.7,1,0,0,0,0,{"$nulls":5},{"v":0,"d":"0.0"},0,0,""]
[12,{"$f":"'Wettkampf 1'!B21","v":"Simon Schukenbrock"},{"$f":"'Wettkampf 1'!C21","v":"Lahn V"},308.5,null,308.5,0,0,0,0,0,0,308.5,1,0,0,0,0,{"$nulls":5},{"v":0,"d":"0.0"},0,0,""]
[13,{"$f":"'Wettkampf 1'!B22","v":"Michael Boje"},{"$f":"'Wettkampf 1'!C22","v":"Lahn V"},298.7,null,298.7,0,0,0,0,0,0,298.7,1,0,0,0,0,{"$nulls":5},{"v":0,"d":"0.0"},0,0,""]
[14,{"$f":"'Wettkampf 1'!B23","v":"Ludger Hermes"},{"$f":"'Wettkampf 1'!C23","v":"Neubörger II"},309.3,null,309.3,0,0,0,0,309.3,1,0,0,0,0,0,0,{"$nulls":5},{"v":0,"d":"0.0"},0,0,""]
[15,{"$f":"'Wettkampf 1'!B24","v":"Rudi Fromme"},{"$f":"'Wettkampf 1'!C24","v":"Neubörger II"},298.5,null,298.5,0,0,0,0,298.5,1,0,0,0,0,0,0,{"$nulls":5},{"v":0,"d":"0.0"},0,0,""]
[16,{"$f":"'Wettkampf 1'!B25","v":"Alois Schmitz"},{"$f":"'Wettkampf 1'!C25","v":"Neubörger II"},{"v":310,"d":"310.0"},null,{"v":310,"d":"310.0"},0,0,0,0,310,1,0,0,0,0,0,0,{"$nulls":5},{"v":0,"d":"0.0"},0,0,""]
[17,{"$f":"'Wettkampf 1'!B26","v":"Ludwig Langen"},{"$f":"'Wettkampf 1'!C26","v":"Neubörger II"},299.5,null,299.5,0,0,0,0,299.5,1,0,0,0,0,0,0,{"$nulls":5},{"v":0,"d":"0.0"},0,0,""]
[18,{"$f":"'Wettkampf 1'!B27","v":"Rainer Wielenberg"},{"$f":"'Wettkampf 1'!C27","v":"Esterwegen II"},306.6,null,306.6,0,0,306.6,1,0,0,0,0,0,0,0,0,{"$nulls":5},{"v":0,"d":"0.0"},0,0,""]
[19,{"$f":"'Wettkampf 1'!B28","v":"Meik Sieger"},{"$f":"'Wettkampf 1'!C28","v":"Esterwegen II"},305.8,null,305.8,0,0,305.8,1,0,0,0,0,0,0,0,0,{"$nulls":5},{"v":0,"d":"0.0"},0,0,""]
[20,{"$f":"'Wettkampf 1'!B29","v":"Dennis Lindemann"},{"$f":"'Wettkampf 1'!C29","v":"Esterwegen II"},306.6,null,306.6,0,0,306.6,1,0,0,0,0,0,0,0,0,{"$nulls":5},{"v":0,"d":"0.0"},0,0,""]
[21,{"$f":"'Wettkampf 1'!B30","v":"Andreas Lindemann"},{"$f":"'Wettkampf 1'!C30","v":"Esterwegen II"},{"v":308,"d":"308.0"},"x","0",0,0,"0",0,0,0,0,0,0,0,0,0,{"$nulls":5},{"v":0,"d":"0.0"},0,0,""]
[22,{"$f":"'Wettkampf 1'!B31","v":"Johannes Gebken"},{"$f":"'Wettkampf 1'!C31","v":"Esterwegen II"},291.1,"x","0",0,0,"0",0,0,0,0,0,0,0,0,0,{"$nulls":5},{"v":0,"d":"0.0"},0,0,""]
[23,{"$f":"'Wettkampf 1'!B32","v":"Jan-Niklas Lindemann"},{"$f":"'Wettkampf 1'!C32","v":"Esterwegen II"},{"v":0,"d":"0.0"},"x","0",0,0,"0",0,0,0,0,0,0,0,0,0,{"$nulls":5},{"v":0,"d":"0.0"},1,0,""]
[24,{"$f":"'Wettkampf 1'!B33","v":"Stefan Burlager"},{"$f":"'Wettkampf 1'!C33","v":"Esterwegen II"},301.4,null,301.4,0,0,301.4,1,0,0,0,0,0,0,0,0,{"$nulls":5},{"v":0,"d":"0.0"},0,0,""]
[25,{"$f":"'Wettkampf 1'!B34","v":"Franz Ostermann"},{"$f":"'Wettkampf 1'!C34","v":"Eisten II "},309.6,null,309.6,0,0,0,0,0,0,0,0,0,0,309.6,1,{"$nulls":5},{"v":0,"d":"0.0"},0,0,""]
[26,{"$f":"'Wettkampf 1'!B35","v":"Martin Hackmann"},{"$f":"'Wettkampf 1'!C35","v":"Eisten II "},307.5,null,307.5,0,0,0,0,0,0,0,0,0,0,307.5,1,{"$nulls":5},{"v":0,"d":"0.0"},0,0,""]
[27,{"$f":"'Wettkampf 1'!B36","v":"Günther Baalmann"},{"$f":"'Wettkampf 1'!C36","v":"Eisten II "},312.1,null,312.1,0,0,0,0,0,0,0,0,0,0,312.1,1,{"$nulls":5},{"v":0,"d":"0.0"},0,0,""]
[28,{"$f":"'Wettkampf 1'!B37","v":"Martin Poker"},{"$f":"'Wettkampf 1'!C37","v":"Eisten II "},313.4,null,313.4,0,0,0,0,0,0,0,0,0,0,313.4,1,{"$nulls":5},{"v":0,"d":"0.0"},0,0,""]
[29,{"$f":"'Wettkampf 1'!B38","v":"Schütze 29"},{"$f":"'Wettkampf 1'!C38","v":{"v":0,"d":"0.0"}},{"v":0,"d":"0.0"},null,{"v":0,"d":"0.0"},0,0,0,0,0,0,0,0,0,0,0,0,{"$nulls":5},{"v":0,"d":"0.0"},1,0,""]
[30,{"$f":"'Wettkampf 1'!B39","v":"Schütze 30"},{"$f":"'Wettkampf 1'!C39","v":{"v":0,"d":"0.0"}},{"v":0,"d":"0.0"},"x","0",0,0,0,0,0,0,0,0,0,0,0,0,{"$nulls":5},{"v":0,"d":"0.0"},1,0,""]
[31,{"$f":"'Wettkampf 1'!B40","v":"Schütze 31"},{"$f":"'Wettkampf 1'!C40","v":{"v":0,"d":"0.0"}},{"v":0,"d":"0.0"},null,{"v":0,"d":"0.0"},0,0,0,0,0,0,0,0,0,0,0,0,{"$nulls":5},{"$f":"U40+V40+W40","v":{"v":0,"d":"0.0"}},{"$f":"IF(X40=D40,1,0)","v":1},{"$f":"IF(X40=0,0,1)","v":0},{"$f":"IF(Y40+Z40=2,\"Korrekt\",\"\")","v":""}]
[32,{"$f":"'Wettkampf 1'!B41","v":"Schütze 32"},{"$f":"'Wettkampf 1'!C41","v":{"v":0,"d":"0.0"}},{"v":0,"d":"0.0"},null,{"v":0,"d":"0.0"},0,0,0,0,0,0,0,0,0,0,0,0,{"$nulls":5},{"v":0,"d":"0.0"},1,0,""]
[33,{"$f":"'Wettkampf 1'!B42","v":"Schütze 33"},{"$f":"'Wettkampf 1'!C42","v":{"v":0,"d":"0.0"}},{"v":0,"d":"0.0"},null,{"v":0,"d":"0.0"},0,0,0,0,0,0,0,0,0,0,0,0,{"$nulls":5},{"v":0,"d":"0.0"},1,0,""]
[34,{"$f":"'Wettkampf 1'!B43","v":"Schütze 34"},{"$f":"'Wettkampf 1'!C43","v":{"v":0,"d":"0.0"}},{"v":0,"d":"0.0"},null,{"v":0,"d":"0.0"},0,0,0,0,0,0,0,0,0,0,0,0,{"$nulls":5},{"v":0,"d":"0.0"},1,0,""]
[35,{"$f":"'Wettkampf 1'!B44","v":"Schütze 35"},{"$f":"'Wettkampf 1'!C44","v":{"v":0,"d":"0.0"}},{"v":0,"d":"0.0"},"x","0",0,0,0,0,0,0,0,0,0,0,0,0,{"$nulls":5},{"v":0,"d":"0.0"},1,0,""]
[36,{"$f":"'Wettkampf 1'!B45","v":"Schütze 36"},{"$f":"'Wettkampf 1'!C45","v":{"v":0,"d":"0.0"}},{"v":0,"d":"0.0"},"x","0",0,0,0,0,0,0,0,0,0,0,0,0,{"$nulls":5},{"$f":"U45+V45+W45","v":{"v":0,"d":"0.0"}},{"$f":"IF(X45=D45,1,0)","v":1},{"$f":"IF(X45=0,0,1)","v":0},{"$f":"IF(Y45+Z45=2,\"Korrekt\",\"\")","v":""}]
[{"$nulls":6},{"$f":"LARGE(G10:G45,1)+LARGE(G10:G45,2)+LARGE(G10:G45,3)","v":934.8},{"$f":"SUM(H10:H45)","v":4},{"$f":"LARGE(I10:I45,1)+LARGE(I10:I45,2)+LARGE(I10:I45,3)","v":919},{"$f":"SUM(J10:J45)","v":4},{"$f":"LARGE(K10:K45,1)+LARGE(K10:K45,2)+LARGE(K10:K45,3)","v":918.8},{"$f":"SUM(L10:L45)","v":4},{"$f":"LARGE(M10:M45,1)+LARGE(M10:M45,2)+LARGE(M10:M45,3)","v":910.4000000000001},{"$f":"SUM(N10:N45)","v":4},{"$f":"LARGE(O10:O45,1)+LARGE(O10:O45,2)+LARGE(O10:O45,3)","v":929.1999999999999},{"$f":"SUM(P10:P45)","v":4},{"$f":"LARGE(Q10:Q45,1)+LARGE(Q10:Q45,2)+LARGE(Q10:Q45,3)","v":935.1},{"$f":"SUM(R10:S45)","v":4}]
[null,null,"per Email an: sk-huemmling@gmx.de"]

{"sheet":"3","index":3,"n_rows":47,"n_cols":27,"rows_kept":47,"merged":[[0,22,0,23],[1,22,1,23],[4,22,4,23],[5,22,5,23],[6,22,6,23],[8,20,8,23]]}
[null,"Verein / Gruppe",null,"Ergebnisse",{"$nulls":17},"Austragungsort:",{"$f":"Übersicht!F4","v":"Neubörger"}]
[1,{"$f":"'Wettkampf 1'!B2","v":"Spahnharrenstätte III"},null,{"$f":"G46","v":928.5},{"$f":"IF(H46>4,\"Es sind zu viele Schützen in Wertung!\",\" \")","v":" "},{"$nulls":16},"Wettkampftag:",{"$f":"Übersicht!F3","v":"20.10."}]
[2,{"$f":"'Wettkampf 1'!B3","v":"Esterwegen II"},null,{"$f":"I46","v":931.5},{"$f":"IF(J46>4,\"Es sind zu viele Schützen in Wertung!\",\" \")","v":" "}]
[3,{"$f":"'Wettkampf 1'!B4","v":"Neubörger II"},null,{"$f":"K46","v":{"v":927.8999999999999,"d":"927.9"}},{"$f":"IF(L46>4,\"Es sind zu viele Schützen in Wertung!\",\" \")","v":" "},{"$nulls":18},"Ansprechpartner für Rückfragen:"]
[4,{"$f":"'Wettkampf 1'!B5","v":"Lahn V"},null,{"$f":"M46","v":903.7},{"$f":"IF(N46>4,\"Es sind zu viele Schützen in Wertung!\",\" \")","v":" "},{"$nulls":16},"Name:","Alois Schmitz"]
[5,{"$f":"'Wettkampf 1'!B6","v":"Spahnharrenstätte II"},null,{"$f":"O46","v":921.6},{"$f":"IF(P46>4,\"Es sind zu viele Schützen in Wertung!\",\" \")","v":" "},{"$nulls":16},"Tel:"]
[6,{"$f":"'Wettkampf 1'!B7","v":"Eisten II "},null,{"$f":"Q46","v":{"v":939.0999999999999,"d":"939.1"}},{"$f":"IF(R46>4,\"Es sind zu viele Schützen in Wertung!\",\" \")","v":" "},{"$nulls":16},"Standaufsicht:","Ludwig Langen"]
[]
[null,"Einzelergebnisse:","Verein / Gruppe","Ergebnisse (mindestens 0 eintragen)","AW? Dann x eintippen",null,"Verein 1",null,"Verein 2",null,"Verein 3",null,"Verein 4",null,"Verein 5",null,"Verein 6",{"$nulls":3},"Proberechnung bei Streifen:"]
[1,{"$f":"'Wettkampf 1'!B10","v":"Heiko Micksch"},{"$f":"'Wettkampf 1'!C10","v":"Spahnharrenstätte III"},309.4,"x",{"$f":"IF(E10=\"x\",\"0\",D10)","v":"0"},{"$f":"IF(C10=$B$2,F10,0)","v":"0"},{"$f":"(IF(AND($E10=\"\",$C10=$B$2),1,0))","v":0},{"$f":"IF($C10=$B$3,F10,0)","v":0},{"$f":"(IF(AND($E10=\"\",$C10=$B$3),1,0))","v":0},{"$f":"IF($C10=$B$4,F10,0)","v":0},{"$f":"(IF(AND($E10=\"\",$C10=$B$4),1,0))","v":0},{"$f":"IF($C10=$B$5,F10,0)","v":0},{"$f":"(IF(AND($E10=\"\",$C10=$B$5),1,0))","v":0},{"$f":"IF($C10=$B$6,F10,0)","v":0},{"$f":"(IF(AND($E10=\"\",$C10=$B$6),1,0))","v":0},{"$f":"IF($C10=$B$7,F10,0)","v":0},{"$f":"(IF(AND($E10=\"\",$C10=$B$7),1,0))","v":0},{"$nulls":5},{"$f":"U10+V10+W10","v":{"v":0,"d":"0.0"}},{"$f":"IF(X10=D10,1,0)","v":0},{"$f":"IF(X10=0,0,1)","v":0},{"$f":"IF(Y10+Z10=2,\"Korrekt\",\"\")","v":""}]
[2,{"$f":"'Wettkampf 1'!B11","v":"Dirk Meyer"},{"$f":"'Wettkampf 1'!C11","v":"Spahnharrenstätte III"},310.4,null,{"$f":"IF(E11=\"x\",\"0\",D11)","v":310.4},{"$f":"IF(C11=$B$2,F11,0)","v":310.4},{"$f":"(IF(AND($E11=\"\",$C11=$B$2),1,0))","v":1},{"$f":"IF($C11=$B$3,F11,0)","v":0},{"$f":"(IF(AND($E11=\"\",$C11=$B$3),1,0))","v":0},{"$f":"IF($C11=$B$4,F11,0)","v":0},{"$f":"(IF(AND($E11=\"\",$C11=$B$4),1,0))","v":0},{"$f":"IF($C11=$B$5,F11,0)","v":0},{"$f":"(IF(AND($E11=\"\",$C11=$B$5),1,0))","v":0},{"$f":"IF($C11=$B$6,F11,0)","v":0},{"$f":"(IF(AND($E11=\"\",$C11=$B$6),1,0))","v":0},{"$f":"IF($C11=$B$7,F11,0)","v":0},{"$f":"(IF(AND($E11=\"\",$C11=$B$7),1,0))","v":0},{"$nulls":5},{"$f":"U11+V11+W11","v":{"v":0,"d":"0.0"}},{"$f":"IF(X11=D11,1,0)","v":0},{"$f":"IF(X11=0,0,1)","v":0},{"$f":"IF(Y11+Z11=2,\"Korrekt\",\"\")","v":""}]
[3,{"$f":"'Wettkampf 1'!B12","v":"Sebastian Albers"},{"$f":"'Wettkampf 1'!C12","v":"Spahnharrenstätte III"},307.5,null,307.5,307.5,1,0,0,0,0,0,0,0,0,0,0,{"$nulls":5},{"v":0,"d":"0.0"},0,0,""]
[4,{"$f":"'Wettkampf 1'!B13","v":"Achim Will"},{"$f":"'Wettkampf 1'!C13","v":"Spahnharrenstätte III"},310.4,null,310.4,310.4,1,0,0,0,0,0,0,0,0,0,0,{"$nulls":5},{"v":0,"d":"0.0"},0,0,""]
[5,{"$f":"'Wettkampf 1'!B14","v":"Christian Grönheim"},{"$f":"'Wettkampf 1'!C14","v":"Spahnharrenstätte III"},307.7,null,307.7,307.7,1,0,0,0,0,0,0,0,0,0,0,{"$nulls":5},{"v":0,"d":"0.0"},0,0,""]
[6,{"$f":"'Wettkampf 1'!B15","v":"Dieter Hanekamp"},{"$f":"'Wettkampf 1'!C15","v":"Spahnharrenstätte II"},309.8,null,309.8,0,0,0,0,0,0,0,0,309.8,1,0,0,{"$nulls":5},{"v":0,"d":"0.0"},0,0,""]
[7,{"$f":"'Wettkampf 1'!B16","v":"Josef Langen"},{"$f":"'Wettkampf 1'!C16","v":"Spahnharrenstätte II"},304.9,null,304.9,0,0,0,0,0,0,0,0,304.9,1,0,0,{"$nulls":5},{"v":0,"d":"0.0"},0,0,""]
[8,{"$f":"'Wettkampf 1'!B17","v":"Johannes Hülsmann"},{"$f":"'Wettkampf 1'!C17","v":"Spahnharrenstätte II"},303.4,null,303.4,0,0,0,0,0,0,0,0,303.4,1,0,0,{"$nulls":5},{"v":0,"d":"0.0"},0,0,""]
[9,{"$f":"'Wettkampf 1'!B18","v":"Heiner Kröger"},{"$f":"'Wettkampf 1'!C18","v":"Spahnharrenstätte II"},306.9,null,306.9,0,0,0,0,0,0,0,0,306.9,1,0,0,{"$nulls":5},{"v":0,"d":"0.0"},0,0,""]
[10,{"$f":"'Wettkampf 1'!B19","v":"Bernd Nortmann"},{"$f":"'Wettkampf 1'!C19","v":"Lahn V"},301.5,null,301.5,0,0,0,0,0,0,301.5,1,0,0,0,0,{"$nulls":5},{"v":0,"d":"0.0"},0,0,""]
[11,{"$f":"'Wettkampf 1'!B20","v":"Oliver Reinelt"},{"$f":"'Wettkampf 1'!C20","v":"Lahn V"},293.1,null,293.1,0,0,0,0,0,0,293.1,1,0,0,0,0,{"$nulls":5},{"v":0,"d":"0.0"},0,0,""]
[12,{"$f":"'Wettkampf 1'!B21","v":"Simon Schukenbrock"},{"$f":"'Wettkampf 1'!C21","v":"Lahn V"},309.1,null,309.1,0,0,0,0,0,0,309.1,1,0,0,0,0,{"$nulls":5},{"v":0,"d":"0.0"},0,0,""]
[13,{"$f":"'Wettkampf 1'!B22","v":"Michael Boje"},{"$f":"'Wettkampf 1'!C22","v":"Lahn V"},{"v":0,"d":"0.0"},null,{"v":0,"d":"0.0"},0,0,0,0,0,0,0,1,0,0,0,0,{"$nulls":5},{"v":0,"d":"0.0"},1,0,""]
[14,{"$f":"'Wettkampf 1'!B23","v":"Ludger Hermes"},{"$f":"'Wettkampf 1'!C23","v":"Neubörger II"},312.9,null,312.9,0,0,0,0,312.9,1,0,0,0,0,0,0,{"$nulls":5},{"v":0,"d":"0.0"},0,0,""]
[15,{"$f":"'Wettkampf 1'!B24","v":"Rudi Fromme"},{"$f":"'Wettkampf 1'!C24","v":"Neubörger II"},306.3,null,306.3,0,0,0,0,306.3,1,0,0,0,0,0,0,{"$nulls":5},{"v":0,"d":"0.0"},0,0,""]
[16,{"$f":"'Wettkampf 1'!B25","v":"Alois Schmitz"},{"$f":"'Wettkampf 1'!C25","v":"Neubörger II"},308.7,null,308.7,0,0,0,0,308.7,1,0,0,0,0,0,0,{"$nulls":5},{"v":0,"d":"0.0"},0,0,""]
[17,{"$f":"'Wettkampf 1'!B26","v":"Ludwig Langen"},{"$f":"'Wettkampf 1'!C26","v":"Neubörger II"},305.8,null,305.8,0,0,0,0,305.8,1,0,0,0,0,0,0,{"$nulls":5},{"v":0,"d":"0.0"},0,0,""]
[18,{"$f":"'Wettkampf 1'!B27","v":"Rainer Wielenberg"},{"$f":"'Wettkampf 1'!C27","v":"Esterwegen II"},306.4,null,306.4,0,0,306.4,1,0,0,0,0,0,0,0,0,{"$nulls":5},{"v":0,"d":"0.0"},0,0,""]
[19,{"$f":"'Wettkampf 1'!B28","v":"Meik Sieger"},{"$f":"'Wettkampf 1'!C28","v":"Esterwegen II"},309.2,null,309.2,0,0,309.2,1,0,0,0,0,0,0,0,0,{"$nulls":5},{"v":0,"d":"0.0"},0,0,""]
[20,{"$f":"'Wettkampf 1'!B29","v":"Dennis Lindemann"},{"$f":"'Wettkampf 1'!C29","v":"Esterwegen II"},310.3,null,310.3,0,0,310.3,1,0,0,0,0,0,0,0,0,{"$nulls":5},{"v":0,"d":"0.0"},0,0,""]
[21,{"$f":"'Wettkampf 1'!B30","v":"Andreas Lindemann"},{"$f":"'Wettkampf 1'!C30","v":"Esterwegen II"},{"v":312,"d":"312.0"},null,{"v":312,"d":"312.0"},0,0,312,1,0,0,0,0,0,0,0,0,{"$nulls":5},{"v":0,"d":"0.0"},0,0,""]
[22,{"$f":"'Wettkampf 1'!B31","v":"Johannes Gebken"},{"$f":"'Wettkampf 1'!C31","v":"Esterwegen II"},290.6,"x","0",0,0,"0",0,0,0,0,0,0,0,0,0,{"$nulls":5},{"v":0,"d":"0.0"},0,0,""]
[23,{"$f":"'Wettkampf 1'!B32","v":"Jan-Niklas Lindemann"},{"$f":"'Wettkampf 1'!C32","v":"Esterwegen II"},{"v":0,"d":"0.0"},"x","0",0,0,"0",0,0,0,0,0,0,0,0,0,{"$nulls":5},{"v":0,"d":"0.0"},1,0,""]
[24,{"$f":"'Wettkampf 1'!B33","v":"Stefan Burlager"},{"$f":"'Wettkampf 1'!C33","v":"Esterwegen II"},296.8,"x","0",0,0,"0",0,0,0,0,0,0,0,0,0,{"$nulls":5},{"v":0,"d":"0.0"},0,0,""]
[25,{"$f":"'Wettkampf 1'!B34","v":"Franz Ostermann"},{"$f":"'Wettkampf 1'!C34","v":"Eisten II "},306.8,null,306.8,0,0,0,0,0,0,0,0,0,0,306.8,1,{"$nulls":5},{"v":0,"d":"0.0"},0,0,""]
[26,{"$f":"'Wettkampf 1'!B35","v":"Martin Hackmann"},{"$f":"'Wettkampf 1'!C35","v":"Eisten II "},311.4,null,311.4,0,0,0,0,0,0,0,0,0,0,311.4,1,{"$nulls":5},{"v":0,"d":"0.0"},0,0,""]
[27,{"$f":"'Wettkampf 1'!B36","v":"Günther Baalmann"},{"$f":"'Wettkampf 1'!C36","v":"Eisten II "},316.7,null,316.7,0,0,0,0,0,0,0,0,0,0,316.7,1,{"$nulls":5},{"v":0,"d":"0.0"},0,0,""]
[28,{"$f":"'Wettkampf 1'!B37","v":"Martin Poker"},{"$f":"'Wettkampf 1'!C37","v":"Eisten II "},{"v":311,"d":"311.0"},null,{"v":311,"d":"311.0"},0,0,0,0,0,0,0,0,0,0,311,1,{"$nulls":5},{"v":0,"d":"0.0"},0,0,""]
[29,{"$f":"'Wettkampf 1'!B38","v":"Schütze 29"},{"$f":"'Wettkampf 1'!C38","v":{"v":0,"d":"0.0"}},{"v":0,"d":"0.0"},"x","0",0,0,0,0,0,0,0,0,0,0,0,0,{"$nulls":5},{"v":0,"d":"0.0"},1,0,""]
[30,{"$f":"'Wettkampf 1'!B39","v":"Schütze 30"},{"$f":"'Wettkampf 1'!C39","v":{"v":0,"d":"0.0"}},{"v":0,"d":"0.0"},"x","0",0,0,0,0,0,0,0,0,0,0,0,0,{"$nulls":5},{"v":0,"d":"0.0"},1,0,""]
[31,{"$f":"'Wettkampf 1'!B40","v":"Schütze 31"},{"$f":"'Wettkampf 1'!C40","v":{"v":0,"d":"0.0"}},{"v":0,"d":"0.0"},null,{"v":0,"d":"0.0"},0,0,0,0,0,0,0,0,0,0,0,0,{"$nulls":5},{"v":0,"d":"0.0"},1,0,""]
[32,{"$f":"'Wettkampf 1'!B41","v":"Schütze 32"},{"$f":"'Wettkampf 1'!C41","v":{"v":0,"d":"0.0"}},{"v":0,"d":"0.0"},null,{"v":0,"d":"0.0"},0,0,0,0,0,0,0,0,0,0,0,0,{"$nulls":5},{"v":0,"d":"0.0"},1,0,""]
[33,{"$f":"'Wettkampf 1'!B42","v":"Schütze 33"},{"$f":"'Wettkampf 1'!C42","v":{"v":0,"d":"0.0"}},{"v":0,"d":"0.0"},null,{"v":0,"d":"0.0"},0,0,0,0,0,0,0,0,0,0,0,0,{"$nulls":5},{"v":0,"d":"0.0"},1,0,""]
[34,{"$f":"'Wettkampf 1'!B43","v":"Schütze 34"},{"$f":"'Wettkampf 1'!C43","v":{"v":0,"d":"0.0"}},{"v":0,"d":"0.0"},null,{"v":0,"d":"0.0"},0,0,0,0,0,0,0,0,0,0,0,0,{"$nulls":5},{"v":0,"d":"0.0"},1,0,""]
[35,{"$f":"'Wettkampf 1'!B44","v":"Schütze 35"},{"$f":"'Wettkampf 1'!C44","v":{"v":0,"d":"0.0"}},{"v":0,"d":"0.0"},"x","0",0,0,0,0,0,0,0,0,0,0,0,0,{"$nulls":5},{"v":0,"d":"0.0"},1,0,""]
[36,{"$f":"'Wettkampf 1'!B45","v":"Schütze 36"},{"$f":"'Wettkampf 1'!C45","v":{"v":0,"d":"0.0"}},{"v":0,"d":"0.0"},"x","0",0,0,0,0,0,0,0,0,0,0,0,0,{"$nulls":5},{"v":0,"d":"0.0"},1,0,""]
[{"$nulls":6},{"$f":"LARGE(G10:G45,1)+LARGE(G10:G45,2)+LARGE(G10:G45,3)","v":928.5},{"$f":"SUM(H10:H45)","v":4},{"$f":"LARGE(I10:I45,1)+LARGE(I10:I45,2)+LARGE(I10:I45,3)","v":931.5},{"$f":"SUM(J10:J45)","v":4},{"$f":"LARGE(K10:K45,1)+LARGE(K10:K45,2)+LARGE(K10:K45,3)","v":927.8999999999999},{"$f":"SUM(L10:L45)","v":4},{"$f":"LARGE(M10:M45,1)+LARGE(M10:M45,2)+LARGE(M10:M45,3)","v":903.7},{"$f":"SUM(N10:N45)","v":4},{"$f":"LARGE(O10:O45,1)+LARGE(O10:O45,2)+LARGE(O10:O45,3)","v":921.6},{"$f":"SUM(P10:P45)","v":4},{"$f":"LARGE(Q10:Q45,1)+LARGE(Q10:Q45,2)+LARGE(Q10:Q45,3)","v":939.0999999999999},{"$f":"SUM(R10:S45)","v":4}]
[null,null,"per Email an: sk-huemmling@gmx.de"]

{"sheet":"4","index":4,"n_rows":47,"n_cols":27,"rows_kept":47,"merged":[[0,22,0,23],[1,22,1,23],[4,22,4,23],[5,22,5,23],[6,22,6,23],[8,20,8,23]]}
[null,"Verein / Gruppe",null,"Ergebnisse",{"$nulls":17},"Austragungsort:",{"$f":"Übersicht!G4","v":"Lahn"}]
[1,{"$f":"'Wettkampf 1'!B2","v":"Spahnharrenstätte III"},null,{"$f":"G46","v":{"v":935.5999999999999,"d":"935.6"}},{"$f":"IF(H46>4,\"Es sind zu viele Schützen in Wertung!\",\" \")","v":" "},{"$nulls":16},"Wettkampftag:",{"$f":"Übersicht!G3","v":"10.11."}]
[2,{"$f":"'Wettkampf 1'!B3","v":"Esterwegen II"},null,{"$f":"I46","v":{"v":921.6999999999999,"d":"921.7"}},{"$f":"IF(J46>4,\"Es sind zu viele Schützen in Wertung!\",\" \")","v":" "}]
[3,{"$f":"'Wettkampf 1'!B4","v":"Neubörger II"},null,{"$f":"K46","v":{"v":928,"d":"928.0"}},{"$f":"IF(L46>4,\"Es sind zu viele Schützen in Wertung!\",\" \")","v":" "},{"$nulls":18},"Ansprechpartner für Rückfragen:"]
[4,{"$f":"'Wettkampf 1'!B5","v":"Lahn V"},null,{"$f":"M46","v":915.3},{"$f":"IF(N46>4,\"Es sind zu viele Schützen in Wertung!\",\" \")","v":" "},{"$nulls":16},"Name:","Lahn V"]
[5,{"$f":"'Wettkampf 1'!B6","v":"Spahnharrenstätte II"},null,{"$f":"O46","v":929.7},{"$f":"IF(P46>4,\"Es sind zu viele Schützen in Wertung!\",\" \")","v":" "},{"$nulls":16},"Tel:"]
[6,{"$f":"'Wettkampf 1'!B7","v":"Eisten II "},null,{"$f":"Q46","v":937.5},{"$f":"IF(R46>4,\"Es sind zu viele Schützen in Wertung!\",\" \")","v":" "},{"$nulls":16},"Standaufsicht:","Lahn V"]
[]
[null,"Einzelergebnisse:","Verein / Gruppe","Ergebnisse (mindestens 0 eintragen)","AW? Dann x eintippen",null,"Verein 1",null,"Verein 2",null,"Verein 3",null,"Verein 4",null,"Verein 5",null,"Verein 6",{"$nulls":3},"Proberechnung bei Streifen:"]
[1,{"$f":"'Wettkampf 1'!B10","v":"Heiko Micksch"},{"$f":"'Wettkampf 1'!C10","v":"Spahnharrenstätte III"},303.6,"x",{"$f":"IF(E10=\"x\",\"0\",D10)","v":"0"},{"$f":"IF(C10=$B$2,F10,0)","v":"0"},{"$f":"(IF(AND($E10=\"\",$C10=$B$2),1,0))","v":0},{"$f":"IF($C10=$B$3,F10,0)","v":0},{"$f":"(IF(AND($E10=\"\",$C10=$B$3),1,0))","v":0},{"$f":"IF($C10=$B$4,F10,0)","v":0},{"$f":"(IF(AND($E10=\"\",$C10=$B$4),1,0))","v":0},{"$f":"IF($C10=$B$5,F10,0)","v":0},{"$f":"(IF(AND($E10=\"\",$C10=$B$5),1,0))","v":0},{"$f":"IF($C10=$B$6,F10,0)","v":0},{"$f":"(IF(AND($E10=\"\",$C10=$B$6),1,0))","v":0},{"$f":"IF($C10=$B$7,F10,0)","v":0},{"$f":"(IF(AND($E10=\"\",$C10=$B$7),1,0))","v":0},{"$nulls":5},{"$f":"U10+V10+W10","v":{"v":0,"d":"0.0"}},{"$f":"IF(X10=D10,1,0)","v":0},{"$f":"IF(X10=0,0,1)","v":0},{"$f":"IF(Y10+Z10=2,\"Korrekt\",\"\")","v":""}]
[2,{"$f":"'Wettkampf 1'!B11","v":"Dirk Meyer"},{"$f":"'Wettkampf 1'!C11","v":"Spahnharrenstätte III"},311.9,null,{"$f":"IF(E11=\"x\",\"0\",D11)","v":311.9},{"$f":"IF(C11=$B$2,F11,0)","v":311.9},{"$f":"(IF(AND($E11=\"\",$C11=$B$2),1,0))","v":1},{"$f":"IF($C11=$B$3,F11,0)","v":0},{"$f":"(IF(AND($E11=\"\",$C11=$B$3),1,0))","v":0},{"$f":"IF($C11=$B$4,F11,0)","v":0},{"$f":"(IF(AND($E11=\"\",$C11=$B$4),1,0))","v":0},{"$f":"IF($C11=$B$5,F11,0)","v":0},{"$f":"(IF(AND($E11=\"\",$C11=$B$5),1,0))","v":0},{"$f":"IF($C11=$B$6,F11,0)","v":0},{"$f":"(IF(AND($E11=\"\",$C11=$B$6),1,0))","v":0},{"$f":"IF($C11=$B$7,F11,0)","v":0},{"$f":"(IF(AND($E11=\"\",$C11=$B$7),1,0))","v":0},{"$nulls":5},{"$f":"U11+V11+W11","v":{"v":0,"d":"0.0"}},{"$f":"IF(X11=D11,1,0)","v":0},{"$f":"IF(X11=0,0,1)","v":0},{"$f":"IF(Y11+Z11=2,\"Korrekt\",\"\")","v":""}]
[3,{"$f":"'Wettkampf 1'!B12","v":"Sebastian Albers"},{"$f":"'Wettkampf 1'!C12","v":"Spahnharrenstätte III"},304.7,null,304.7,304.7,1,0,0,0,0,0,0,0,0,0,0,{"$nulls":5},{"v":0,"d":"0.0"},0,0,""]
[4,{"$f":"'Wettkampf 1'!B13","v":"Achim Will"},{"$f":"'Wettkampf 1'!C13","v":"Spahnharrenstätte III"},313.7,null,313.7,313.7,1,0,0,0,0,0,0,0,0,0,0,{"$nulls":5},{"v":0,"d":"0.0"},0,0,""]
[5,{"$f":"'Wettkampf 1'!B14","v":"Christian Grönheim"},{"$f":"'Wettkampf 1'!C14","v":"Spahnharrenstätte III"},{"v":310,"d":"310.0"},null,{"v":310,"d":"310.0"},310,1,0,0,0,0,0,0,0,0,0,0,{"$nulls":5},{"v":0,"d":"0.0"},0,0,""]
[6,{"$f":"'Wettkampf 1'!B15","v":"Dieter Hanekamp"},{"$f":"'Wettkampf 1'!C15","v":"Spahnharrenstätte II"},310.7,null,310.7,0,0,0,0,0,0,0,0,310.7,1,0,0,{"$nulls":5},{"v":0,"d":"0.0"},0,0,""]
[7,{"$f":"'Wettkampf 1'!B16","v":"Josef Langen"},{"$f":"'Wettkampf 1'!C16","v":"Spahnharrenstätte II"},300.3,null,300.3,0,0,0,0,0,0,0,0,300.3,1,0,0,{"$nulls":5},{"v":0,"d":"0.0"},0,0,""]
[8,{"$f":"'Wettkampf 1'!B17","v":"Johannes Hülsmann"},{"$f":"'Wettkampf 1'!C17","v":"Spahnharrenstätte II"},308.8,null,308.8,0,0,0,0,0,0,0,0,308.8,1,0,0,{"$nulls":5},{"v":0,"d":"0.0"},0,0,""]
[9,{"$f":"'Wettkampf 1'!B18","v":"Heiner Kröger"},{"$f":"'Wettkampf 1'!C18","v":"Spahnharrenstätte II"},310.2,null,310.2,0,0,0,0,0,0,0,0,310.2,1,0,0,{"$nulls":5},{"v":0,"d":"0.0"},0,0,""]
[10,{"$f":"'Wettkampf 1'!B19","v":"Bernd Nortmann"},{"$f":"'Wettkampf 1'!C19","v":"Lahn V"},308.6,null,308.6,0,0,0,0,0,0,308.6,1,0,0,0,0,{"$nulls":5},{"v":0,"d":"0.0"},0,0,""]
[11,{"$f":"'Wettkampf 1'!B20","v":"Oliver Reinelt"},{"$f":"'Wettkampf 1'!C20","v":"Lahn V"},298.5,null,298.5,0,0,0,0,0,0,298.5,1,0,0,0,0,{"$nulls":5},{"v":0,"d":"0.0"},0,0,""]
[12,{"$f":"'Wettkampf 1'!B21","v":"Simon Schukenbrock"},{"$f":"'Wettkampf 1'!C21","v":"Lahn V"},308.2,null,308.2,0,0,0,0,0,0,308.2,1,0,0,0,0,{"$nulls":5},{"v":0,"d":"0.0"},0,0,""]
[13,{"$f":"'Wettkampf 1'!B22","v":"Michael Boje"},{"$f":"'Wettkampf 1'!C22","v":"Lahn V"},null,null,{"v":0,"d":"0.0"},0,0,0,0,0,0,0,1,0,0,0,0,{"$nulls":5},{"v":0,"d":"0.0"},1,0,""]
[14,{"$f":"'Wettkampf 1'!B23","v":"Ludger Hermes"},{"$f":"'Wettkampf 1'!C23","v":"Neubörger II"},308.2,null,308.2,0,0,0,0,308.2,1,0,0,0,0,0,0,{"$nulls":5},{"v":0,"d":"0.0"},0,0,""]
[15,{"$f":"'Wettkampf 1'!B24","v":"Rudi Fromme"},{"$f":"'Wettkampf 1'!C24","v":"Neubörger II"},302.3,null,302.3,0,0,0,0,302.3,1,0,0,0,0,0,0,{"$nulls":5},{"v":0,"d":"0.0"},0,0,""]
[16,{"$f":"'Wettkampf 1'!B25","v":"Alois Schmitz"},{"$f":"'Wettkampf 1'!C25","v":"Neubörger II"},311.8,null,311.8,0,0,0,0,311.8,1,0,0,0,0,0,0,{"$nulls":5},{"v":0,"d":"0.0"},0,0,""]
[17,{"$f":"'Wettkampf 1'!B26","v":"Ludwig Langen"},{"$f":"'Wettkampf 1'!C26","v":"Neubörger II"},{"v":308,"d":"308.0"},null,{"v":308,"d":"308.0"},0,0,0,0,308,1,0,0,0,0,0,0,{"$nulls":5},{"v":0,"d":"0.0"},0,0,""]
[18,{"$f":"'Wettkampf 1'!B27","v":"Rainer Wielenberg"},{"$f":"'Wettkampf 1'!C27","v":"Esterwegen II"},302.9,null,302.9,0,0,302.9,1,0,0,0,0,0,0,0,0,{"$nulls":5},{"v":0,"d":"0.0"},0,0,""]
[19,{"$f":"'Wettkampf 1'!B28","v":"Meik Sieger"},{"$f":"'Wettkampf 1'!C28","v":"Esterwegen II"},312.3,null,312.3,0,0,312.3,1,0,0,0,0,0,0,0,0,{"$nulls":5},{"v":0,"d":"0.0"},0,0,""]
[20,{"$f":"'Wettkampf 1'!B29","v":"Dennis Lindemann"},{"$f":"'Wettkampf 1'!C29","v":"Esterwegen II"},306.5,null,306.5,0,0,306.5,1,0,0,0,0,0,0,0,0,{"$nulls":5},{"v":0,"d":"0.0"},0,0,""]
[21,{"$f":"'Wettkampf 1'!B30","v":"Andreas Lindemann"},{"$f":"'Wettkampf 1'!C30","v":"Esterwegen II"},301.7,null,301.7,0,0,301.7,1,0,0,0,0,0,0,0,0,{"$nulls":5},{"v":0,"d":"0.0"},0,0,""]
[22,{"$f":"'Wettkampf 1'!B31","v":"Johannes Gebken"},{"$f":"'Wettkampf 1'!C31","v":"Esterwegen II"},null,"x","0",0,0,"0",0,0,0,0,0,0,0,0,0,{"$nulls":5},{"v":0,"d":"0.0"},1,0,""]
[23,{"$f":"'Wettkampf 1'!B32","v":"Jan-Niklas Lindemann"},{"$f":"'Wettkampf 1'!C32","v":"Esterwegen II"},null,"x","0",0,0,"0",0,0,0,0,0,0,0,0,0,{"$nulls":5},{"v":0,"d":"0.0"},1,0,""]
[24,{"$f":"'Wettkampf 1'!B33","v":"Stefan Burlager"},{"$f":"'Wettkampf 1'!C33","v":"Esterwegen II"},null,"x","0",0,0,"0",0,0,0,0,0,0,0,0,0,{"$nulls":5},{"v":0,"d":"0.0"},1,0,""]
[25,{"$f":"'Wettkampf 1'!B34","v":"Franz Ostermann"},{"$f":"'Wettkampf 1'!C34","v":"Eisten II "},300.2,null,300.2,0,0,0,0,0,0,0,0,0,0,300.2,1,{"$nulls":5},{"v":0,"d":"0.0"},0,0,""]
[26,{"$f":"'Wettkampf 1'!B35","v":"Martin Hackmann"},{"$f":"'Wettkampf 1'!C35","v":"Eisten II "},313.3,null,313.3,0,0,0,0,0,0,0,0,0,0,313.3,1,{"$nulls":5},{"v":0,"d":"0.0"},0,0,""]
[27,{"$f":"'Wettkampf 1'!B36","v":"Günther Baalmann"},{"$f":"'Wettkampf 1'!C36","v":"Eisten II "},313.7,null,313.7,0,0,0,0,0,0,0,0,0,0,313.7,1,{"$nulls":5},{"v":0,"d":"0.0"},0,0,""]
[28,{"$f":"'Wettkampf 1'!B37","v":"Martin Poker"},{"$f":"'Wettkampf 1'!C37","v":"Eisten II "},310.5,null,310.5,0,0,0,0,0,0,0,0,0,0,310.5,1,{"$nulls":5},{"v":0,"d":"0.0"},0,0,""]
[29,{"$f":"'Wettkampf 1'!B38","v":"Schütze 29"},{"$f":"'Wettkampf 1'!C38","v":{"v":0,"d":"0.0"}},null,"x","0",0,0,0,0,0,0,0,0,0,0,0,0,{"$nulls":5},{"v":0,"d":"0.0"},1,0,""]
[30,{"$f":"'Wettkampf 1'!B39","v":"Schütze 30"},{"$f":"'Wettkampf 1'!C39","v":{"v":0,"d":"0.0"}},null,"x","0",0,0,0,0,0,0,0,0,0,0,0,0,{"$nulls":5},{"v":0,"d":"0.0"},1,0,""]
[31,{"$f":"'Wettkampf 1'!B40","v":"Schütze 31"},{"$f":"'Wettkampf 1'!C40","v":{"v":0,"d":"0.0"}},null,null,{"v":0,"d":"0.0"},0,0,0,0,0,0,0,0,0,0,0,0,{"$nulls":5},{"v":0,"d":"0.0"},1,0,""]
[32,{"$f":"'Wettkampf 1'!B41","v":"Schütze 32"},{"$f":"'Wettkampf 1'!C41","v":{"v":0,"d":"0.0"}},null,null,{"v":0,"d":"0.0"},0,0,0,0,0,0,0,0,0,0,0,0,{"$nulls":5},{"v":0,"d":"0.0"},1,0,""]
[33,{"$f":"'Wettkampf 1'!B42","v":"Schütze 33"},{"$f":"'Wettkampf 1'!C42","v":{"v":0,"d":"0.0"}},null,null,{"v":0,"d":"0.0"},0,0,0,0,0,0,0,0,0,0,0,0,{"$nulls":5},{"v":0,"d":"0.0"},1,0,""]
[34,{"$f":"'Wettkampf 1'!B43","v":"Schütze 34"},{"$f":"'Wettkampf 1'!C43","v":{"v":0,"d":"0.0"}},null,null,{"v":0,"d":"0.0"},0,0,0,0,0,0,0,0,0,0,0,0,{"$nulls":5},{"v":0,"d":"0.0"},1,0,""]
[35,{"$f":"'Wettkampf 1'!B44","v":"Schütze 35"},{"$f":"'Wettkampf 1'!C44","v":{"v":0,"d":"0.0"}},null,"x","0",0,0,0,0,0,0,0,0,0,0,0,0,{"$nulls":5},{"v":0,"d":"0.0"},1,0,""]
[36,{"$f":"'Wettkampf 1'!B45","v":"Schütze 36"},{"$f":"'Wettkampf 1'!C45","v":{"v":0,"d":"0.0"}},null,"x","0",0,0,0,0,0,0,0,0,0,0,0,0,{"$nulls":5},{"v":0,"d":"0.0"},1,0,""]
[{"$nulls":6},{"$f":"LARGE(G10:G45,1)+LARGE(G10:G45,2)+LARGE(G10:G45,3)","v":935.5999999999999},{"$f":"SUM(H10:H45)","v":4},{"$f":"LARGE(I10:I45,1)+LARGE(I10:I45,2)+LARGE(I10:I45,3)","v":921.6999999999999},{"$f":"SUM(J10:J45)","v":4},{"$f":"LARGE(K10:K45,1)+LARGE(K10:K45,2)+LARGE(K10:K45,3)","v":928},{"$f":"SUM(L10:L45)","v":4},{"$f":"LARGE(M10:M45,1)+LARGE(M10:M45,2)+LARGE(M10:M45,3)","v":915.3},{"$f":"SUM(N10:N45)","v":4},{"$f":"LARGE(O10:O45,1)+LARGE(O10:O45,2)+LARGE(O10:O45,3)","v":929.7},{"$f":"SUM(P10:P45)","v":4},{"$f":"LARGE(Q10:Q45,1)+LARGE(Q10:Q45,2)+LARGE(Q10:Q45,3)","v":937.5},{"$f":"SUM(R10:S45)","v":4}]
[null,null,"per Email an: sk-huemmling@gmx.de"]

{"sheet":"5","index":5,"n_rows":47,"n_cols":27,"rows_kept":47,"merged":[[0,22,0,23],[1,22,1,23],[4,22,4,23],[5,22,5,23],[6,22,6,23],[8,20,8,23]]}
[null,"Verein / Gruppe",null,"Ergebnisse",{"$nulls":17},"Austragungsort:",{"$f":"Übersicht!H4","v":"Spahnharrenstätte"}]
[1,{"$f":"'Wettkampf 1'!B2","v":"Spahnharrenstätte III"},null,{"$f":"G46","v":{"v":937.5000000000001,"d":"937.5"}},{"$f":"IF(H46>4,\"Es sind zu viele Schützen in Wertung!\",\" \")","v":" "},{"$nulls":16},"Wettkampftag:",{"$f":"Übersicht!H3","v":"24.11."}]
[2,{"$f":"'Wettkampf 1'!B3","v":"Esterwegen II"},null,{"$f":"I46","v":925.4},{"$f":"IF(J46>4,\"Es sind zu viele Schützen in Wertung!\",\" \")","v":" "}]
[3,{"$f":"'Wettkampf 1'!B4","v":"Neubörger II"},null,{"$f":"K46","v":935.3},{"$f":"IF(L46>4,\"Es sind zu viele Schützen in Wertung!\",\" \")","v":" "},{"$nulls":18},"Ansprechpartner für Rückfragen:"]
[4,{"$f":"'Wettkampf 1'!B5","v":"Lahn V"},null,{"$f":"M46","v":925.3},{"$f":"IF(N46>4,\"Es sind zu viele Schützen in Wertung!\",\" \")","v":" "},{"$nulls":16},"Name:","Hülsmann"]
[5,{"$f":"'Wettkampf 1'!B6","v":"Spahnharrenstätte II"},null,{"$f":"O46","v":930.9},{"$f":"IF(P46>4,\"Es sind zu viele Schützen in Wertung!\",\" \")","v":" "},{"$nulls":16},"Tel:"]
[6,{"$f":"'Wettkampf 1'!B7","v":"Eisten II "},null,{"$f":"Q46","v":{"v":936.6999999999999,"d":"936.7"}},{"$f":"IF(R46>4,\"Es sind zu viele Schützen in Wertung!\",\" \")","v":" "},{"$nulls":16},"Standaufsicht:","Hülsmann"]
[]
[null,"Einzelergebnisse:","Verein / Gruppe","Ergebnisse (mindestens 0 eintragen)","AW? Dann x eintippen",null,"Verein 1",null,"Verein 2",null,"Verein 3",null,"Verein 4",null,"Verein 5",null,"Verein 6",{"$nulls":3},"Proberechnung bei Streifen:"]
[1,{"$f":"'Wettkampf 1'!B10","v":"Heiko Micksch"},{"$f":"'Wettkampf 1'!C10","v":"Spahnharrenstätte III"},304.3,"x",{"$f":"IF(E10=\"x\",\"0\",D10)","v":"0"},{"$f":"IF(C10=$B$2,F10,0)","v":"0"},{"$f":"(IF(AND($E10=\"\",$C10=$B$2),1,0))","v":0},{"$f":"IF($C10=$B$3,F10,0)","v":0},{"$f":"(IF(AND($E10=\"\",$C10=$B$3),1,0))","v":0},{"$f":"IF($C10=$B$4,F10,0)","v":0},{"$f":"(IF(AND($E10=\"\",$C10=$B$4),1,0))","v":0},{"$f":"IF($C10=$B$5,F10,0)","v":0},{"$f":"(IF(AND($E10=\"\",$C10=$B$5),1,0))","v":0},{"$f":"IF($C10=$B$6,F10,0)","v":0},{"$f":"(IF(AND($E10=\"\",$C10=$B$6),1,0))","v":0},{"$f":"IF($C10=$B$7,F10,0)","v":0},{"$f":"(IF(AND($E10=\"\",$C10=$B$7),1,0))","v":0},{"$nulls":5},{"$f":"U10+V10+W10","v":{"v":0,"d":"0.0"}},{"$f":"IF(X10=D10,1,0)","v":0},{"$f":"IF(X10=0,0,1)","v":0},{"$f":"IF(Y10+Z10=2,\"Korrekt\",\"\")","v":""}]
[2,{"$f":"'Wettkampf 1'!B11","v":"Dirk Meyer"},{"$f":"'Wettkampf 1'!C11","v":"Spahnharrenstätte III"},312.8,null,{"$f":"IF(E11=\"x\",\"0\",D11)","v":312.8},{"$f":"IF(C11=$B$2,F11,0)","v":312.8},{"$f":"(IF(AND($E11=\"\",$C11=$B$2),1,0))","v":1},{"$f":"IF($C11=$B$3,F11,0)","v":0},{"$f":"(IF(AND($E11=\"\",$C11=$B$3),1,0))","v":0},{"$f":"IF($C11=$B$4,F11,0)","v":0},{"$f":"(IF(AND($E11=\"\",$C11=$B$4),1,0))","v":0},{"$f":"IF($C11=$B$5,F11,0)","v":0},{"$f":"(IF(AND($E11=\"\",$C11=$B$5),1,0))","v":0},{"$f":"IF($C11=$B$6,F11,0)","v":0},{"$f":"(IF(AND($E11=\"\",$C11=$B$6),1,0))","v":0},{"$f":"IF($C11=$B$7,F11,0)","v":0},{"$f":"(IF(AND($E11=\"\",$C11=$B$7),1,0))","v":0},{"$nulls":5},{"$f":"U11+V11+W11","v":{"v":0,"d":"0.0"}},{"$f":"IF(X11=D11,1,0)","v":0},{"$f":"IF(X11=0,0,1)","v":0},{"$f":"IF(Y11+Z11=2,\"Korrekt\",\"\")","v":""}]
[3,{"$f":"'Wettkampf 1'!B12","v":"Sebastian Albers"},{"$f":"'Wettkampf 1'!C12","v":"Spahnharrenstätte III"},305.7,null,305.7,305.7,1,0,0,0,0,0,0,0,0,0,0,{"$nulls":5},{"v":0,"d":"0.0"},0,0,""]
[4,{"$f":"'Wettkampf 1'!B13","v":"Achim Will"},{"$f":"'Wettkampf 1'!C13","v":"Spahnharrenstätte III"},315.1,null,315.1,315.1,1,0,0,0,0,0,0,0,0,0,0,{"$nulls":5},{"v":0,"d":"0.0"},0,0,""]
[5,{"$f":"'Wettkampf 1'!B14","v":"Christian Grönheim"},{"$f":"'Wettkampf 1'!C14","v":"Spahnharrenstätte III"},309.6,null,309.6,309.6,1,0,0,0,0,0,0,0,0,0,0,{"$nulls":5},{"v":0,"d":"0.0"},0,0,""]
[6,{"$f":"'Wettkampf 1'!B15","v":"Dieter Hanekamp"},{"$f":"'Wettkampf 1'!C15","v":"Spahnharrenstätte II"},{"v":312,"d":"312.0"},null,{"v":312,"d":"312.0"},0,0,0,0,0,0,0,0,312,1,0,0,{"$nulls":5},{"v":0,"d":"0.0"},0,0,""]
[7,{"$f":"'Wettkampf 1'!B16","v":"Josef Langen"},{"$f":"'Wettkampf 1'!C16","v":"Spahnharrenstätte II"},302.2,null,302.2,0,0,0,0,0,0,0,0,302.2,1,0,0,{"$nulls":5},{"v":0,"d":"0.0"},0,0,""]
[8,{"$f":"'Wettkampf 1'!B17","v":"Johannes Hülsmann"},{"$f":"'Wettkampf 1'!C17","v":"Spahnharrenstätte II"},{"v":312,"d":"312.0"},null,{"v":312,"d":"312.0"},0,0,0,0,0,0,0,0,312,1,0,0,{"$nulls":5},{"v":0,"d":"0.0"},0,0,""]
[9,{"$f":"'Wettkampf 1'!B18","v":"Heiner Kröger"},{"$f":"'Wettkampf 1'!C18","v":"Spahnharrenstätte II"},306.9,null,306.9,0,0,0,0,0,0,0,0,306.9,1,0,0,{"$nulls":5},{"v":0,"d":"0.0"},0,0,""]
[10,{"$f":"'Wettkampf 1'!B19","v":"Bernd Nortmann"},{"$f":"'Wettkampf 1'!C19","v":"Lahn V"},309.7,null,309.7,0,0,0,0,0,0,309.7,1,0,0,0,0,{"$nulls":5},{"v":0,"d":"0.0"},0,0,""]
[11,{"$f":"'Wettkampf 1'!B20","v":"Oliver Reinelt"},{"$f":"'Wettkampf 1'!C20","v":"Lahn V"},303.3,null,303.3,0,0,0,0,0,0,303.3,1,0,0,0,0,{"$nulls":5},{"v":0,"d":"0.0"},0,0,""]
[12,{"$f":"'Wettkampf 1'!B21","v":"Simon Schukenbrock"},{"$f":"'Wettkampf 1'!C21","v":"Lahn V"},312.3,null,312.3,0,0,0,0,0,0,312.3,1,0,0,0,0,{"$nulls":5},{"v":0,"d":"0.0"},0,0,""]
[13,{"$f":"'Wettkampf 1'!B22","v":"Michael Boje"},{"$f":"'Wettkampf 1'!C22","v":"Lahn V"},null,null,{"v":0,"d":"0.0"},0,0,0,0,0,0,0,1,0,0,0,0,{"$nulls":5},{"v":0,"d":"0.0"},1,0,""]
[14,{"$f":"'Wettkampf 1'!B23","v":"Ludger Hermes"},{"$f":"'Wettkampf 1'!C23","v":"Neubörger II"},309.9,null,309.9,0,0,0,0,309.9,1,0,0,0,0,0,0,{"$nulls":5},{"v":0,"d":"0.0"},0,0,""]
[15,{"$f":"'Wettkampf 1'!B24","v":"Rudi Fromme"},{"$f":"'Wettkampf 1'!C24","v":"Neubörger II"},301.4,null,301.4,0,0,0,0,301.4,1,0,0,0,0,0,0,{"$nulls":5},{"v":0,"d":"0.0"},0,0,""]
[16,{"$f":"'Wettkampf 1'!B25","v":"Alois Schmitz"},{"$f":"'Wettkampf 1'!C25","v":"Neubörger II"},313.2,null,313.2,0,0,0,0,313.2,1,0,0,0,0,0,0,{"$nulls":5},{"v":0,"d":"0.0"},0,0,""]
[17,{"$f":"'Wettkampf 1'!B26","v":"Ludwig Langen"},{"$f":"'Wettkampf 1'!C26","v":"Neubörger II"},312.2,null,312.2,0,0,0,0,312.2,1,0,0,0,0,0,0,{"$nulls":5},{"v":0,"d":"0.0"},0,0,""]
[18,{"$f":"'Wettkampf 1'!B27","v":"Rainer Wielenberg"},{"$f":"'Wettkampf 1'!C27","v":"Esterwegen II"},302.9,null,302.9,0,0,302.9,1,0,0,0,0,0,0,0,0,{"$nulls":5},{"v":0,"d":"0.0"},0,0,""]
[19,{"$f":"'Wettkampf 1'!B28","v":"Meik Sieger"},{"$f":"'Wettkampf 1'!C28","v":"Esterwegen II"},{"v":311,"d":"311.0"},null,{"v":311,"d":"311.0"},0,0,311,1,0,0,0,0,0,0,0,0,{"$nulls":5},{"v":0,"d":"0.0"},0,0,""]
[20,{"$f":"'Wettkampf 1'!B29","v":"Dennis Lindemann"},{"$f":"'Wettkampf 1'!C29","v":"Esterwegen II"},311.5,null,311.5,0,0,311.5,1,0,0,0,0,0,0,0,0,{"$nulls":5},{"v":0,"d":"0.0"},0,0,""]
[21,{"$f":"'Wettkampf 1'!B30","v":"Andreas Lindemann"},{"$f":"'Wettkampf 1'!C30","v":"Esterwegen II"},282.1,null,282.1,0,0,282.1,1,0,0,0,0,0,0,0,0,{"$nulls":5},{"v":0,"d":"0.0"},0,0,""]
[22,{"$f":"'Wettkampf 1'!B31","v":"Johannes Gebken"},{"$f":"'Wettkampf 1'!C31","v":"Esterwegen II"},null,"x","0",0,0,"0",0,0,0,0,0,0,0,0,0,{"$nulls":5},{"v":0,"d":"0.0"},1,0,""]
[23,{"$f":"'Wettkampf 1'!B32","v":"Jan-Niklas Lindemann"},{"$f":"'Wettkampf 1'!C32","v":"Esterwegen II"},null,"x","0",0,0,"0",0,0,0,0,0,0,0,0,0,{"$nulls":5},{"v":0,"d":"0.0"},1,0,""]
[24,{"$f":"'Wettkampf 1'!B33","v":"Stefan Burlager"},{"$f":"'Wettkampf 1'!C33","v":"Esterwegen II"},306.5,"x","0",0,0,"0",0,0,0,0,0,0,0,0,0,{"$nulls":5},{"v":0,"d":"0.0"},0,0,""]
[25,{"$f":"'Wettkampf 1'!B34","v":"Franz Ostermann"},{"$f":"'Wettkampf 1'!C34","v":"Eisten II "},310.3,null,310.3,0,0,0,0,0,0,0,0,0,0,310.3,1,{"$nulls":5},{"v":0,"d":"0.0"},0,0,""]
[26,{"$f":"'Wettkampf 1'!B35","v":"Martin Hackmann"},{"$f":"'Wettkampf 1'!C35","v":"Eisten II "},{"v":313,"d":"313.0"},null,{"v":313,"d":"313.0"},0,0,0,0,0,0,0,0,0,0,313,1,{"$nulls":5},{"v":0,"d":"0.0"},0,0,""]
[27,{"$f":"'Wettkampf 1'!B36","v":"Günther Baalmann"},{"$f":"'Wettkampf 1'!C36","v":"Eisten II "},312.8,null,312.8,0,0,0,0,0,0,0,0,0,0,312.8,1,{"$nulls":5},{"v":0,"d":"0.0"},0,0,""]
[28,{"$f":"'Wettkampf 1'!B37","v":"Martin Poker"},{"$f":"'Wettkampf 1'!C37","v":"Eisten II "},310.9,null,310.9,0,0,0,0,0,0,0,0,0,0,310.9,1,{"$nulls":5},{"v":0,"d":"0.0"},0,0,""]
[29,{"$f":"'Wettkampf 1'!B38","v":"Schütze 29"},{"$f":"'Wettkampf 1'!C38","v":{"v":0,"d":"0.0"}},null,"x","0",0,0,0,0,0,0,0,0,0,0,0,0,{"$nulls":5},{"v":0,"d":"0.0"},1,0,""]
[30,{"$f":"'Wettkampf 1'!B39","v":"Schütze 30"},{"$f":"'Wettkampf 1'!C39","v":{"v":0,"d":"0.0"}},null,"x","0",0,0,0,0,0,0,0,0,0,0,0,0,{"$nulls":5},{"v":0,"d":"0.0"},1,0,""]
[31,{"$f":"'Wettkampf 1'!B40","v":"Schütze 31"},{"$f":"'Wettkampf 1'!C40","v":{"v":0,"d":"0.0"}},null,null,{"v":0,"d":"0.0"},0,0,0,0,0,0,0,0,0,0,0,0,{"$nulls":5},{"v":0,"d":"0.0"},1,0,""]
[32,{"$f":"'Wettkampf 1'!B41","v":"Schütze 32"},{"$f":"'Wettkampf 1'!C41","v":{"v":0,"d":"0.0"}},null,null,{"v":0,"d":"0.0"},0,0,0,0,0,0,0,0,0,0,0,0,{"$nulls":5},{"v":0,"d":"0.0"},1,0,""]
[33,{"$f":"'Wettkampf 1'!B42","v":"Schütze 33"},{"$f":"'Wettkampf 1'!C42","v":{"v":0,"d":"0.0"}},null,null,{"v":0,"d":"0.0"},0,0,0,0,0,0,0,0,0,0,0,0,{"$nulls":5},{"v":0,"d":"0.0"},1,0,""]
[34,{"$f":"'Wettkampf 1'!B43","v":"Schütze 34"},{"$f":"'Wettkampf 1'!C43","v":{"v":0,"d":"0.0"}},null,null,{"v":0,"d":"0.0"},0,0,0,0,0,0,0,0,0,0,0,0,{"$nulls":5},{"v":0,"d":"0.0"},1,0,""]
[35,{"$f":"'Wettkampf 1'!B44","v":"Schütze 35"},{"$f":"'Wettkampf 1'!C44","v":{"v":0,"d":"0.0"}},null,"x","0",0,0,0,0,0,0,0,0,0,0,0,0,{"$nulls":5},{"v":0,"d":"0.0"},1,0,""]
[36,{"$f":"'Wettkampf 1'!B45","v":"Schütze 36"},{"$f":"'Wettkampf 1'!C45","v":{"v":0,"d":"0.0"}},null,"x","0",0,0,0,0,0,0,0,0,0,0,0,0,{"$nulls":5},{"v":0,"d":"0.0"},1,0,""]
[{"$nulls":6},{"$f":"LARGE(G10:G45,1)+LARGE(G10:G45,2)+LARGE(G10:G45,3)","v":937.5000000000001},{"$f":"SUM(H10:H45)","v":4},{"$f":"LARGE(I10:I45,1)+LARGE(I10:I45,2)+LARGE(I10:I45,3)","v":925.4},{"$f":"SUM(J10:J45)","v":4},{"$f":"LARGE(K10:K45,1)+LARGE(K10:K45,2)+LARGE(K10:K45,3)","v":935.3},{"$f":"SUM(L10:L45)","v":4},{"$f":"LARGE(M10:M45,1)+LARGE(M10:M45,2)+LARGE(M10:M45,3)","v":925.3},{"$f":"SUM(N10:N45)","v":4},{"$f":"LARGE(O10:O45,1)+LARGE(O10:O45,2)+LARGE(O10:O45,3)","v":930.9},{"$f":"SUM(P10:P45)","v":4},{"$f":"LARGE(Q10:Q45,1)+LARGE(Q10:Q45,2)+LARGE(Q10:Q45,3)","v":936.6999999999999},{"$f":"SUM(R10:S45)","v":4}]
[null,null,"per Email an: sk-huemmling@gmx.de"]

{"sheet":"6","index":6,"n_rows":47,"n_cols":27,"rows_kept":47,"merged":[[0,22,0,23],[1,22,1,23],[4,22,4,23],[5,22,5,23],[6,22,6,23],[8,20,8,23]]}
[null,"Verein / Gruppe",null,"Ergebnisse",{"$nulls":17},"Austragungsort:",{"$f":"Übersicht!I4","v":"Eisten"}]
[1,{"$f":"'Wettkampf 1'!B2","v":"Spahnharrenstätte III"},null,{"$f":"G46","v":927.2},{"$f":"IF(H46>4,\"Es sind zu viele Schützen in Wertung!\",\" \")","v":" "},{"$nulls":16},"Wettkampftag:",{"$f":"Übersicht!I3","v":"08.12."}]
[2,{"$f":"'Wettkampf 1'!B3","v":"Esterwegen II"},null,{"$f":"I46","v":925.8},{"$f":"IF(J46>4,\"Es sind zu viele Schützen in Wertung!\",\" \")","v":" "}]
[3,{"$f":"'Wettkampf 1'!B4","v":"Neubörger II"},null,{"$f":"K46","v":918.9},{"$f":"IF(L46>4,\"Es sind zu viele Schützen in Wertung!\",\" \")","v":" "},{"$nulls":18},"Ansprechpartner für Rückfragen:"]
[4,{"$f":"'Wettkampf 1'!B5","v":"Lahn V"},null,{"$f":"M46","v":910.4},{"$f":"IF(N46>4,\"Es sind zu viele Schützen in Wertung!\",\" \")","v":" "},{"$nulls":16},"Name:","Baalmann Günter"]
[5,{"$f":"'Wettkampf 1'!B6","v":"Spahnharrenstätte II"},null,{"$f":"O46","v":934.5},{"$f":"IF(P46>4,\"Es sind zu viele Schützen in Wertung!\",\" \")","v":" "},{"$nulls":16},"Tel:","05952-3748"]
[6,{"$f":"'Wettkampf 1'!B7","v":"Eisten II "},null,{"$f":"Q46","v":935.4},{"$f":"IF(R46>4,\"Es sind zu viele Schützen in Wertung!\",\" \")","v":" "},{"$nulls":16},"Standaufsicht:","Ostermann Franz"]
[]
[null,"Einzelergebnisse:","Verein / Gruppe","Ergebnisse (mindestens 0 eintragen)","AW? Dann x eintippen",null,"Verein 1",null,"Verein 2",null,"Verein 3",null,"Verein 4",null,"Verein 5",null,"Verein 6",{"$nulls":3},"Proberechnung bei Streifen:"]
[1,{"$f":"'Wettkampf 1'!B10","v":"Heiko Micksch"},{"$f":"'Wettkampf 1'!C10","v":"Spahnharrenstätte III"},306.5,null,{"$f":"IF(E10=\"x\",\"0\",D10)","v":306.5},{"$f":"IF(C10=$B$2,F10,0)","v":306.5},{"$f":"(IF(AND($E10=\"\",$C10=$B$2),1,0))","v":1},{"$f":"IF($C10=$B$3,F10,0)","v":0},{"$f":"(IF(AND($E10=\"\",$C10=$B$3),1,0))","v":0},{"$f":"IF($C10=$B$4,F10,0)","v":0},{"$f":"(IF(AND($E10=\"\",$C10=$B$4),1,0))","v":0},{"$f":"IF($C10=$B$5,F10,0)","v":0},{"$f":"(IF(AND($E10=\"\",$C10=$B$5),1,0))","v":0},{"$f":"IF($C10=$B$6,F10,0)","v":0},{"$f":"(IF(AND($E10=\"\",$C10=$B$6),1,0))","v":0},{"$f":"IF($C10=$B$7,F10,0)","v":0},{"$f":"(IF(AND($E10=\"\",$C10=$B$7),1,0))","v":0},{"$nulls":5},{"$f":"U10+V10+W10","v":{"v":0,"d":"0.0"}},{"$f":"IF(X10=D10,1,0)","v":0},{"$f":"IF(X10=0,0,1)","v":0},{"$f":"IF(Y10+Z10=2,\"Korrekt\",\"\")","v":""}]
[2,{"$f":"'Wettkampf 1'!B11","v":"Dirk Meyer"},{"$f":"'Wettkampf 1'!C11","v":"Spahnharrenstätte III"},312.3,null,{"$f":"IF(E11=\"x\",\"0\",D11)","v":312.3},{"$f":"IF(C11=$B$2,F11,0)","v":312.3},{"$f":"(IF(AND($E11=\"\",$C11=$B$2),1,0))","v":1},{"$f":"IF($C11=$B$3,F11,0)","v":0},{"$f":"(IF(AND($E11=\"\",$C11=$B$3),1,0))","v":0},{"$f":"IF($C11=$B$4,F11,0)","v":0},{"$f":"(IF(AND($E11=\"\",$C11=$B$4),1,0))","v":0},{"$f":"IF($C11=$B$5,F11,0)","v":0},{"$f":"(IF(AND($E11=\"\",$C11=$B$5),1,0))","v":0},{"$f":"IF($C11=$B$6,F11,0)","v":0},{"$f":"(IF(AND($E11=\"\",$C11=$B$6),1,0))","v":0},{"$f":"IF($C11=$B$7,F11,0)","v":0},{"$f":"(IF(AND($E11=\"\",$C11=$B$7),1,0))","v":0},{"$nulls":5},{"$f":"U11+V11+W11","v":{"v":0,"d":"0.0"}},{"$f":"IF(X11=D11,1,0)","v":0},{"$f":"IF(X11=0,0,1)","v":0},{"$f":"IF(Y11+Z11=2,\"Korrekt\",\"\")","v":""}]
[3,{"$f":"'Wettkampf 1'!B12","v":"Sebastian Albers"},{"$f":"'Wettkampf 1'!C12","v":"Spahnharrenstätte III"},307.4,"x","0","0",0,0,0,0,0,0,0,0,0,0,0,{"$nulls":5},{"v":0,"d":"0.0"},0,0,""]
[4,{"$f":"'Wettkampf 1'!B13","v":"Achim Will"},{"$f":"'Wettkampf 1'!C13","v":"Spahnharrenstätte III"},308.4,null,308.4,308.4,1,0,0,0,0,0,0,0,0,0,0,{"$nulls":5},{"v":0,"d":"0.0"},0,0,""]
[5,{"$f":"'Wettkampf 1'!B14","v":"Christian Grönheim"},{"$f":"'Wettkampf 1'!C14","v":"Spahnharrenstätte III"},302.6,null,302.6,302.6,1,0,0,0,0,0,0,0,0,0,0,{"$nulls":5},{"v":0,"d":"0.0"},0,0,""]
[6,{"$f":"'Wettkampf 1'!B15","v":"Dieter Hanekamp"},{"$f":"'Wettkampf 1'!C15","v":"Spahnharrenstätte II"},313.7,null,313.7,0,0,0,0,0,0,0,0,313.7,1,0,0,{"$nulls":5},{"v":0,"d":"0.0"},0,0,""]
[7,{"$f":"'Wettkampf 1'!B16","v":"Josef Langen"},{"$f":"'Wettkampf 1'!C16","v":"Spahnharrenstätte II"},308.2,null,308.2,0,0,0,0,0,0,0,0,308.2,1,0,0,{"$nulls":5},{"v":0,"d":"0.0"},0,0,""]
[8,{"$f":"'Wettkampf 1'!B17","v":"Johannes Hülsmann"},{"$f":"'Wettkampf 1'!C17","v":"Spahnharrenstätte II"},311.5,null,311.5,0,0,0,0,0,0,0,0,311.5,1,0,0,{"$nulls":5},{"v":0,"d":"0.0"},0,0,""]
[9,{"$f":"'Wettkampf 1'!B18","v":"Heiner Kröger"},{"$f":"'Wettkampf 1'!C18","v":"Spahnharrenstätte II"},309.3,null,309.3,0,0,0,0,0,0,0,0,309.3,1,0,0,{"$nulls":5},{"v":0,"d":"0.0"},0,0,""]
[10,{"$f":"'Wettkampf 1'!B19","v":"Bernd Nortmann"},{"$f":"'Wettkampf 1'!C19","v":"Lahn V"},{"v":306,"d":"306.0"},null,{"v":306,"d":"306.0"},0,0,0,0,0,0,306,1,0,0,0,0,{"$nulls":5},{"v":0,"d":"0.0"},0,0,""]
[11,{"$f":"'Wettkampf 1'!B20","v":"Oliver Reinelt"},{"$f":"'Wettkampf 1'!C20","v":"Lahn V"},294.5,null,294.5,0,0,0,0,0,0,294.5,1,0,0,0,0,{"$nulls":5},{"v":0,"d":"0.0"},0,0,""]
[12,{"$f":"'Wettkampf 1'!B21","v":"Simon Schukenbrock"},{"$f":"'Wettkampf 1'!C21","v":"Lahn V"},309.9,null,309.9,0,0,0,0,0,0,309.9,1,0,0,0,0,{"$nulls":5},{"v":0,"d":"0.0"},0,0,""]
[13,{"$f":"'Wettkampf 1'!B22","v":"Michael Boje"},{"$f":"'Wettkampf 1'!C22","v":"Lahn V"},null,null,{"v":0,"d":"0.0"},0,0,0,0,0,0,0,1,0,0,0,0,{"$nulls":5},{"v":0,"d":"0.0"},1,0,""]
[14,{"$f":"'Wettkampf 1'!B23","v":"Ludger Hermes"},{"$f":"'Wettkampf 1'!C23","v":"Neubörger II"},301.6,null,301.6,0,0,0,0,301.6,1,0,0,0,0,0,0,{"$nulls":5},{"v":0,"d":"0.0"},0,0,""]
[15,{"$f":"'Wettkampf 1'!B24","v":"Rudi Fromme"},{"$f":"'Wettkampf 1'!C24","v":"Neubörger II"},305.4,null,305.4,0,0,0,0,305.4,1,0,0,0,0,0,0,{"$nulls":5},{"v":0,"d":"0.0"},0,0,""]
[16,{"$f":"'Wettkampf 1'!B25","v":"Alois Schmitz"},{"$f":"'Wettkampf 1'!C25","v":"Neubörger II"},305.6,null,305.6,0,0,0,0,305.6,1,0,0,0,0,0,0,{"$nulls":5},{"v":0,"d":"0.0"},0,0,""]
[17,{"$f":"'Wettkampf 1'!B26","v":"Ludwig Langen"},{"$f":"'Wettkampf 1'!C26","v":"Neubörger II"},307.9,null,307.9,0,0,0,0,307.9,1,0,0,0,0,0,0,{"$nulls":5},{"v":0,"d":"0.0"},0,0,""]
[18,{"$f":"'Wettkampf 1'!B27","v":"Rainer Wielenberg"},{"$f":"'Wettkampf 1'!C27","v":"Esterwegen II"},299.6,null,299.6,0,0,299.6,1,0,0,0,0,0,0,0,0,{"$nulls":5},{"v":0,"d":"0.0"},0,0,""]
[19,{"$f":"'Wettkampf 1'!B28","v":"Meik Sieger"},{"$f":"'Wettkampf 1'!C28","v":"Esterwegen II"},306.5,null,306.5,0,0,306.5,1,0,0,0,0,0,0,0,0,{"$nulls":5},{"v":0,"d":"0.0"},0,0,""]
[20,{"$f":"'Wettkampf 1'!B29","v":"Dennis Lindemann"},{"$f":"'Wettkampf 1'!C29","v":"Esterwegen II"},308.9,null,308.9,0,0,308.9,1,0,0,0,0,0,0,0,0,{"$nulls":5},{"v":0,"d":"0.0"},0,0,""]
[21,{"$f":"'Wettkampf 1'!B30","v":"Andreas Lindemann"},{"$f":"'Wettkampf 1'!C30","v":"Esterwegen II"},304.9,"x","0",0,0,"0",0,0,0,0,0,0,0,0,0,{"$nulls":5},{"v":0,"d":"0.0"},0,0,""]
[22,{"$f":"'Wettkampf 1'!B31","v":"Johannes Gebken"},{"$f":"'Wettkampf 1'!C31","v":"Esterwegen II"},null,"x","0",0,0,"0",0,0,0,0,0,0,0,0,0,{"$nulls":5},{"v":0,"d":"0.0"},1,0,""]
[23,{"$f":"'Wettkampf 1'!B32","v":"Jan-Niklas Lindemann"},{"$f":"'Wettkampf 1'!C32","v":"Esterwegen II"},null,"x","0",0,0,"0",0,0,0,0,0,0,0,0,0,{"$nulls":5},{"v":0,"d":"0.0"},1,0,""]
[24,{"$f":"'Wettkampf 1'!B33","v":"Stefan Burlager"},{"$f":"'Wettkampf 1'!C33","v":"Esterwegen II"},310.4,null,310.4,0,0,310.4,1,0,0,0,0,0,0,0,0,{"$nulls":5},{"v":0,"d":"0.0"},0,0,""]
[25,{"$f":"'Wettkampf 1'!B34","v":"Franz Ostermann"},{"$f":"'Wettkampf 1'!C34","v":"Eisten II "},312.2,null,312.2,0,0,0,0,0,0,0,0,0,0,312.2,1,{"$nulls":5},{"v":0,"d":"0.0"},0,0,""]
[26,{"$f":"'Wettkampf 1'!B35","v":"Martin Hackmann"},{"$f":"'Wettkampf 1'!C35","v":"Eisten II "},311.1,null,311.1,0,0,0,0,0,0,0,0,0,0,311.1,1,{"$nulls":5},{"v":0,"d":"0.0"},0,0,""]
[27,{"$f":"'Wettkampf 1'!B36","v":"Günther Baalmann"},{"$f":"'Wettkampf 1'!C36","v":"Eisten II "},311.4,null,311.4,0,0,0,0,0,0,0,0,0,0,311.4,1,{"$nulls":5},{"v":0,"d":"0.0"},0,0,""]
[28,{"$f":"'Wettkampf 1'!B37","v":"Martin Poker"},{"$f":"'Wettkampf 1'!C37","v":"Eisten II "},311.8,null,311.8,0,0,0,0,0,0,0,0,0,0,311.8,1,{"$nulls":5},{"v":0,"d":"0.0"},0,0,""]
[29,{"$f":"'Wettkampf 1'!B38","v":"Schütze 29"},{"$f":"'Wettkampf 1'!C38","v":{"v":0,"d":"0.0"}},null,"x","0",0,0,0,0,0,0,0,0,0,0,0,0,{"$nulls":5},{"v":0,"d":"0.0"},1,0,""]
[30,{"$f":"'Wettkampf 1'!B39","v":"Schütze 30"},{"$f":"'Wettkampf 1'!C39","v":{"v":0,"d":"0.0"}},null,"x","0",0,0,0,0,0,0,0,0,0,0,0,0,{"$nulls":5},{"v":0,"d":"0.0"},1,0,""]
[31,{"$f":"'Wettkampf 1'!B40","v":"Schütze 31"},{"$f":"'Wettkampf 1'!C40","v":{"v":0,"d":"0.0"}},null,null,{"v":0,"d":"0.0"},0,0,0,0,0,0,0,0,0,0,0,0,{"$nulls":5},{"v":0,"d":"0.0"},1,0,""]
[32,{"$f":"'Wettkampf 1'!B41","v":"Schütze 32"},{"$f":"'Wettkampf 1'!C41","v":{"v":0,"d":"0.0"}},null,null,{"v":0,"d":"0.0"},0,0,0,0,0,0,0,0,0,0,0,0,{"$nulls":5},{"v":0,"d":"0.0"},1,0,""]
[33,{"$f":"'Wettkampf 1'!B42","v":"Schütze 33"},{"$f":"'Wettkampf 1'!C42","v":{"v":0,"d":"0.0"}},null,null,{"v":0,"d":"0.0"},0,0,0,0,0,0,0,0,0,0,0,0,{"$nulls":5},{"v":0,"d":"0.0"},1,0,""]
[34,{"$f":"'Wettkampf 1'!B43","v":"Schütze 34"},{"$f":"'Wettkampf 1'!C43","v":{"v":0,"d":"0.0"}},null,null,{"v":0,"d":"0.0"},0,0,0,0,0,0,0,0,0,0,0,0,{"$nulls":5},{"v":0,"d":"0.0"},1,0,""]
[35,{"$f":"'Wettkampf 1'!B44","v":"Schütze 35"},{"$f":"'Wettkampf 1'!C44","v":{"v":0,"d":"0.0"}},null,"x","0",0,0,0,0,0,0,0,0,0,0,0,0,{"$nulls":5},{"v":0,"d":"0.0"},1,0,""]
[36,{"$f":"'Wettkampf 1'!B45","v":"Schütze 36"},{"$f":"'Wettkampf 1'!C45","v":{"v":0,"d":"0.0"}},null,"x","0",0,0,0,0,0,0,0,0,0,0,0,0,{"$nulls":5},{"v":0,"d":"0.0"},1,0,""]
[{"$nulls":6},{"$f":"LARGE(G10:G45,1)+LARGE(G10:G45,2)+LARGE(G10:G45,3)","v":927.2},{"$f":"SUM(H10:H45)","v":4},{"$f":"LARGE(I10:I45,1)+LARGE(I10:I45,2)+LARGE(I10:I45,3)","v":925.8},{"$f":"SUM(J10:J45)","v":4},{"$f":"LARGE(K10:K45,1)+LARGE(K10:K45,2)+LARGE(K10:K45,3)","v":918.9},{"$f":"SUM(L10:L45)","v":4},{"$f":"LARGE(M10:M45,1)+LARGE(M10:M45,2)+LARGE(M10:M45,3)","v":910.4},{"$f":"SUM(N10:N45)","v":4},{"$f":"LARGE(O10:O45,1)+LARGE(O10:O45,2)+LARGE(O10:O45,3)","v":934.5},{"$f":"SUM(P10:P45)","v":4},{"$f":"LARGE(Q10:Q45,1)+LARGE(Q10:Q45,2)+LARGE(Q10:Q45,3)","v":935.4},{"$f":"SUM(R10:S45)","v":4}]
[null,null,"per Email an: sk-huemmling@gmx.de"]

{"sheet":"7","index":7,"n_rows":47,"n_cols":27,"rows_kept":47,"merged":[[0,22,0,23],[1,22,1,23],[4,22,4,23],[5,22,5,23],[6,22,6,23],[8,20,8,23]]}
[null,"Verein / Gruppe",null,"Ergebnisse",{"$nulls":17},"Austragungsort:",{"$f":"Übersicht!L4","v":"Neubörger"}]
[1,{"$f":"'Wettkampf 1'!B2","v":"Spahnharrenstätte III"},null,{"$f":"G46","v":921.1},{"$f":"IF(H46>4,\"Es sind zu viele Schützen in Wertung!\",\" \")","v":" "},{"$nulls":16},"Wettkampftag:",{"$f":"Übersicht!L3","v":"19.01."}]
[2,{"$f":"'Wettkampf 1'!B3","v":"Esterwegen II"},null,{"$f":"I46","v":926.1},{"$f":"IF(J46>4,\"Es sind zu viele Schützen in Wertung!\",\" \")","v":" "}]
[3,{"$f":"'Wettkampf 1'!B4","v":"Neubörger II"},null,{"$f":"K46","v":921.3},{"$f":"IF(L46>4,\"Es sind zu viele Schützen in Wertung!\",\" \")","v":" "},{"$nulls":18},"Ansprechpartner für Rückfragen:"]
[4,{"$f":"'Wettkampf 1'!B5","v":"Lahn V"},null,{"$f":"M46","v":{"v":915.6999999999999,"d":"915.7"}},{"$f":"IF(N46>4,\"Es sind zu viele Schützen in Wertung!\",\" \")","v":" "},{"$nulls":16},"Name:","Alois Schmitz"]
[5,{"$f":"'Wettkampf 1'!B6","v":"Spahnharrenstätte II"},null,{"$f":"O46","v":{"v":931.9000000000001,"d":"931.9"}},{"$f":"IF(P46>4,\"Es sind zu viele Schützen in Wertung!\",\" \")","v":" "},{"$nulls":16},"Tel:"]
[6,{"$f":"'Wettkampf 1'!B7","v":"Eisten II "},null,{"$f":"Q46","v":935.4},{"$f":"IF(R46>4,\"Es sind zu viele Schützen in Wertung!\",\" \")","v":" "},{"$nulls":16},"Standaufsicht:","Ludwig Langen"]
[]
[null,"Einzelergebnisse:","Verein / Gruppe","Ergebnisse (mindestens 0 eintragen)","AW? Dann x eintippen",null,"Verein 1",null,"Verein 2",null,"Verein 3",null,"Verein 4",null,"Verein 5",null,"Verein 6",{"$nulls":3},"Proberechnung bei Streifen:"]
[1,{"$f":"'Wettkampf 1'!B10","v":"Heiko Micksch"},{"$f":"'Wettkampf 1'!C10","v":"Spahnharrenstätte III"},303.6,null,{"$f":"IF(E10=\"x\",\"0\",D10)","v":303.6},{"$f":"IF(C10=$B$2,F10,0)","v":303.6},{"$f":"(IF(AND($E10=\"\",$C10=$B$2),1,0))","v":1},{"$f":"IF($C10=$B$3,F10,0)","v":0},{"$f":"(IF(AND($E10=\"\",$C10=$B$3),1,0))","v":0},{"$f":"IF($C10=$B$4,F10,0)","v":0},{"$f":"(IF(AND($E10=\"\",$C10=$B$4),1,0))","v":0},{"$f":"IF($C10=$B$5,F10,0)","v":0},{"$f":"(IF(AND($E10=\"\",$C10=$B$5),1,0))","v":0},{"$f":"IF($C10=$B$6,F10,0)","v":0},{"$f":"(IF(AND($E10=\"\",$C10=$B$6),1,0))","v":0},{"$f":"IF($C10=$B$7,F10,0)","v":0},{"$f":"(IF(AND($E10=\"\",$C10=$B$7),1,0))","v":0},{"$nulls":5},{"$f":"U10+V10+W10","v":{"v":0,"d":"0.0"}},{"$f":"IF(X10=D10,1,0)","v":0},{"$f":"IF(X10=0,0,1)","v":0},{"$f":"IF(Y10+Z10=2,\"Korrekt\",\"\")","v":""}]
[2,{"$f":"'Wettkampf 1'!B11","v":"Dirk Meyer"},{"$f":"'Wettkampf 1'!C11","v":"Spahnharrenstätte III"},{"v":0,"d":"0.0"},null,{"$f":"IF(E11=\"x\",\"0\",D11)","v":{"v":0,"d":"0.0"}},{"$f":"IF(C11=$B$2,F11,0)","v":0},{"$f":"(IF(AND($E11=\"\",$C11=$B$2),1,0))","v":1},{"$f":"IF($C11=$B$3,F11,0)","v":0},{"$f":"(IF(AND($E11=\"\",$C11=$B$3),1,0))","v":0},{"$f":"IF($C11=$B$4,F11,0)","v":0},{"$f":"(IF(AND($E11=\"\",$C11=$B$4),1,0))","v":0},{"$f":"IF($C11=$B$5,F11,0)","v":0},{"$f":"(IF(AND($E11=\"\",$C11=$B$5),1,0))","v":0},{"$f":"IF($C11=$B$6,F11,0)","v":0},{"$f":"(IF(AND($E11=\"\",$C11=$B$6),1,0))","v":0},{"$f":"IF($C11=$B$7,F11,0)","v":0},{"$f":"(IF(AND($E11=\"\",$C11=$B$7),1,0))","v":0},{"$nulls":5},{"$f":"U11+V11+W11","v":{"v":0,"d":"0.0"}},{"$f":"IF(X11=D11,1,0)","v":1},{"$f":"IF(X11=0,0,1)","v":0},{"$f":"IF(Y11+Z11=2,\"Korrekt\",\"\")","v":""}]
[3,{"$f":"'Wettkampf 1'!B12","v":"Sebastian Albers"},{"$f":"'Wettkampf 1'!C12","v":"Spahnharrenstätte III"},308.6,"x","0","0",0,0,0,0,0,0,0,0,0,0,0,{"$nulls":5},{"v":0,"d":"0.0"},0,0,""]
[4,{"$f":"'Wettkampf 1'!B13","v":"Achim Will"},{"$f":"'Wettkampf 1'!C13","v":"Spahnharrenstätte III"},314.4,null,314.4,314.4,1,0,0,0,0,0,0,0,0,0,0,{"$nulls":5},{"v":0,"d":"0.0"},0,0,""]
[5,{"$f":"'Wettkampf 1'!B14","v":"Christian Grönheim"},{"$f":"'Wettkampf 1'!C14","v":"Spahnharrenstätte III"},303.1,null,303.1,303.1,1,0,0,0,0,0,0,0,0,0,0,{"$nulls":5},{"v":0,"d":"0.0"},0,0,""]
[6,{"$f":"'Wettkampf 1'!B15","v":"Dieter Hanekamp"},{"$f":"'Wettkampf 1'!C15","v":"Spahnharrenstätte II"},312.5,null,312.5,0,0,0,0,0,0,0,0,312.5,1,0,0,{"$nulls":5},{"v":0,"d":"0.0"},0,0,""]
[7,{"$f":"'Wettkampf 1'!B16","v":"Josef Langen"},{"$f":"'Wettkampf 1'!C16","v":"Spahnharrenstätte II"},302.9,null,302.9,0,0,0,0,0,0,0,0,302.9,1,0,0,{"$nulls":5},{"v":0,"d":"0.0"},0,0,""]
[8,{"$f":"'Wettkampf 1'!B17","v":"Johannes Hülsmann"},{"$f":"'Wettkampf 1'!C17","v":"Spahnharrenstätte II"},307.8,null,307.8,0,0,0,0,0,0,0,0,307.8,1,0,0,{"$nulls":5},{"v":0,"d":"0.0"},0,0,""]
[9,{"$f":"'Wettkampf 1'!B18","v":"Heiner Kröger"},{"$f":"'Wettkampf 1'!C18","v":"Spahnharrenstätte II"},311.6,null,311.6,0,0,0,0,0,0,0,0,311.6,1,0,0,{"$nulls":5},{"v":0,"d":"0.0"},0,0,""]
[10,{"$f":"'Wettkampf 1'!B19","v":"Bernd Nortmann"},{"$f":"'Wettkampf 1'!C19","v":"Lahn V"},304.1,null,304.1,0,0,0,0,0,0,304.1,1,0,0,0,0,{"$nulls":5},{"v":0,"d":"0.0"},0,0,""]
[11,{"$f":"'Wettkampf 1'!B20","v":"Oliver Reinelt"},{"$f":"'Wettkampf 1'!C20","v":"Lahn V"},301.4,null,301.4,0,0,0,0,0,0,301.4,1,0,0,0,0,{"$nulls":5},{"v":0,"d":"0.0"},0,0,""]
[12,{"$f":"'Wettkampf 1'!B21","v":"Simon Schukenbrock"},{"$f":"'Wettkampf 1'!C21","v":"Lahn V"},310.2,null,310.2,0,0,0,0,0,0,310.2,1,0,0,0,0,{"$nulls":5},{"v":0,"d":"0.0"},0,0,""]
[13,{"$f":"'Wettkampf 1'!B22","v":"Michael Boje"},{"$f":"'Wettkampf 1'!C22","v":"Lahn V"},{"v":0,"d":"0.0"},null,{"v":0,"d":"0.0"},0,0,0,0,0,0,0,1,0,0,0,0,{"$nulls":5},{"v":0,"d":"0.0"},1,0,""]
[14,{"$f":"'Wettkampf 1'!B23","v":"Ludger Hermes"},{"$f":"'Wettkampf 1'!C23","v":"Neubörger II"},309.1,null,309.1,0,0,0,0,309.1,1,0,0,0,0,0,0,{"$nulls":5},{"v":0,"d":"0.0"},0,0,""]
[15,{"$f":"'Wettkampf 1'!B24","v":"Rudi Fromme"},{"$f":"'Wettkampf 1'!C24","v":"Neubörger II"},304.7,null,304.7,0,0,0,0,304.7,1,0,0,0,0,0,0,{"$nulls":5},{"v":0,"d":"0.0"},0,0,""]
[16,{"$f":"'Wettkampf 1'!B25","v":"Alois Schmitz"},{"$f":"'Wettkampf 1'!C25","v":"Neubörger II"},307.5,null,307.5,0,0,0,0,307.5,1,0,0,0,0,0,0,{"$nulls":5},{"v":0,"d":"0.0"},0,0,""]
[17,{"$f":"'Wettkampf 1'!B26","v":"Ludwig Langen"},{"$f":"'Wettkampf 1'!C26","v":"Neubörger II"},304.4,null,304.4,0,0,0,0,304.4,1,0,0,0,0,0,0,{"$nulls":5},{"v":0,"d":"0.0"},0,0,""]
[18,{"$f":"'Wettkampf 1'!B27","v":"Rainer Wielenberg"},{"$f":"'Wettkampf 1'!C27","v":"Esterwegen II"},{"v":0,"d":"0.0"},"x","0",0,0,"0",0,0,0,0,0,0,0,0,0,{"$nulls":5},{"v":0,"d":"0.0"},1,0,""]
[19,{"$f":"'Wettkampf 1'!B28","v":"Meik Sieger"},{"$f":"'Wettkampf 1'!C28","v":"Esterwegen II"},311.1,null,311.1,0,0,311.1,1,0,0,0,0,0,0,0,0,{"$nulls":5},{"v":0,"d":"0.0"},0,0,""]
[20,{"$f":"'Wettkampf 1'!B29","v":"Dennis Lindemann"},{"$f":"'Wettkampf 1'!C29","v":"Esterwegen II"},310.4,null,310.4,0,0,310.4,1,0,0,0,0,0,0,0,0,{"$nulls":5},{"v":0,"d":"0.0"},0,0,""]
[21,{"$f":"'Wettkampf 1'!B30","v":"Andreas Lindemann"},{"$f":"'Wettkampf 1'!C30","v":"Esterwegen II"},{"v":303,"d":"303.0"},null,{"v":303,"d":"303.0"},0,0,303,1,0,0,0,0,0,0,0,0,{"$nulls":5},{"v":0,"d":"0.0"},0,0,""]
[22,{"$f":"'Wettkampf 1'!B31","v":"Johannes Gebken"},{"$f":"'Wettkampf 1'!C31","v":"Esterwegen II"},{"v":0,"d":"0.0"},"x","0",0,0,"0",0,0,0,0,0,0,0,0,0,{"$nulls":5},{"v":0,"d":"0.0"},1,0,""]
[23,{"$f":"'Wettkampf 1'!B32","v":"Jan-Niklas Lindemann"},{"$f":"'Wettkampf 1'!C32","v":"Esterwegen II"},{"v":0,"d":"0.0"},"x","0",0,0,"0",0,0,0,0,0,0,0,0,0,{"$nulls":5},{"v":0,"d":"0.0"},1,0,""]
[24,{"$f":"'Wettkampf 1'!B33","v":"Stefan Burlager"},{"$f":"'Wettkampf 1'!C33","v":"Esterwegen II"},304.6,null,304.6,0,0,304.6,1,0,0,0,0,0,0,0,0,{"$nulls":5},{"v":0,"d":"0.0"},0,0,""]
[25,{"$f":"'Wettkampf 1'!B34","v":"Franz Ostermann"},{"$f":"'Wettkampf 1'!C34","v":"Eisten II "},307.4,null,307.4,0,0,0,0,0,0,0,0,0,0,307.4,1,{"$nulls":5},{"v":0,"d":"0.0"},0,0,""]
[26,{"$f":"'Wettkampf 1'!B35","v":"Martin Hackmann"},{"$f":"'Wettkampf 1'!C35","v":"Eisten II "},307.4,null,307.4,0,0,0,0,0,0,0,0,0,0,307.4,1,{"$nulls":5},{"v":0,"d":"0.0"},0,0,""]
[27,{"$f":"'Wettkampf 1'!B36","v":"Günther Baalmann"},{"$f":"'Wettkampf 1'!C36","v":"Eisten II "},315.4,null,315.4,0,0,0,0,0,0,0,0,0,0,315.4,1,{"$nulls":5},{"v":0,"d":"0.0"},0,0,""]
[28,{"$f":"'Wettkampf 1'!B37","v":"Martin Poker"},{"$f":"'Wettkampf 1'!C37","v":"Eisten II "},312.6,null,312.6,0,0,0,0,0,0,0,0,0,0,312.6,1,{"$nulls":5},{"v":0,"d":"0.0"},0,0,""]
[29,{"$f":"'Wettkampf 1'!B38","v":"Schütze 29"},{"$f":"'Wettkampf 1'!C38","v":{"v":0,"d":"0.0"}},null,null,{"v":0,"d":"0.0"},0,0,0,0,0,0,0,0,0,0,0,0,{"$nulls":5},{"v":0,"d":"0.0"},1,0,""]
[30,{"$f":"'Wettkampf 1'!B39","v":"Schütze 30"},{"$f":"'Wettkampf 1'!C39","v":{"v":0,"d":"0.0"}},null,null,{"v":0,"d":"0.0"},0,0,0,0,0,0,0,0,0,0,0,0,{"$nulls":5},{"v":0,"d":"0.0"},1,0,""]
[31,{"$f":"'Wettkampf 1'!B40","v":"Schütze 31"},{"$f":"'Wettkampf 1'!C40","v":{"v":0,"d":"0.0"}},null,null,{"v":0,"d":"0.0"},0,0,0,0,0,0,0,0,0,0,0,0,{"$nulls":5},{"v":0,"d":"0.0"},1,0,""]
[32,{"$f":"'Wettkampf 1'!B41","v":"Schütze 32"},{"$f":"'Wettkampf 1'!C41","v":{"v":0,"d":"0.0"}},null,null,{"v":0,"d":"0.0"},0,0,0,0,0,0,0,0,0,0,0,0,{"$nulls":5},{"v":0,"d":"0.0"},1,0,""]
[33,{"$f":"'Wettkampf 1'!B42","v":"Schütze 33"},{"$f":"'Wettkampf 1'!C42","v":{"v":0,"d":"0.0"}},null,null,{"v":0,"d":"0.0"},0,0,0,0,0,0,0,0,0,0,0,0,{"$nulls":5},{"v":0,"d":"0.0"},1,0,""]
[34,{"$f":"'Wettkampf 1'!B43","v":"Schütze 34"},{"$f":"'Wettkampf 1'!C43","v":{"v":0,"d":"0.0"}},null,null,{"v":0,"d":"0.0"},0,0,0,0,0,0,0,0,0,0,0,0,{"$nulls":5},{"v":0,"d":"0.0"},1,0,""]
[35,{"$f":"'Wettkampf 1'!B44","v":"Schütze 35"},{"$f":"'Wettkampf 1'!C44","v":{"v":0,"d":"0.0"}},null,null,{"v":0,"d":"0.0"},0,0,0,0,0,0,0,0,0,0,0,0,{"$nulls":5},{"v":0,"d":"0.0"},1,0,""]
[36,{"$f":"'Wettkampf 1'!B45","v":"Schütze 36"},{"$f":"'Wettkampf 1'!C45","v":{"v":0,"d":"0.0"}},null,null,{"v":0,"d":"0.0"},0,0,0,0,0,0,0,0,0,0,0,0,{"$nulls":5},{"v":0,"d":"0.0"},1,0,""]
[{"$nulls":6},{"$f":"LARGE(G10:G45,1)+LARGE(G10:G45,2)+LARGE(G10:G45,3)","v":921.1},{"$f":"SUM(H10:H45)","v":4},{"$f":"LARGE(I10:I45,1)+LARGE(I10:I45,2)+LARGE(I10:I45,3)","v":926.1},{"$f":"SUM(J10:J45)","v":4},{"$f":"LARGE(K10:K45,1)+LARGE(K10:K45,2)+LARGE(K10:K45,3)","v":921.3},{"$f":"SUM(L10:L45)","v":4},{"$f":"LARGE(M10:M45,1)+LARGE(M10:M45,2)+LARGE(M10:M45,3)","v":915.6999999999999},{"$f":"SUM(N10:N45)","v":4},{"$f":"LARGE(O10:O45,1)+LARGE(O10:O45,2)+LARGE(O10:O45,3)","v":931.9000000000001},{"$f":"SUM(P10:P45)","v":4},{"$f":"LARGE(Q10:Q45,1)+LARGE(Q10:Q45,2)+LARGE(Q10:Q45,3)","v":935.4},{"$f":"SUM(R10:S45)","v":4}]
[null,null,"per Email an: sk-huemmling@gmx.de"]

{"sheet":"8","index":8,"n_rows":47,"n_cols":27,"rows_kept":47,"merged":[[0,22,0,23],[1,22,1,23],[4,22,4,23],[5,22,5,23],[6,22,6,23],[8,20,8,23]]}
[null,"Verein / Gruppe",null,"Ergebnisse",{"$nulls":17},"Austragungsort:",{"$f":"Übersicht!M4","v":"Esterwegen"}]
[1,{"$f":"'Wettkampf 1'!B2","v":"Spahnharrenstätte III"},null,{"$f":"G46","v":{"v":928,"d":"928.0"}},{"$f":"IF(H46>4,\"Es sind zu viele Schützen in Wertung!\",\" \")","v":" "},{"$nulls":16},"Wettkampftag:",{"$f":"Übersicht!M3","v":"02.02."}]
[2,{"$f":"'Wettkampf 1'!B3","v":"Esterwegen II"},null,{"$f":"I46","v":926.9},{"$f":"IF(J46>4,\"Es sind zu viele Schützen in Wertung!\",\" \")","v":" "}]
[3,{"$f":"'Wettkampf 1'!B4","v":"Neubörger II"},null,{"$f":"K46","v":{"v":921.3000000000001,"d":"921.3"}},{"$f":"IF(L46>4,\"Es sind zu viele Schützen in Wertung!\",\" \")","v":" "},{"$nulls":18},"Ansprechpartner für Rückfragen:"]
[4,{"$f":"'Wettkampf 1'!B5","v":"Lahn V"},null,{"$f":"M46","v":{"v":915.1999999999999,"d":"915.2"}},{"$f":"IF(N46>4,\"Es sind zu viele Schützen in Wertung!\",\" \")","v":" "},{"$nulls":16},"Name:","Konneman"]
[5,{"$f":"'Wettkampf 1'!B6","v":"Spahnharrenstätte II"},null,{"$f":"O46","v":928.5},{"$f":"IF(P46>4,\"Es sind zu viele Schützen in Wertung!\",\" \")","v":" "},{"$nulls":16},"Tel:","05955-988903"]
[6,{"$f":"'Wettkampf 1'!B7","v":"Eisten II "},null,{"$f":"Q46","v":932.4},{"$f":"IF(R46>4,\"Es sind zu viele Schützen in Wertung!\",\" \")","v":" "},{"$nulls":16},"Standaufsicht:","Sieger"]
[]
[null,"Einzelergebnisse:","Verein / Gruppe","Ergebnisse (mindestens 0 eintragen)","AW? Dann x eintippen",null,"Verein 1",null,"Verein 2",null,"Verein 3",null,"Verein 4",null,"Verein 5",null,"Verein 6",{"$nulls":3},"Proberechnung bei Streifen:"]
[1,{"$f":"'Wettkampf 1'!B10","v":"Heiko Micksch"},{"$f":"'Wettkampf 1'!C10","v":"Spahnharrenstätte III"},305.7,"x",{"$f":"IF(E10=\"x\",\"0\",D10)","v":"0"},{"$f":"IF(C10=$B$2,F10,0)","v":"0"},{"$f":"(IF(AND($E10=\"\",$C10=$B$2),1,0))","v":0},{"$f":"IF($C10=$B$3,F10,0)","v":0},{"$f":"(IF(AND($E10=\"\",$C10=$B$3),1,0))","v":0},{"$f":"IF($C10=$B$4,F10,0)","v":0},{"$f":"(IF(AND($E10=\"\",$C10=$B$4),1,0))","v":0},{"$f":"IF($C10=$B$5,F10,0)","v":0},{"$f":"(IF(AND($E10=\"\",$C10=$B$5),1,0))","v":0},{"$f":"IF($C10=$B$6,F10,0)","v":0},{"$f":"(IF(AND($E10=\"\",$C10=$B$6),1,0))","v":0},{"$f":"IF($C10=$B$7,F10,0)","v":0},{"$f":"(IF(AND($E10=\"\",$C10=$B$7),1,0))","v":0},{"$nulls":5},{"$f":"U10+V10+W10","v":{"v":0,"d":"0.0"}},{"$f":"IF(X10=D10,1,0)","v":0},{"$f":"IF(X10=0,0,1)","v":0},{"$f":"IF(Y10+Z10=2,\"Korrekt\",\"\")","v":""}]
[2,{"$f":"'Wettkampf 1'!B11","v":"Dirk Meyer"},{"$f":"'Wettkampf 1'!C11","v":"Spahnharrenstätte III"},311.6,null,{"$f":"IF(E11=\"x\",\"0\",D11)","v":311.6},{"$f":"IF(C11=$B$2,F11,0)","v":311.6},{"$f":"(IF(AND($E11=\"\",$C11=$B$2),1,0))","v":1},{"$f":"IF($C11=$B$3,F11,0)","v":0},{"$f":"(IF(AND($E11=\"\",$C11=$B$3),1,0))","v":0},{"$f":"IF($C11=$B$4,F11,0)","v":0},{"$f":"(IF(AND($E11=\"\",$C11=$B$4),1,0))","v":0},{"$f":"IF($C11=$B$5,F11,0)","v":0},{"$f":"(IF(AND($E11=\"\",$C11=$B$5),1,0))","v":0},{"$f":"IF($C11=$B$6,F11,0)","v":0},{"$f":"(IF(AND($E11=\"\",$C11=$B$6),1,0))","v":0},{"$f":"IF($C11=$B$7,F11,0)","v":0},{"$f":"(IF(AND($E11=\"\",$C11=$B$7),1,0))","v":0},{"$nulls":5},{"$f":"U11+V11+W11","v":{"v":0,"d":"0.0"}},{"$f":"IF(X11=D11,1,0)","v":0},{"$f":"IF(X11=0,0,1)","v":0},{"$f":"IF(Y11+Z11=2,\"Korrekt\",\"\")","v":""}]
[3,{"$f":"'Wettkampf 1'!B12","v":"Sebastian Albers"},{"$f":"'Wettkampf 1'!C12","v":"Spahnharrenstätte III"},307.2,null,307.2,307.2,1,0,0,0,0,0,0,0,0,0,0,{"$nulls":5},{"v":0,"d":"0.0"},0,0,""]
[4,{"$f":"'Wettkampf 1'!B13","v":"Achim Will"},{"$f":"'Wettkampf 1'!C13","v":"Spahnharrenstätte III"},308.4,null,308.4,308.4,1,0,0,0,0,0,0,0,0,0,0,{"$nulls":5},{"v":0,"d":"0.0"},0,0,""]
[5,{"$f":"'Wettkampf 1'!B14","v":"Christian Grönheim"},{"$f":"'Wettkampf 1'!C14","v":"Spahnharrenstätte III"},{"v":308,"d":"308.0"},null,{"v":308,"d":"308.0"},308,1,0,0,0,0,0,0,0,0,0,0,{"$nulls":5},{"v":0,"d":"0.0"},0,0,""]
[6,{"$f":"'Wettkampf 1'!B15","v":"Dieter Hanekamp"},{"$f":"'Wettkampf 1'!C15","v":"Spahnharrenstätte II"},311.5,null,311.5,0,0,0,0,0,0,0,0,311.5,1,0,0,{"$nulls":5},{"v":0,"d":"0.0"},0,0,""]
[7,{"$f":"'Wettkampf 1'!B16","v":"Josef Langen"},{"$f":"'Wettkampf 1'!C16","v":"Spahnharrenstätte II"},306.7,null,306.7,0,0,0,0,0,0,0,0,306.7,1,0,0,{"$nulls":5},{"v":0,"d":"0.0"},0,0,""]
[8,{"$f":"'Wettkampf 1'!B17","v":"Johannes Hülsmann"},{"$f":"'Wettkampf 1'!C17","v":"Spahnharrenstätte II"},309.5,null,309.5,0,0,0,0,0,0,0,0,309.5,1,0,0,{"$nulls":5},{"v":0,"d":"0.0"},0,0,""]
[9,{"$f":"'Wettkampf 1'!B18","v":"Heiner Kröger"},{"$f":"'Wettkampf 1'!C18","v":"Spahnharrenstätte II"},307.5,null,307.5,0,0,0,0,0,0,0,0,307.5,1,0,0,{"$nulls":5},{"v":0,"d":"0.0"},0,0,""]
[10,{"$f":"'Wettkampf 1'!B19","v":"Bernd Nortmann"},{"$f":"'Wettkampf 1'!C19","v":"Lahn V"},308.9,null,308.9,0,0,0,0,0,0,308.9,1,0,0,0,0,{"$nulls":5},{"v":0,"d":"0.0"},0,0,""]
[11,{"$f":"'Wettkampf 1'!B20","v":"Oliver Reinelt"},{"$f":"'Wettkampf 1'!C20","v":"Lahn V"},304.4,null,304.4,0,0,0,0,0,0,304.4,1,0,0,0,0,{"$nulls":5},{"v":0,"d":"0.0"},0,0,""]
[12,{"$f":"'Wettkampf 1'!B21","v":"Simon Schukenbrock"},{"$f":"'Wettkampf 1'!C21","v":"Lahn V"},301.9,null,301.9,0,0,0,0,0,0,301.9,1,0,0,0,0,{"$nulls":5},{"v":0,"d":"0.0"},0,0,""]
[13,{"$f":"'Wettkampf 1'!B22","v":"Michael Boje"},{"$f":"'Wettkampf 1'!C22","v":"Lahn V"},{"v":0,"d":"0.0"},null,{"v":0,"d":"0.0"},0,0,0,0,0,0,0,1,0,0,0,0,{"$nulls":5},{"v":0,"d":"0.0"},1,0,""]
[14,{"$f":"'Wettkampf 1'!B23","v":"Ludger Hermes"},{"$f":"'Wettkampf 1'!C23","v":"Neubörger II"},310.6,null,310.6,0,0,0,0,310.6,1,0,0,0,0,0,0,{"$nulls":5},{"v":0,"d":"0.0"},0,0,""]
[15,{"$f":"'Wettkampf 1'!B24","v":"Rudi Fromme"},{"$f":"'Wettkampf 1'!C24","v":"Neubörger II"},303.2,null,303.2,0,0,0,0,303.2,1,0,0,0,0,0,0,{"$nulls":5},{"v":0,"d":"0.0"},0,0,""]
[16,{"$f":"'Wettkampf 1'!B25","v":"Alois Schmitz"},{"$f":"'Wettkampf 1'!C25","v":"Neubörger II"},304.9,null,304.9,0,0,0,0,304.9,1,0,0,0,0,0,0,{"$nulls":5},{"v":0,"d":"0.0"},0,0,""]
[17,{"$f":"'Wettkampf 1'!B26","v":"Ludwig Langen"},{"$f":"'Wettkampf 1'!C26","v":"Neubörger II"},305.8,null,305.8,0,0,0,0,305.8,1,0,0,0,0,0,0,{"$nulls":5},{"v":0,"d":"0.0"},0,0,""]
[18,{"$f":"'Wettkampf 1'!B27","v":"Rainer Wielenberg"},{"$f":"'Wettkampf 1'!C27","v":"Esterwegen II"},298.3,"x","0",0,0,"0",0,0,0,0,0,0,0,0,0,{"$nulls":5},{"v":0,"d":"0.0"},0,0,""]
[19,{"$f":"'Wettkampf 1'!B28","v":"Meik Sieger"},{"$f":"'Wettkampf 1'!C28","v":"Esterwegen II"},306.6,null,306.6,0,0,306.6,1,0,0,0,0,0,0,0,0,{"$nulls":5},{"v":0,"d":"0.0"},0,0,""]
[20,{"$f":"'Wettkampf 1'!B29","v":"Dennis Lindemann"},{"$f":"'Wettkampf 1'!C29","v":"Esterwegen II"},312.5,null,312.5,0,0,312.5,1,0,0,0,0,0,0,0,0,{"$nulls":5},{"v":0,"d":"0.0"},0,0,""]
[21,{"$f":"'Wettkampf 1'!B30","v":"Andreas Lindemann"},{"$f":"'Wettkampf 1'!C30","v":"Esterwegen II"},307.8,null,307.8,0,0,307.8,1,0,0,0,0,0,0,0,0,{"$nulls":5},{"v":0,"d":"0.0"},0,0,""]
[22,{"$f":"'Wettkampf 1'!B31","v":"Johannes Gebken"},{"$f":"'Wettkampf 1'!C31","v":"Esterwegen II"},{"v":0,"d":"0.0"},"x","0",0,0,"0",0,0,0,0,0,0,0,0,0,{"$nulls":5},{"v":0,"d":"0.0"},1,0,""]
[23,{"$f":"'Wettkampf 1'!B32","v":"Jan-Niklas Lindemann"},{"$f":"'Wettkampf 1'!C32","v":"Esterwegen II"},{"v":0,"d":"0.0"},"x","0",0,0,"0",0,0,0,0,0,0,0,0,0,{"$nulls":5},{"v":0,"d":"0.0"},1,0,""]
[24,{"$f":"'Wettkampf 1'!B33","v":"Stefan Burlager"},{"$f":"'Wettkampf 1'!C33","v":"Esterwegen II"},303.5,null,303.5,0,0,303.5,1,0,0,0,0,0,0,0,0,{"$nulls":5},{"v":0,"d":"0.0"},0,0,""]
[25,{"$f":"'Wettkampf 1'!B34","v":"Franz Ostermann"},{"$f":"'Wettkampf 1'!C34","v":"Eisten II "},309.7,null,309.7,0,0,0,0,0,0,0,0,0,0,309.7,1,{"$nulls":5},{"v":0,"d":"0.0"},0,0,""]
[26,{"$f":"'Wettkampf 1'!B35","v":"Martin Hackmann"},{"$f":"'Wettkampf 1'!C35","v":"Eisten II "},308.9,null,308.9,0,0,0,0,0,0,0,0,0,0,308.9,1,{"$nulls":5},{"v":0,"d":"0.0"},0,0,""]
[27,{"$f":"'Wettkampf 1'!B36","v":"Günther Baalmann"},{"$f":"'Wettkampf 1'!C36","v":"Eisten II "},313.8,null,313.8,0,0,0,0,0,0,0,0,0,0,313.8,1,{"$nulls":5},{"v":0,"d":"0.0"},0,0,""]
[28,{"$f":"'Wettkampf 1'!B37","v":"Martin Poker"},{"$f":"'Wettkampf 1'!C37","v":"Eisten II "},305.4,null,305.4,0,0,0,0,0,0,0,0,0,0,305.4,1,{"$nulls":5},{"v":0,"d":"0.0"},0,0,""]
[29,{"$f":"'Wettkampf 1'!B38","v":"Schütze 29"},{"$f":"'Wettkampf 1'!C38","v":{"v":0,"d":"0.0"}},null,"x","0",0,0,0,0,0,0,0,0,0,0,0,0,{"$nulls":5},{"v":0,"d":"0.0"},1,0,""]
[30,{"$f":"'Wettkampf 1'!B39","v":"Schütze 30"},{"$f":"'Wettkampf 1'!C39","v":{"v":0,"d":"0.0"}},null,"x","0",0,0,0,0,0,0,0,0,0,0,0,0,{"$nulls":5},{"v":0,"d":"0.0"},1,0,""]
[31,{"$f":"'Wettkampf 1'!B40","v":"Schütze 31"},{"$f":"'Wettkampf 1'!C40","v":{"v":0,"d":"0.0"}},null,null,{"v":0,"d":"0.0"},0,0,0,0,0,0,0,0,0,0,0,0,{"$nulls":5},{"v":0,"d":"0.0"},1,0,""]
[32,{"$f":"'Wettkampf 1'!B41","v":"Schütze 32"},{"$f":"'Wettkampf 1'!C41","v":{"v":0,"d":"0.0"}},null,null,{"v":0,"d":"0.0"},0,0,0,0,0,0,0,0,0,0,0,0,{"$nulls":5},{"v":0,"d":"0.0"},1,0,""]
[33,{"$f":"'Wettkampf 1'!B42","v":"Schütze 33"},{"$f":"'Wettkampf 1'!C42","v":{"v":0,"d":"0.0"}},null,null,{"v":0,"d":"0.0"},0,0,0,0,0,0,0,0,0,0,0,0,{"$nulls":5},{"v":0,"d":"0.0"},1,0,""]
[34,{"$f":"'Wettkampf 1'!B43","v":"Schütze 34"},{"$f":"'Wettkampf 1'!C43","v":{"v":0,"d":"0.0"}},null,null,{"v":0,"d":"0.0"},0,0,0,0,0,0,0,0,0,0,0,0,{"$nulls":5},{"v":0,"d":"0.0"},1,0,""]
[35,{"$f":"'Wettkampf 1'!B44","v":"Schütze 35"},{"$f":"'Wettkampf 1'!C44","v":{"v":0,"d":"0.0"}},null,"x","0",0,0,0,0,0,0,0,0,0,0,0,0,{"$nulls":5},{"v":0,"d":"0.0"},1,0,""]
[36,{"$f":"'Wettkampf 1'!B45","v":"Schütze 36"},{"$f":"'Wettkampf 1'!C45","v":{"v":0,"d":"0.0"}},null,"x","0",0,0,0,0,0,0,0,0,0,0,0,0,{"$nulls":5},{"v":0,"d":"0.0"},1,0,""]
[{"$nulls":6},{"$f":"LARGE(G10:G45,1)+LARGE(G10:G45,2)+LARGE(G10:G45,3)","v":928},{"$f":"SUM(H10:H45)","v":4},{"$f":"LARGE(I10:I45,1)+LARGE(I10:I45,2)+LARGE(I10:I45,3)","v":926.9},{"$f":"SUM(J10:J45)","v":4},{"$f":"LARGE(K10:K45,1)+LARGE(K10:K45,2)+LARGE(K10:K45,3)","v":921.3000000000001},{"$f":"SUM(L10:L45)","v":4},{"$f":"LARGE(M10:M45,1)+LARGE(M10:M45,2)+LARGE(M10:M45,3)","v":915.1999999999999},{"$f":"SUM(N10:N45)","v":4},{"$f":"LARGE(O10:O45,1)+LARGE(O10:O45,2)+LARGE(O10:O45,3)","v":928.5},{"$f":"SUM(P10:P45)","v":4},{"$f":"LARGE(Q10:Q45,1)+LARGE(Q10:Q45,2)+LARGE(Q10:Q45,3)","v":932.4},{"$f":"SUM(R10:S45)","v":4}]
[null,null,"per Email an: sk-huemmling@gmx.de"]

{"sheet":"9","index":9,"n_rows":47,"n_cols":27,"rows_kept":47,"merged":[[0,22,0,23],[1,22,1,23],[4,22,4,23],[5,22,5,23],[6,22,6,23],[8,20,8,23]]}
[null,"Verein / Gruppe",null,"Ergebnisse",{"$nulls":17},"Austragungsort:",{"$f":"Übersicht!N4","v":"Spahnharrenstätte"}]
[1,{"$f":"'Wettkampf 1'!B2","v":"Spahnharrenstätte III"},null,{"$f":"G46","v":935.4},{"$f":"IF(H46>4,\"Es sind zu viele Schützen in Wertung!\",\" \")","v":" "},{"$nulls":16},"Wettkampftag:",{"$f":"Übersicht!N3","v":"16.02."}]
[2,{"$f":"'Wettkampf 1'!B3","v":"Esterwegen II"},null,{"$f":"I46","v":926.7},{"$f":"IF(J46>4,\"Es sind zu viele Schützen in Wertung!\",\" \")","v":" "}]
[3,{"$f":"'Wettkampf 1'!B4","v":"Neubörger II"},null,{"$f":"K46","v":924.4},{"$f":"IF(L46>4,\"Es sind zu viele Schützen in Wertung!\",\" \")","v":" "},{"$nulls":18},"Ansprechpartner für Rückfragen:"]
[4,{"$f":"'Wettkampf 1'!B5","v":"Lahn V"},null,{"$f":"M46","v":{"v":920.4000000000001,"d":"920.4"}},{"$f":"IF(N46>4,\"Es sind zu viele Schützen in Wertung!\",\" \")","v":" "},{"$nulls":16},"Name:"]
[5,{"$f":"'Wettkampf 1'!B6","v":"Spahnharrenstätte II"},null,{"$f":"O46","v":{"v":929.6999999999999,"d":"929.7"}},{"$f":"IF(P46>4,\"Es sind zu viele Schützen in Wertung!\",\" \")","v":" "},{"$nulls":16},"Tel:"]
[6,{"$f":"'Wettkampf 1'!B7","v":"Eisten II "},null,{"$f":"Q46","v":937.3},{"$f":"IF(R46>4,\"Es sind zu viele Schützen in Wertung!\",\" \")","v":" "},{"$nulls":16},"Standaufsicht:","Achim Will"]
[]
[null,"Einzelergebnisse:","Verein / Gruppe","Ergebnisse (mindestens 0 eintragen)","AW? Dann x eintippen",null,"Verein 1",null,"Verein 2",null,"Verein 3",null,"Verein 4",null,"Verein 5",null,"Verein 6",{"$nulls":3},"Proberechnung bei Streifen:"]
[1,{"$f":"'Wettkampf 1'!B10","v":"Heiko Micksch"},{"$f":"'Wettkampf 1'!C10","v":"Spahnharrenstätte III"},306.3,"x",{"$f":"IF(E10=\"x\",\"0\",D10)","v":"0"},{"$f":"IF(C10=$B$2,F10,0)","v":"0"},{"$f":"(IF(AND($E10=\"\",$C10=$B$2),1,0))","v":0},{"$f":"IF($C10=$B$3,F10,0)","v":0},{"$f":"(IF(AND($E10=\"\",$C10=$B$3),1,0))","v":0},{"$f":"IF($C10=$B$4,F10,0)","v":0},{"$f":"(IF(AND($E10=\"\",$C10=$B$4),1,0))","v":0},{"$f":"IF($C10=$B$5,F10,0)","v":0},{"$f":"(IF(AND($E10=\"\",$C10=$B$5),1,0))","v":0},{"$f":"IF($C10=$B$6,F10,0)","v":0},{"$f":"(IF(AND($E10=\"\",$C10=$B$6),1,0))","v":0},{"$f":"IF($C10=$B$7,F10,0)","v":0},{"$f":"(IF(AND($E10=\"\",$C10=$B$7),1,0))","v":0},{"$nulls":5},{"$f":"U10+V10+W10","v":{"v":0,"d":"0.0"}},{"$f":"IF(X10=D10,1,0)","v":0},{"$f":"IF(X10=0,0,1)","v":0},{"$f":"IF(Y10+Z10=2,\"Korrekt\",\"\")","v":""}]
[2,{"$f":"'Wettkampf 1'!B11","v":"Dirk Meyer"},{"$f":"'Wettkampf 1'!C11","v":"Spahnharrenstätte III"},312.7,null,{"$f":"IF(E11=\"x\",\"0\",D11)","v":312.7},{"$f":"IF(C11=$B$2,F11,0)","v":312.7},{"$f":"(IF(AND($E11=\"\",$C11=$B$2),1,0))","v":1},{"$f":"IF($C11=$B$3,F11,0)","v":0},{"$f":"(IF(AND($E11=\"\",$C11=$B$3),1,0))","v":0},{"$f":"IF($C11=$B$4,F11,0)","v":0},{"$f":"(IF(AND($E11=\"\",$C11=$B$4),1,0))","v":0},{"$f":"IF($C11=$B$5,F11,0)","v":0},{"$f":"(IF(AND($E11=\"\",$C11=$B$5),1,0))","v":0},{"$f":"IF($C11=$B$6,F11,0)","v":0},{"$f":"(IF(AND($E11=\"\",$C11=$B$6),1,0))","v":0},{"$f":"IF($C11=$B$7,F11,0)","v":0},{"$f":"(IF(AND($E11=\"\",$C11=$B$7),1,0))","v":0},{"$nulls":5},{"$f":"U11+V11+W11","v":{"v":0,"d":"0.0"}},{"$f":"IF(X11=D11,1,0)","v":0},{"$f":"IF(X11=0,0,1)","v":0},{"$f":"IF(Y11+Z11=2,\"Korrekt\",\"\")","v":""}]
[3,{"$f":"'Wettkampf 1'!B12","v":"Sebastian Albers"},{"$f":"'Wettkampf 1'!C12","v":"Spahnharrenstätte III"},306.3,null,306.3,306.3,1,0,0,0,0,0,0,0,0,0,0,{"$nulls":5},{"v":0,"d":"0.0"},0,0,""]
[4,{"$f":"'Wettkampf 1'!B13","v":"Achim Will"},{"$f":"'Wettkampf 1'!C13","v":"Spahnharrenstätte III"},312.7,null,312.7,312.7,1,0,0,0,0,0,0,0,0,0,0,{"$nulls":5},{"v":0,"d":"0.0"},0,0,""]
[5,{"$f":"'Wettkampf 1'!B14","v":"Christian Grönheim"},{"$f":"'Wettkampf 1'!C14","v":"Spahnharrenstätte III"},{"v":310,"d":"310.0"},null,{"v":310,"d":"310.0"},310,1,0,0,0,0,0,0,0,0,0,0,{"$nulls":5},{"v":0,"d":"0.0"},0,0,""]
[6,{"$f":"'Wettkampf 1'!B15","v":"Dieter Hanekamp"},{"$f":"'Wettkampf 1'!C15","v":"Spahnharrenstätte II"},310.7,null,310.7,0,0,0,0,0,0,0,0,310.7,1,0,0,{"$nulls":5},{"v":0,"d":"0.0"},0,0,""]
[7,{"$f":"'Wettkampf 1'!B16","v":"Josef Langen"},{"$f":"'Wettkampf 1'!C16","v":"Spahnharrenstätte II"},305.8,null,305.8,0,0,0,0,0,0,0,0,305.8,1,0,0,{"$nulls":5},{"v":0,"d":"0.0"},0,0,""]
[8,{"$f":"'Wettkampf 1'!B17","v":"Johannes Hülsmann"},{"$f":"'Wettkampf 1'!C17","v":"Spahnharrenstätte II"},310.1,null,310.1,0,0,0,0,0,0,0,0,310.1,1,0,0,{"$nulls":5},{"v":0,"d":"0.0"},0,0,""]
[9,{"$f":"'Wettkampf 1'!B18","v":"Heiner Kröger"},{"$f":"'Wettkampf 1'!C18","v":"Spahnharrenstätte II"},308.9,null,308.9,0,0,0,0,0,0,0,0,308.9,1,0,0,{"$nulls":5},{"v":0,"d":"0.0"},0,0,""]
[10,{"$f":"'Wettkampf 1'!B19","v":"Bernd Nortmann"},{"$f":"'Wettkampf 1'!C19","v":"Lahn V"},302.7,null,302.7,0,0,0,0,0,0,302.7,1,0,0,0,0,{"$nulls":5},{"v":0,"d":"0.0"},0,0,""]
[11,{"$f":"'Wettkampf 1'!B20","v":"Oliver Reinelt"},{"$f":"'Wettkampf 1'!C20","v":"Lahn V"},305.8,null,305.8,0,0,0,0,0,0,305.8,1,0,0,0,0,{"$nulls":5},{"v":0,"d":"0.0"},0,0,""]
[12,{"$f":"'Wettkampf 1'!B21","v":"Simon Schukenbrock"},{"$f":"'Wettkampf 1'!C21","v":"Lahn V"},311.9,null,311.9,0,0,0,0,0,0,311.9,1,0,0,0,0,{"$nulls":5},{"v":0,"d":"0.0"},0,0,""]
[13,{"$f":"'Wettkampf 1'!B22","v":"Michael Boje"},{"$f":"'Wettkampf 1'!C22","v":"Lahn V"},{"v":0,"d":"0.0"},null,{"v":0,"d":"0.0"},0,0,0,0,0,0,0,1,0,0,0,0,{"$nulls":5},{"v":0,"d":"0.0"},1,0,""]
[14,{"$f":"'Wettkampf 1'!B23","v":"Ludger Hermes"},{"$f":"'Wettkampf 1'!C23","v":"Neubörger II"},304.5,null,304.5,0,0,0,0,304.5,1,0,0,0,0,0,0,{"$nulls":5},{"v":0,"d":"0.0"},0,0,""]
[15,{"$f":"'Wettkampf 1'!B24","v":"Rudi Fromme"},{"$f":"'Wettkampf 1'!C24","v":"Neubörger II"},300.8,null,300.8,0,0,0,0,300.8,1,0,0,0,0,0,0,{"$nulls":5},{"v":0,"d":"0.0"},0,0,""]
[16,{"$f":"'Wettkampf 1'!B25","v":"Alois Schmitz"},{"$f":"'Wettkampf 1'!C25","v":"Neubörger II"},310.5,null,310.5,0,0,0,0,310.5,1,0,0,0,0,0,0,{"$nulls":5},{"v":0,"d":"0.0"},0,0,""]
[17,{"$f":"'Wettkampf 1'!B26","v":"Ludwig Langen"},{"$f":"'Wettkampf 1'!C26","v":"Neubörger II"},309.4,null,309.4,0,0,0,0,309.4,1,0,0,0,0,0,0,{"$nulls":5},{"v":0,"d":"0.0"},0,0,""]
[18,{"$f":"'Wettkampf 1'!B27","v":"Rainer Wielenberg"},{"$f":"'Wettkampf 1'!C27","v":"Esterwegen II"},303.5,"x","0",0,0,"0",0,0,0,0,0,0,0,0,0,{"$nulls":5},{"v":0,"d":"0.0"},0,0,""]
[19,{"$f":"'Wettkampf 1'!B28","v":"Meik Sieger"},{"$f":"'Wettkampf 1'!C28","v":"Esterwegen II"},311.7,null,311.7,0,0,311.7,1,0,0,0,0,0,0,0,0,{"$nulls":5},{"v":0,"d":"0.0"},0,0,""]
[20,{"$f":"'Wettkampf 1'!B29","v":"Dennis Lindemann"},{"$f":"'Wettkampf 1'!C29","v":"Esterwegen II"},308.2,null,308.2,0,0,308.2,1,0,0,0,0,0,0,0,0,{"$nulls":5},{"v":0,"d":"0.0"},0,0,""]
[21,{"$f":"'Wettkampf 1'!B30","v":"Andreas Lindemann"},{"$f":"'Wettkampf 1'!C30","v":"Esterwegen II"},305.5,"x","0",0,0,"0",0,0,0,0,0,0,0,0,0,{"$nulls":5},{"v":0,"d":"0.0"},0,0,""]
[22,{"$f":"'Wettkampf 1'!B31","v":"Johannes Gebken"},{"$f":"'Wettkampf 1'!C31","v":"Esterwegen II"},{"v":0,"d":"0.0"},"x","0",0,0,"0",0,0,0,0,0,0,0,0,0,{"$nulls":5},{"v":0,"d":"0.0"},1,0,""]
[23,{"$f":"'Wettkampf 1'!B32","v":"Jan-Niklas Lindemann"},{"$f":"'Wettkampf 1'!C32","v":"Esterwegen II"},{"v":0,"d":"0.0"},"x","0",0,0,"0",0,0,0,0,0,0,0,0,0,{"$nulls":5},{"v":0,"d":"0.0"},1,0,""]
[24,{"$f":"'Wettkampf 1'!B33","v":"Stefan Burlager"},{"$f":"'Wettkampf 1'!C33","v":"Esterwegen II"},306.8,null,306.8,0,0,306.8,1,0,0,0,0,0,0,0,0,{"$nulls":5},{"v":0,"d":"0.0"},0,0,""]
[25,{"$f":"'Wettkampf 1'!B34","v":"Franz Ostermann"},{"$f":"'Wettkampf 1'!C34","v":"Eisten II "},308.2,"x","0",0,0,0,0,0,0,0,0,0,0,"0",0,{"$nulls":5},{"v":0,"d":"0.0"},0,0,""]
[26,{"$f":"'Wettkampf 1'!B35","v":"Martin Hackmann"},{"$f":"'Wettkampf 1'!C35","v":"Eisten II "},{"v":311,"d":"311.0"},null,{"v":311,"d":"311.0"},0,0,0,0,0,0,0,0,0,0,311,1,{"$nulls":5},{"v":0,"d":"0.0"},0,0,""]
[27,{"$f":"'Wettkampf 1'!B36","v":"Günther Baalmann"},{"$f":"'Wettkampf 1'!C36","v":"Eisten II "},314.5,null,314.5,0,0,0,0,0,0,0,0,0,0,314.5,1,{"$nulls":5},{"v":0,"d":"0.0"},0,0,""]
[28,{"$f":"'Wettkampf 1'!B37","v":"Martin Poker"},{"$f":"'Wettkampf 1'!C37","v":"Eisten II "},311.8,null,311.8,0,0,0,0,0,0,0,0,0,0,311.8,1,{"$nulls":5},{"v":0,"d":"0.0"},0,0,""]
[29,{"$f":"'Wettkampf 1'!B38","v":"Schütze 29"},{"$f":"'Wettkampf 1'!C38","v":{"v":0,"d":"0.0"}},null,null,{"v":0,"d":"0.0"},0,0,0,0,0,0,0,0,0,0,0,0,{"$nulls":5},{"v":0,"d":"0.0"},1,0,""]
[30,{"$f":"'Wettkampf 1'!B39","v":"Schütze 30"},{"$f":"'Wettkampf 1'!C39","v":{"v":0,"d":"0.0"}},null,null,{"v":0,"d":"0.0"},0,0,0,0,0,0,0,0,0,0,0,0,{"$nulls":5},{"v":0,"d":"0.0"},1,0,""]
[31,{"$f":"'Wettkampf 1'!B40","v":"Schütze 31"},{"$f":"'Wettkampf 1'!C40","v":{"v":0,"d":"0.0"}},null,null,{"v":0,"d":"0.0"},0,0,0,0,0,0,0,0,0,0,0,0,{"$nulls":5},{"v":0,"d":"0.0"},1,0,""]
[32,{"$f":"'Wettkampf 1'!B41","v":"Schütze 32"},{"$f":"'Wettkampf 1'!C41","v":{"v":0,"d":"0.0"}},null,null,{"v":0,"d":"0.0"},0,0,0,0,0,0,0,0,0,0,0,0,{"$nulls":5},{"v":0,"d":"0.0"},1,0,""]
[33,{"$f":"'Wettkampf 1'!B42","v":"Schütze 33"},{"$f":"'Wettkampf 1'!C42","v":{"v":0,"d":"0.0"}},null,null,{"v":0,"d":"0.0"},0,0,0,0,0,0,0,0,0,0,0,0,{"$nulls":5},{"v":0,"d":"0.0"},1,0,""]
[34,{"$f":"'Wettkampf 1'!B43","v":"Schütze 34"},{"$f":"'Wettkampf 1'!C43","v":{"v":0,"d":"0.0"}},null,null,{"v":0,"d":"0.0"},0,0,0,0,0,0,0,0,0,0,0,0,{"$nulls":5},{"v":0,"d":"0.0"},1,0,""]
[35,{"$f":"'Wettkampf 1'!B44","v":"Schütze 35"},{"$f":"'Wettkampf 1'!C44","v":{"v":0,"d":"0.0"}},null,null,{"v":0,"d":"0.0"},0,0,0,0,0,0,0,0,0,0,0,0,{"$nulls":5},{"v":0,"d":"0.0"},1,0,""]
[36,{"$f":"'Wettkampf 1'!B45","v":"Schütze 36"},{"$f":"'Wettkampf 1'!C45","v":{"v":0,"d":"0.0"}},null,null,{"v":0,"d":"0.0"},0,0,0,0,0,0,0,0,0,0,0,0,{"$nulls":5},{"v":0,"d":"0.0"},1,0,""]
[{"$nulls":6},{"$f":"LARGE(G10:G45,1)+LARGE(G10:G45,2)+LARGE(G10:G45,3)","v":935.4},{"$f":"SUM(H10:H45)","v":4},{"$f":"LARGE(I10:I45,1)+LARGE(I10:I45,2)+LARGE(I10:I45,3)","v":926.7},{"$f":"SUM(J10:J45)","v":3},{"$f":"LARGE(K10:K45,1)+LARGE(K10:K45,2)+LARGE(K10:K45,3)","v":924.4},{"$f":"SUM(L10:L45)","v":4},{"$f":"LARGE(M10:M45,1)+LARGE(M10:M45,2)+LARGE(M10:M45,3)","v":920.4000000000001},{"$f":"SUM(N10:N45)","v":4},{"$f":"LARGE(O10:O45,1)+LARGE(O10:O45,2)+LARGE(O10:O45,3)","v":929.6999999999999},{"$f":"SUM(P10:P45)","v":4},{"$f":"LARGE(Q10:Q45,1)+LARGE(Q10:Q45,2)+LARGE(Q10:Q45,3)","v":937.3},{"$f":"SUM(R10:S45)","v":3}]
[null,null,"per Email an: sk-huemmling@gmx.de"]

{"sheet":"10","index":10,"n_rows":47,"n_cols":27,"rows_kept":47,"merged":[[0,22,0,23],[1,22,1,23],[4,22,4,23],[5,22,5,23],[6,22,6,23],[8,20,8,23]]}
[null,"Verein / Gruppe",null,"Ergebnisse",{"$nulls":17},"Austragungsort:",{"$f":"Übersicht!O4","v":"Lahn"}]
[1,{"$f":"'Wettkampf 1'!B2","v":"Spahnharrenstätte III"},null,{"$f":"G46","v":934.9},{"$f":"IF(H46>4,\"Es sind zu viele Schützen in Wertung!\",\" \")","v":" "},{"$nulls":16},"Wettkampftag:",{"$f":"Übersicht!O3","v":"01.03."}]
[2,{"$f":"'Wettkampf 1'!B3","v":"Esterwegen II"},null,{"$f":"I46","v":920.3},{"$f":"IF(J46>4,\"Es sind zu viele Schützen in Wertung!\",\" \")","v":" "}]
[3,{"$f":"'Wettkampf 1'!B4","v":"Neubörger II"},null,{"$f":"K46","v":920.5},{"$f":"IF(L46>4,\"Es sind zu viele Schützen in Wertung!\",\" \")","v":" "},{"$nulls":18},"Ansprechpartner für Rückfragen:"]
[4,{"$f":"'Wettkampf 1'!B5","v":"Lahn V"},null,{"$f":"M46","v":911.9},{"$f":"IF(N46>4,\"Es sind zu viele Schützen in Wertung!\",\" \")","v":" "},{"$nulls":16},"Name:","Nortmann"]
[5,{"$f":"'Wettkampf 1'!B6","v":"Spahnharrenstätte II"},null,{"$f":"O46","v":929.7},{"$f":"IF(P46>4,\"Es sind zu viele Schützen in Wertung!\",\" \")","v":" "},{"$nulls":16},"Tel:"]
[6,{"$f":"'Wettkampf 1'!B7","v":"Eisten II "},null,{"$f":"Q46","v":936.1},{"$f":"IF(R46>4,\"Es sind zu viele Schützen in Wertung!\",\" \")","v":" "},{"$nulls":16},"Standaufsicht:","Lahn V"]
[]
[null,"Einzelergebnisse:","Verein / Gruppe","Ergebnisse (mindestens 0 eintragen)","AW? Dann x eintippen",null,"Verein 1",null,"Verein 2",null,"Verein 3",null,"Verein 4",null,"Verein 5",null,"Verein 6",{"$nulls":3},"Proberechnung bei Streifen:"]
[1,{"$f":"'Wettkampf 1'!B10","v":"Heiko Micksch"},{"$f":"'Wettkampf 1'!C10","v":"Spahnharrenstätte III"},306.9,null,{"$f":"IF(E10=\"x\",\"0\",D10)","v":306.9},{"$f":"IF(C10=$B$2,F10,0)","v":306.9},{"$f":"(IF(AND($E10=\"\",$C10=$B$2),1,0))","v":1},{"$f":"IF($C10=$B$3,F10,0)","v":0},{"$f":"(IF(AND($E10=\"\",$C10=$B$3),1,0))","v":0},{"$f":"IF($C10=$B$4,F10,0)","v":0},{"$f":"(IF(AND($E10=\"\",$C10=$B$4),1,0))","v":0},{"$f":"IF($C10=$B$5,F10,0)","v":0},{"$f":"(IF(AND($E10=\"\",$C10=$B$5),1,0))","v":0},{"$f":"IF($C10=$B$6,F10,0)","v":0},{"$f":"(IF(AND($E10=\"\",$C10=$B$6),1,0))","v":0},{"$f":"IF($C10=$B$7,F10,0)","v":0},{"$f":"(IF(AND($E10=\"\",$C10=$B$7),1,0))","v":0},{"$nulls":5},{"$f":"U10+V10+W10","v":{"v":0,"d":"0.0"}},{"$f":"IF(X10=D10,1,0)","v":0},{"$f":"IF(X10=0,0,1)","v":0},{"$f":"IF(Y10+Z10=2,\"Korrekt\",\"\")","v":""}]
[2,{"$f":"'Wettkampf 1'!B11","v":"Dirk Meyer"},{"$f":"'Wettkampf 1'!C11","v":"Spahnharrenstätte III"},312.7,null,{"$f":"IF(E11=\"x\",\"0\",D11)","v":312.7},{"$f":"IF(C11=$B$2,F11,0)","v":312.7},{"$f":"(IF(AND($E11=\"\",$C11=$B$2),1,0))","v":1},{"$f":"IF($C11=$B$3,F11,0)","v":0},{"$f":"(IF(AND($E11=\"\",$C11=$B$3),1,0))","v":0},{"$f":"IF($C11=$B$4,F11,0)","v":0},{"$f":"(IF(AND($E11=\"\",$C11=$B$4),1,0))","v":0},{"$f":"IF($C11=$B$5,F11,0)","v":0},{"$f":"(IF(AND($E11=\"\",$C11=$B$5),1,0))","v":0},{"$f":"IF($C11=$B$6,F11,0)","v":0},{"$f":"(IF(AND($E11=\"\",$C11=$B$6),1,0))","v":0},{"$f":"IF($C11=$B$7,F11,0)","v":0},{"$f":"(IF(AND($E11=\"\",$C11=$B$7),1,0))","v":0},{"$nulls":5},{"$f":"U11+V11+W11","v":{"v":0,"d":"0.0"}},{"$f":"IF(X11=D11,1,0)","v":0},{"$f":"IF(X11=0,0,1)","v":0},{"$f":"IF(Y11+Z11=2,\"Korrekt\",\"\")","v":""}]
[3,{"$f":"'Wettkampf 1'!B12","v":"Sebastian Albers"},{"$f":"'Wettkampf 1'!C12","v":"Spahnharrenstätte III"},304.8,"x","0","0",0,0,0,0,0,0,0,0,0,0,0,{"$nulls":5},{"v":0,"d":"0.0"},0,0,""]
[4,{"$f":"'Wettkampf 1'!B13","v":"Achim Will"},{"$f":"'Wettkampf 1'!C13","v":"Spahnharrenstätte III"},315.3,null,315.3,315.3,1,0,0,0,0,0,0,0,0,0,0,{"$nulls":5},{"v":0,"d":"0.0"},0,0,""]
[5,{"$f":"'Wettkampf 1'!B14","v":"Christian Grönheim"},{"$f":"'Wettkampf 1'!C14","v":"Spahnharrenstätte III"},303.1,null,303.1,303.1,1,0,0,0,0,0,0,0,0,0,0,{"$nulls":5},{"v":0,"d":"0.0"},0,0,""]
[6,{"$f":"'Wettkampf 1'!B15","v":"Dieter Hanekamp"},{"$f":"'Wettkampf 1'!C15","v":"Spahnharrenstätte II"},309.5,null,309.5,0,0,0,0,0,0,0,0,309.5,1,0,0,{"$nulls":5},{"v":0,"d":"0.0"},0,0,""]
[7,{"$f":"'Wettkampf 1'!B16","v":"Josef Langen"},{"$f":"'Wettkampf 1'!C16","v":"Spahnharrenstätte II"},307.9,null,307.9,0,0,0,0,0,0,0,0,307.9,1,0,0,{"$nulls":5},{"v":0,"d":"0.0"},0,0,""]
[8,{"$f":"'Wettkampf 1'!B17","v":"Johannes Hülsmann"},{"$f":"'Wettkampf 1'!C17","v":"Spahnharrenstätte II"},308.5,null,308.5,0,0,0,0,0,0,0,0,308.5,1,0,0,{"$nulls":5},{"v":0,"d":"0.0"},0,0,""]
[9,{"$f":"'Wettkampf 1'!B18","v":"Heiner Kröger"},{"$f":"'Wettkampf 1'!C18","v":"Spahnharrenstätte II"},311.7,null,311.7,0,0,0,0,0,0,0,0,311.7,1,0,0,{"$nulls":5},{"v":0,"d":"0.0"},0,0,""]
[10,{"$f":"'Wettkampf 1'!B19","v":"Bernd Nortmann"},{"$f":"'Wettkampf 1'!C19","v":"Lahn V"},304.5,null,304.5,0,0,0,0,0,0,304.5,1,0,0,0,0,{"$nulls":5},{"v":0,"d":"0.0"},0,0,""]
[11,{"$f":"'Wettkampf 1'!B20","v":"Oliver Reinelt"},{"$f":"'Wettkampf 1'!C20","v":"Lahn V"},{"v":299,"d":"299.0"},null,{"v":299,"d":"299.0"},0,0,0,0,0,0,299,1,0,0,0,0,{"$nulls":5},{"v":0,"d":"0.0"},0,0,""]
[12,{"$f":"'Wettkampf 1'!B21","v":"Simon Schukenbrock"},{"$f":"'Wettkampf 1'!C21","v":"Lahn V"},308.4,null,308.4,0,0,0,0,0,0,308.4,1,0,0,0,0,{"$nulls":5},{"v":0,"d":"0.0"},0,0,""]
[13,{"$f":"'Wettkampf 1'!B22","v":"Michael Boje"},{"$f":"'Wettkampf 1'!C22","v":"Lahn V"},{"v":0,"d":"0.0"},null,{"v":0,"d":"0.0"},0,0,0,0,0,0,0,1,0,0,0,0,{"$nulls":5},{"v":0,"d":"0.0"},1,0,""]
[14,{"$f":"'Wettkampf 1'!B23","v":"Ludger Hermes"},{"$f":"'Wettkampf 1'!C23","v":"Neubörger II"},305.8,null,305.8,0,0,0,0,305.8,1,0,0,0,0,0,0,{"$nulls":5},{"v":0,"d":"0.0"},0,0,""]
[15,{"$f":"'Wettkampf 1'!B24","v":"Rudi Fromme"},{"$f":"'Wettkampf 1'!C24","v":"Neubörger II"},304.2,null,304.2,0,0,0,0,304.2,1,0,0,0,0,0,0,{"$nulls":5},{"v":0,"d":"0.0"},0,0,""]
[16,{"$f":"'Wettkampf 1'!B25","v":"Alois Schmitz"},{"$f":"'Wettkampf 1'!C25","v":"Neubörger II"},306.4,null,306.4,0,0,0,0,306.4,1,0,0,0,0,0,0,{"$nulls":5},{"v":0,"d":"0.0"},0,0,""]
[17,{"$f":"'Wettkampf 1'!B26","v":"Ludwig Langen"},{"$f":"'Wettkampf 1'!C26","v":"Neubörger II"},308.3,null,308.3,0,0,0,0,308.3,1,0,0,0,0,0,0,{"$nulls":5},{"v":0,"d":"0.0"},0,0,""]
[18,{"$f":"'Wettkampf 1'!B27","v":"Rainer Wielenberg"},{"$f":"'Wettkampf 1'!C27","v":"Esterwegen II"},299.5,"x","0",0,0,"0",0,0,0,0,0,0,0,0,0,{"$nulls":5},{"v":0,"d":"0.0"},0,0,""]
[19,{"$f":"'Wettkampf 1'!B28","v":"Meik Sieger"},{"$f":"'Wettkampf 1'!C28","v":"Esterwegen II"},306.8,null,306.8,0,0,306.8,1,0,0,0,0,0,0,0,0,{"$nulls":5},{"v":0,"d":"0.0"},0,0,""]
[20,{"$f":"'Wettkampf 1'!B29","v":"Dennis Lindemann"},{"$f":"'Wettkampf 1'!C29","v":"Esterwegen II"},{"v":307,"d":"307.0"},null,{"v":307,"d":"307.0"},0,0,307,1,0,0,0,0,0,0,0,0,{"$nulls":5},{"v":0,"d":"0.0"},0,0,""]
[21,{"$f":"'Wettkampf 1'!B30","v":"Andreas Lindemann"},{"$f":"'Wettkampf 1'!C30","v":"Esterwegen II"},302.7,null,302.7,0,0,302.7,1,0,0,0,0,0,0,0,0,{"$nulls":5},{"v":0,"d":"0.0"},0,0,""]
[22,{"$f":"'Wettkampf 1'!B31","v":"Johannes Gebken"},{"$f":"'Wettkampf 1'!C31","v":"Esterwegen II"},{"v":0,"d":"0.0"},"x","0",0,0,"0",0,0,0,0,0,0,0,0,0,{"$nulls":5},{"v":0,"d":"0.0"},1,0,""]
[23,{"$f":"'Wettkampf 1'!B32","v":"Jan-Niklas Lindemann"},{"$f":"'Wettkampf 1'!C32","v":"Esterwegen II"},{"v":0,"d":"0.0"},"x","0",0,0,"0",0,0,0,0,0,0,0,0,0,{"$nulls":5},{"v":0,"d":"0.0"},1,0,""]
[24,{"$f":"'Wettkampf 1'!B33","v":"Stefan Burlager"},{"$f":"'Wettkampf 1'!C33","v":"Esterwegen II"},306.5,null,306.5,0,0,306.5,1,0,0,0,0,0,0,0,0,{"$nulls":5},{"v":0,"d":"0.0"},0,0,""]
[25,{"$f":"'Wettkampf 1'!B34","v":"Franz Ostermann"},{"$f":"'Wettkampf 1'!C34","v":"Eisten II "},297.8,null,297.8,0,0,0,0,0,0,0,0,0,0,297.8,1,{"$nulls":5},{"v":0,"d":"0.0"},0,0,""]
[26,{"$f":"'Wettkampf 1'!B35","v":"Martin Hackmann"},{"$f":"'Wettkampf 1'!C35","v":"Eisten II "},310.6,null,310.6,0,0,0,0,0,0,0,0,0,0,310.6,1,{"$nulls":5},{"v":0,"d":"0.0"},0,0,""]
[27,{"$f":"'Wettkampf 1'!B36","v":"Günther Baalmann"},{"$f":"'Wettkampf 1'!C36","v":"Eisten II "},311.3,null,311.3,0,0,0,0,0,0,0,0,0,0,311.3,1,{"$nulls":5},{"v":0,"d":"0.0"},0,0,""]
[28,{"$f":"'Wettkampf 1'!B37","v":"Martin Poker"},{"$f":"'Wettkampf 1'!C37","v":"Eisten II "},314.2,null,314.2,0,0,0,0,0,0,0,0,0,0,314.2,1,{"$nulls":5},{"v":0,"d":"0.0"},0,0,""]
[29,{"$f":"'Wettkampf 1'!B38","v":"Schütze 29"},{"$f":"'Wettkampf 1'!C38","v":{"v":0,"d":"0.0"}},null,"x","0",0,0,0,0,0,0,0,0,0,0,0,0,{"$nulls":5},{"v":0,"d":"0.0"},1,0,""]
[30,{"$f":"'Wettkampf 1'!B39","v":"Schütze 30"},{"$f":"'Wettkampf 1'!C39","v":{"v":0,"d":"0.0"}},null,"x","0",0,0,0,0,0,0,0,0,0,0,0,0,{"$nulls":5},{"v":0,"d":"0.0"},1,0,""]
[31,{"$f":"'Wettkampf 1'!B40","v":"Schütze 31"},{"$f":"'Wettkampf 1'!C40","v":{"v":0,"d":"0.0"}},null,null,{"v":0,"d":"0.0"},0,0,0,0,0,0,0,0,0,0,0,0,{"$nulls":5},{"v":0,"d":"0.0"},1,0,""]
[32,{"$f":"'Wettkampf 1'!B41","v":"Schütze 32"},{"$f":"'Wettkampf 1'!C41","v":{"v":0,"d":"0.0"}},null,null,{"v":0,"d":"0.0"},0,0,0,0,0,0,0,0,0,0,0,0,{"$nulls":5},{"v":0,"d":"0.0"},1,0,""]
[33,{"$f":"'Wettkampf 1'!B42","v":"Schütze 33"},{"$f":"'Wettkampf 1'!C42","v":{"v":0,"d":"0.0"}},null,null,{"v":0,"d":"0.0"},0,0,0,0,0,0,0,0,0,0,0,0,{"$nulls":5},{"v":0,"d":"0.0"},1,0,""]
[34,{"$f":"'Wettkampf 1'!B43","v":"Schütze 34"},{"$f":"'Wettkampf 1'!C43","v":{"v":0,"d":"0.0"}},null,null,{"v":0,"d":"0.0"},0,0,0,0,0,0,0,0,0,0,0,0,{"$nulls":5},{"v":0,"d":"0.0"},1,0,""]
[35,{"$f":"'Wettkampf 1'!B44","v":"Schütze 35"},{"$f":"'Wettkampf 1'!C44","v":{"v":0,"d":"0.0"}},null,"x","0",0,0,0,0,0,0,0,0,0,0,0,0,{"$nulls":5},{"v":0,"d":"0.0"},1,0,""]
[36,{"$f":"'Wettkampf 1'!B45","v":"Schütze 36"},{"$f":"'Wettkampf 1'!C45","v":{"v":0,"d":"0.0"}},null,"x","0",0,0,0,0,0,0,0,0,0,0,0,0,{"$nulls":5},{"v":0,"d":"0.0"},1,0,""]
[{"$nulls":6},{"$f":"LARGE(G10:G45,1)+LARGE(G10:G45,2)+LARGE(G10:G45,3)","v":934.9},{"$f":"SUM(H10:H45)","v":4},{"$f":"LARGE(I10:I45,1)+LARGE(I10:I45,2)+LARGE(I10:I45,3)","v":920.3},{"$f":"SUM(J10:J45)","v":4},{"$f":"LARGE(K10:K45,1)+LARGE(K10:K45,2)+LARGE(K10:K45,3)","v":920.5},{"$f":"SUM(L10:L45)","v":4},{"$f":"LARGE(M10:M45,1)+LARGE(M10:M45,2)+LARGE(M10:M45,3)","v":911.9},{"$f":"SUM(N10:N45)","v":4},{"$f":"LARGE(O10:O45,1)+LARGE(O10:O45,2)+LARGE(O10:O45,3)","v":929.7},{"$f":"SUM(P10:P45)","v":4},{"$f":"LARGE(Q10:Q45,1)+LARGE(Q10:Q45,2)+LARGE(Q10:Q45,3)","v":936.1},{"$f":"SUM(R10:S45)","v":4}]
[null,null,"per Email an: sk-huemmling@gmx.de"]

{"sheet":"11","index":11,"n_rows":47,"n_cols":27,"rows_kept":47,"merged":[[0,22,0,23],[1,22,1,23],[4,22,4,23],[5,22,5,23],[6,22,6,23],[8,20,8,23]]}
[null,"Verein / Gruppe",null,"Ergebnisse",{"$nulls":17},"Austragungsort:",{"$f":"Übersicht!P4","v":"Spahnharrenstätte"}]
[1,{"$f":"'Wettkampf 1'!B2","v":"Spahnharrenstätte III"},null,{"$f":"G46","v":{"v":938.9000000000001,"d":"938.9"}},{"$f":"IF(H46>4,\"Es sind zu viele Schützen in Wertung!\",\" \")","v":" "},{"$nulls":16},"Wettkampftag:",{"$f":"Übersicht!P3","v":"15.03."}]
[2,{"$f":"'Wettkampf 1'!B3","v":"Esterwegen II"},null,{"$f":"I46","v":{"v":923.6000000000001,"d":"923.6"}},{"$f":"IF(J46>4,\"Es sind zu viele Schützen in Wertung!\",\" \")","v":" "}]
[3,{"$f":"'Wettkampf 1'!B4","v":"Neubörger II"},null,{"$f":"K46","v":927.6},{"$f":"IF(L46>4,\"Es sind zu viele Schützen in Wertung!\",\" \")","v":" "},{"$nulls":18},"Ansprechpartner für Rückfragen:"]
[4,{"$f":"'Wettkampf 1'!B5","v":"Lahn V"},null,{"$f":"M46","v":608.1},{"$f":"IF(N46>4,\"Es sind zu viele Schützen in Wertung!\",\" \")","v":" "},{"$nulls":16},"Name:","Josef Langen"]
[5,{"$f":"'Wettkampf 1'!B6","v":"Spahnharrenstätte II"},null,{"$f":"O46","v":{"v":928,"d":"928.0"}},{"$f":"IF(P46>4,\"Es sind zu viele Schützen in Wertung!\",\" \")","v":" "},{"$nulls":16},"Tel:"]
[6,{"$f":"'Wettkampf 1'!B7","v":"Eisten II "},null,{"$f":"Q46","v":944.5},{"$f":"IF(R46>4,\"Es sind zu viele Schützen in Wertung!\",\" \")","v":" "},{"$nulls":16},"Standaufsicht:","Josef Langen"]
[]
[null,"Einzelergebnisse:","Verein / Gruppe","Ergebnisse (mindestens 0 eintragen)","AW? Dann x eintippen",null,"Verein 1",null,"Verein 2",null,"Verein 3",null,"Verein 4",null,"Verein 5",null,"Verein 6",{"$nulls":3},"Proberechnung bei Streifen:"]
[1,{"$f":"'Wettkampf 1'!B10","v":"Heiko Micksch"},{"$f":"'Wettkampf 1'!C10","v":"Spahnharrenstätte III"},309.6,null,{"$f":"IF(E10=\"x\",\"0\",D10)","v":309.6},{"$f":"IF(C10=$B$2,F10,0)","v":309.6},{"$f":"(IF(AND($E10=\"\",$C10=$B$2),1,0))","v":1},{"$f":"IF($C10=$B$3,F10,0)","v":0},{"$f":"(IF(AND($E10=\"\",$C10=$B$3),1,0))","v":0},{"$f":"IF($C10=$B$4,F10,0)","v":0},{"$f":"(IF(AND($E10=\"\",$C10=$B$4),1,0))","v":0},{"$f":"IF($C10=$B$5,F10,0)","v":0},{"$f":"(IF(AND($E10=\"\",$C10=$B$5),1,0))","v":0},{"$f":"IF($C10=$B$6,F10,0)","v":0},{"$f":"(IF(AND($E10=\"\",$C10=$B$6),1,0))","v":0},{"$f":"IF($C10=$B$7,F10,0)","v":0},{"$f":"(IF(AND($E10=\"\",$C10=$B$7),1,0))","v":0},{"$nulls":5},{"$f":"U10+V10+W10","v":{"v":0,"d":"0.0"}},{"$f":"IF(X10=D10,1,0)","v":0},{"$f":"IF(X10=0,0,1)","v":0},{"$f":"IF(Y10+Z10=2,\"Korrekt\",\"\")","v":""}]
[2,{"$f":"'Wettkampf 1'!B11","v":"Dirk Meyer"},{"$f":"'Wettkampf 1'!C11","v":"Spahnharrenstätte III"},311.4,null,{"$f":"IF(E11=\"x\",\"0\",D11)","v":311.4},{"$f":"IF(C11=$B$2,F11,0)","v":311.4},{"$f":"(IF(AND($E11=\"\",$C11=$B$2),1,0))","v":1},{"$f":"IF($C11=$B$3,F11,0)","v":0},{"$f":"(IF(AND($E11=\"\",$C11=$B$3),1,0))","v":0},{"$f":"IF($C11=$B$4,F11,0)","v":0},{"$f":"(IF(AND($E11=\"\",$C11=$B$4),1,0))","v":0},{"$f":"IF($C11=$B$5,F11,0)","v":0},{"$f":"(IF(AND($E11=\"\",$C11=$B$5),1,0))","v":0},{"$f":"IF($C11=$B$6,F11,0)","v":0},{"$f":"(IF(AND($E11=\"\",$C11=$B$6),1,0))","v":0},{"$f":"IF($C11=$B$7,F11,0)","v":0},{"$f":"(IF(AND($E11=\"\",$C11=$B$7),1,0))","v":0},{"$nulls":5},{"$f":"U11+V11+W11","v":{"v":0,"d":"0.0"}},{"$f":"IF(X11=D11,1,0)","v":0},{"$f":"IF(X11=0,0,1)","v":0},{"$f":"IF(Y11+Z11=2,\"Korrekt\",\"\")","v":""}]
[3,{"$f":"'Wettkampf 1'!B12","v":"Sebastian Albers"},{"$f":"'Wettkampf 1'!C12","v":"Spahnharrenstätte III"},311.3,"X","0","0",0,0,0,0,0,0,0,0,0,0,0,{"$nulls":5},{"v":0,"d":"0.0"},0,0,""]
[4,{"$f":"'Wettkampf 1'!B13","v":"Achim Will"},{"$f":"'Wettkampf 1'!C13","v":"Spahnharrenstätte III"},316.3,null,316.3,316.3,1,0,0,0,0,0,0,0,0,0,0,{"$nulls":5},{"v":0,"d":"0.0"},0,0,""]
[5,{"$f":"'Wettkampf 1'!B14","v":"Christian Grönheim"},{"$f":"'Wettkampf 1'!C14","v":"Spahnharrenstätte III"},311.2,null,311.2,311.2,1,0,0,0,0,0,0,0,0,0,0,{"$nulls":5},{"v":0,"d":"0.0"},0,0,""]
[6,{"$f":"'Wettkampf 1'!B15","v":"Dieter Hanekamp"},{"$f":"'Wettkampf 1'!C15","v":"Spahnharrenstätte II"},311.3,null,311.3,0,0,0,0,0,0,0,0,311.3,1,0,0,{"$nulls":5},{"v":0,"d":"0.0"},0,0,""]
[7,{"$f":"'Wettkampf 1'!B16","v":"Josef Langen"},{"$f":"'Wettkampf 1'!C16","v":"Spahnharrenstätte II"},304.9,null,304.9,0,0,0,0,0,0,0,0,304.9,1,0,0,{"$nulls":5},{"v":0,"d":"0.0"},0,0,""]
[8,{"$f":"'Wettkampf 1'!B17","v":"Johannes Hülsmann"},{"$f":"'Wettkampf 1'!C17","v":"Spahnharrenstätte II"},{"v":305,"d":"305.0"},null,{"v":305,"d":"305.0"},0,0,0,0,0,0,0,0,305,1,0,0,{"$nulls":5},{"v":0,"d":"0.0"},0,0,""]
[9,{"$f":"'Wettkampf 1'!B18","v":"Heiner Kröger"},{"$f":"'Wettkampf 1'!C18","v":"Spahnharrenstätte II"},311.7,null,311.7,0,0,0,0,0,0,0,0,311.7,1,0,0,{"$nulls":5},{"v":0,"d":"0.0"},0,0,""]
[10,{"$f":"'Wettkampf 1'!B19","v":"Bernd Nortmann"},{"$f":"'Wettkampf 1'!C19","v":"Lahn V"},303.8,null,303.8,0,0,0,0,0,0,303.8,1,0,0,0,0,{"$nulls":5},{"v":0,"d":"0.0"},0,0,""]
[11,{"$f":"'Wettkampf 1'!B20","v":"Oliver Reinelt"},{"$f":"'Wettkampf 1'!C20","v":"Lahn V"},304.3,null,304.3,0,0,0,0,0,0,304.3,1,0,0,0,0,{"$nulls":5},{"v":0,"d":"0.0"},0,0,""]
[12,{"$f":"'Wettkampf 1'!B21","v":"Simon Schukenbrock"},{"$f":"'Wettkampf 1'!C21","v":"Lahn V"},{"v":0,"d":"0.0"},null,{"v":0,"d":"0.0"},0,0,0,0,0,0,0,1,0,0,0,0,{"$nulls":5},{"v":0,"d":"0.0"},1,0,""]
[13,{"$f":"'Wettkampf 1'!B22","v":"Michael Boje"},{"$f":"'Wettkampf 1'!C22","v":"Lahn V"},{"v":0,"d":"0.0"},null,{"v":0,"d":"0.0"},0,0,0,0,0,0,0,1,0,0,0,0,{"$nulls":5},{"v":0,"d":"0.0"},1,0,""]
[14,{"$f":"'Wettkampf 1'!B23","v":"Ludger Hermes"},{"$f":"'Wettkampf 1'!C23","v":"Neubörger II"},310.9,null,310.9,0,0,0,0,310.9,1,0,0,0,0,0,0,{"$nulls":5},{"v":0,"d":"0.0"},0,0,""]
[15,{"$f":"'Wettkampf 1'!B24","v":"Rudi Fromme"},{"$f":"'Wettkampf 1'!C24","v":"Neubörger II"},303.8,null,303.8,0,0,0,0,303.8,1,0,0,0,0,0,0,{"$nulls":5},{"v":0,"d":"0.0"},0,0,""]
[16,{"$f":"'Wettkampf 1'!B25","v":"Alois Schmitz"},{"$f":"'Wettkampf 1'!C25","v":"Neubörger II"},311.8,null,311.8,0,0,0,0,311.8,1,0,0,0,0,0,0,{"$nulls":5},{"v":0,"d":"0.0"},0,0,""]
[17,{"$f":"'Wettkampf 1'!B26","v":"Ludwig Langen"},{"$f":"'Wettkampf 1'!C26","v":"Neubörger II"},304.9,null,304.9,0,0,0,0,304.9,1,0,0,0,0,0,0,{"$nulls":5},{"v":0,"d":"0.0"},0,0,""]
[18,{"$f":"'Wettkampf 1'!B27","v":"Rainer Wielenberg"},{"$f":"'Wettkampf 1'!C27","v":"Esterwegen II"},{"v":0,"d":"0.0"},"x","0",0,0,"0",0,0,0,0,0,0,0,0,0,{"$nulls":5},{"v":0,"d":"0.0"},1,0,""]
[19,{"$f":"'Wettkampf 1'!B28","v":"Meik Sieger"},{"$f":"'Wettkampf 1'!C28","v":"Esterwegen II"},310.1,null,310.1,0,0,310.1,1,0,0,0,0,0,0,0,0,{"$nulls":5},{"v":0,"d":"0.0"},0,0,""]
[20,{"$f":"'Wettkampf 1'!B29","v":"Dennis Lindemann"},{"$f":"'Wettkampf 1'!C29","v":"Esterwegen II"},306.7,null,306.7,0,0,306.7,1,0,0,0,0,0,0,0,0,{"$nulls":5},{"v":0,"d":"0.0"},0,0,""]
[21,{"$f":"'Wettkampf 1'!B30","v":"Andreas Lindemann"},{"$f":"'Wettkampf 1'!C30","v":"Esterwegen II"},305.8,null,305.8,0,0,305.8,1,0,0,0,0,0,0,0,0,{"$nulls":5},{"v":0,"d":"0.0"},0,0,""]
[22,{"$f":"'Wettkampf 1'!B31","v":"Johannes Gebken"},{"$f":"'Wettkampf 1'!C31","v":"Esterwegen II"},{"v":0,"d":"0.0"},"x","0",0,0,"0",0,0,0,0,0,0,0,0,0,{"$nulls":5},{"v":0,"d":"0.0"},1,0,""]
[23,{"$f":"'Wettkampf 1'!B32","v":"Jan-Niklas Lindemann"},{"$f":"'Wettkampf 1'!C32","v":"Esterwegen II"},{"v":0,"d":"0.0"},"x","0",0,0,"0",0,0,0,0,0,0,0,0,0,{"$nulls":5},{"v":0,"d":"0.0"},1,0,""]
[24,{"$f":"'Wettkampf 1'!B33","v":"Stefan Burlager"},{"$f":"'Wettkampf 1'!C33","v":"Esterwegen II"},306.8,null,306.8,0,0,306.8,1,0,0,0,0,0,0,0,0,{"$nulls":5},{"v":0,"d":"0.0"},0,0,""]
[25,{"$f":"'Wettkampf 1'!B34","v":"Franz Ostermann"},{"$f":"'Wettkampf 1'!C34","v":"Eisten II "},306.5,null,306.5,0,0,0,0,0,0,0,0,0,0,306.5,1,{"$nulls":5},{"v":0,"d":"0.0"},0,0,""]
[26,{"$f":"'Wettkampf 1'!B35","v":"Martin Hackmann"},{"$f":"'Wettkampf 1'!C35","v":"Eisten II "},315.5,null,315.5,0,0,0,0,0,0,0,0,0,0,315.5,1,{"$nulls":5},{"v":0,"d":"0.0"},0,0,""]
[27,{"$f":"'Wettkampf 1'!B36","v":"Günther Baalmann"},{"$f":"'Wettkampf 1'!C36","v":"Eisten II "},315.7,null,315.7,0,0,0,0,0,0,0,0,0,0,315.7,1,{"$nulls":5},{"v":0,"d":"0.0"},0,0,""]
[28,{"$f":"'Wettkampf 1'!B37","v":"Martin Poker"},{"$f":"'Wettkampf 1'!C37","v":"Eisten II "},313.3,null,313.3,0,0,0,0,0,0,0,0,0,0,313.3,1,{"$nulls":5},{"v":0,"d":"0.0"},0,0,""]
[29,{"$f":"'Wettkampf 1'!B38","v":"Schütze 29"},{"$f":"'Wettkampf 1'!C38","v":{"v":0,"d":"0.0"}},null,null,{"v":0,"d":"0.0"},0,0,0,0,0,0,0,0,0,0,0,0,{"$nulls":5},{"v":0,"d":"0.0"},1,0,""]
[30,{"$f":"'Wettkampf 1'!B39","v":"Schütze 30"},{"$f":"'Wettkampf 1'!C39","v":{"v":0,"d":"0.0"}},null,null,{"v":0,"d":"0.0"},0,0,0,0,0,0,0,0,0,0,0,0,{"$nulls":5},{"v":0,"d":"0.0"},1,0,""]
[31,{"$f":"'Wettkampf 1'!B40","v":"Schütze 31"},{"$f":"'Wettkampf 1'!C40","v":{"v":0,"d":"0.0"}},null,null,{"v":0,"d":"0.0"},0,0,0,0,0,0,0,0,0,0,0,0,{"$nulls":5},{"v":0,"d":"0.0"},1,0,""]
[32,{"$f":"'Wettkampf 1'!B41","v":"Schütze 32"},{"$f":"'Wettkampf 1'!C41","v":{"v":0,"d":"0.0"}},null,null,{"v":0,"d":"0.0"},0,0,0,0,0,0,0,0,0,0,0,0,{"$nulls":5},{"v":0,"d":"0.0"},1,0,""]
[33,{"$f":"'Wettkampf 1'!B42","v":"Schütze 33"},{"$f":"'Wettkampf 1'!C42","v":{"v":0,"d":"0.0"}},null,null,{"v":0,"d":"0.0"},0,0,0,0,0,0,0,0,0,0,0,0,{"$nulls":5},{"v":0,"d":"0.0"},1,0,""]
[34,{"$f":"'Wettkampf 1'!B43","v":"Schütze 34"},{"$f":"'Wettkampf 1'!C43","v":{"v":0,"d":"0.0"}},null,null,{"v":0,"d":"0.0"},0,0,0,0,0,0,0,0,0,0,0,0,{"$nulls":5},{"v":0,"d":"0.0"},1,0,""]
[35,{"$f":"'Wettkampf 1'!B44","v":"Schütze 35"},{"$f":"'Wettkampf 1'!C44","v":{"v":0,"d":"0.0"}},null,null,{"v":0,"d":"0.0"},0,0,0,0,0,0,0,0,0,0,0,0,{"$nulls":5},{"v":0,"d":"0.0"},1,0,""]
[36,{"$f":"'Wettkampf 1'!B45","v":"Schütze 36"},{"$f":"'Wettkampf 1'!C45","v":{"v":0,"d":"0.0"}},null,null,{"v":0,"d":"0.0"},0,0,0,0,0,0,0,0,0,0,0,0,{"$nulls":5},{"v":0,"d":"0.0"},1,0,""]
[{"$nulls":6},{"$f":"LARGE(G10:G45,1)+LARGE(G10:G45,2)+LARGE(G10:G45,3)","v":938.9000000000001},{"$f":"SUM(H10:H45)","v":4},{"$f":"LARGE(I10:I45,1)+LARGE(I10:I45,2)+LARGE(I10:I45,3)","v":923.6000000000001},{"$f":"SUM(J10:J45)","v":4},{"$f":"LARGE(K10:K45,1)+LARGE(K10:K45,2)+LARGE(K10:K45,3)","v":927.6},{"$f":"SUM(L10:L45)","v":4},{"$f":"LARGE(M10:M45,1)+LARGE(M10:M45,2)+LARGE(M10:M45,3)","v":608.1},{"$f":"SUM(N10:N45)","v":4},{"$f":"LARGE(O10:O45,1)+LARGE(O10:O45,2)+LARGE(O10:O45,3)","v":928},{"$f":"SUM(P10:P45)","v":4},{"$f":"LARGE(Q10:Q45,1)+LARGE(Q10:Q45,2)+LARGE(Q10:Q45,3)","v":944.5},{"$f":"SUM(R10:S45)","v":4}]
[null,null,"per Email an: sk-huemmling@gmx.de"]

{"sheet":"12","index":12,"n_rows":47,"n_cols":27,"rows_kept":47,"merged":[[0,22,0,23],[1,22,1,23],[4,22,4,23],[5,22,5,23],[6,22,6,23],[8,20,8,23]]}
[null,"Verein / Gruppe",null,"Ergebnisse",{"$nulls":17},"Austragungsort:",{"$f":"Übersicht!Q4","v":"Eisten"}]
[1,{"$f":"'Wettkampf 1'!B2","v":"Spahnharrenstätte III"},null,{"$f":"G46","v":{"v":0,"d":"0.0"}},{"$f":"IF(H46>4,\"Es sind zu viele Schützen in Wertung!\",\" \")","v":"Es sind zu viele Schützen in Wertung!"},{"$nulls":16},"Wettkampftag:",{"$f":"Übersicht!Q3","v":"29.03."}]
[2,{"$f":"'Wettkampf 1'!B3","v":"Esterwegen II"},null,{"$f":"I46","v":{"v":0,"d":"0.0"}},{"$f":"IF(J46>4,\"Es sind zu viele Schützen in Wertung!\",\" \")","v":"Es sind zu viele Schützen in Wertung!"}]
[3,{"$f":"'Wettkampf 1'!B4","v":"Neubörger II"},null,{"$f":"K46","v":{"v":0,"d":"0.0"}},{"$f":"IF(L46>4,\"Es sind zu viele Schützen in Wertung!\",\" \")","v":" "},{"$nulls":18},"Ansprechpartner für Rückfragen:"]
[4,{"$f":"'Wettkampf 1'!B5","v":"Lahn V"},null,{"$f":"M46","v":{"v":0,"d":"0.0"}},{"$f":"IF(N46>4,\"Es sind zu viele Schützen in Wertung!\",\" \")","v":" "},{"$nulls":16},"Name:"]
[5,{"$f":"'Wettkampf 1'!B6","v":"Spahnharrenstätte II"},null,{"$f":"O46","v":{"v":0,"d":"0.0"}},{"$f":"IF(P46>4,\"Es sind zu viele Schützen in Wertung!\",\" \")","v":" "},{"$nulls":16},"Tel:"]
[6,{"$f":"'Wettkampf 1'!B7","v":"Eisten II "},null,{"$f":"Q46","v":{"v":0,"d":"0.0"}},{"$f":"IF(R46>4,\"Es sind zu viele Schützen in Wertung!\",\" \")","v":" "},{"$nulls":16},"Standaufsicht:"]
[]
[null,"Einzelergebnisse:","Verein / Gruppe","Ergebnisse (mindestens 0 eintragen)","AW? Dann x eintippen",null,"Verein 1",null,"Verein 2",null,"Verein 3",null,"Verein 4",null,"Verein 5",null,"Verein 6",{"$nulls":3},"Proberechnung bei Streifen:"]
[1,{"$f":"'Wettkampf 1'!B10","v":"Heiko Micksch"},{"$f":"'Wettkampf 1'!C10","v":"Spahnharrenstätte III"},null,null,{"$f":"IF(E10=\"x\",\"0\",D10)","v":{"v":0,"d":"0.0"}},{"$f":"IF(C10=$B$2,F10,0)","v":0},{"$f":"(IF(AND($E10=\"\",$C10=$B$2),1,0))","v":1},{"$f":"IF($C10=$B$3,F10,0)","v":0},{"$f":"(IF(AND($E10=\"\",$C10=$B$3),1,0))","v":0},{"$f":"IF($C10=$B$4,F10,0)","v":0},{"$f":"(IF(AND($E10=\"\",$C10=$B$4),1,0))","v":0},{"$f":"IF($C10=$B$5,F10,0)","v":0},{"$f":"(IF(AND($E10=\"\",$C10=$B$5),1,0))","v":0},{"$f":"IF($C10=$B$6,F10,0)","v":0},{"$f":"(IF(AND($E10=\"\",$C10=$B$6),1,0))","v":0},{"$f":"IF($C10=$B$7,F10,0)","v":0},{"$f":"(IF(AND($E10=\"\",$C10=$B$7),1,0))","v":0},{"$nulls":5},{"$f":"U10+V10+W10","v":{"v":0,"d":"0.0"}},{"$f":"IF(X10=D10,1,0)","v":1},{"$f":"IF(X10=0,0,1)","v":0},{"$f":"IF(Y10+Z10=2,\"Korrekt\",\"\")","v":""}]
[2,{"$f":"'Wettkampf 1'!B11","v":"Dirk Meyer"},{"$f":"'Wettkampf 1'!C11","v":"Spahnharrenstätte III"},null,null,{"$f":"IF(E11=\"x\",\"0\",D11)","v":{"v":0,"d":"0.0"}},{"$f":"IF(C11=$B$2,F11,0)","v":0},{"$f":"(IF(AND($E11=\"\",$C11=$B$2),1,0))","v":1},{"$f":"IF($C11=$B$3,F11,0)","v":0},{"$f":"(IF(AND($E11=\"\",$C11=$B$3),1,0))","v":0},{"$f":"IF($C11=$B$4,F11,0)","v":0},{"$f":"(IF(AND($E11=\"\",$C11=$B$4),1,0))","v":0},{"$f":"IF($C11=$B$5,F11,0)","v":0},{"$f":"(IF(AND($E11=\"\",$C11=$B$5),1,0))","v":0},{"$f":"IF($C11=$B$6,F11,0)","v":0},{"$f":"(IF(AND($E11=\"\",$C11=$B$6),1,0))","v":0},{"$f":"IF($C11=$B$7,F11,0)","v":0},{"$f":"(IF(AND($E11=\"\",$C11=$B$7),1,0))","v":0},{"$nulls":5},{"$f":"U11+V11+W11","v":{"v":0,"d":"0.0"}},{"$f":"IF(X11=D11,1,0)","v":1},{"$f":"IF(X11=0,0,1)","v":0},{"$f":"IF(Y11+Z11=2,\"Korrekt\",\"\")","v":""}]
[3,{"$f":"'Wettkampf 1'!B12","v":"Sebastian Albers"},{"$f":"'Wettkampf 1'!C12","v":"Spahnharrenstätte III"},null,null,{"v":0,"d":"0.0"},0,1,0,0,0,0,0,0,0,0,0,0,{"$nulls":5},{"v":0,"d":"0.0"},1,0,""]
[4,{"$f":"'Wettkampf 1'!B13","v":"Achim Will"},{"$f":"'Wettkampf 1'!C13","v":"Spahnharrenstätte III"},null,null,{"v":0,"d":"0.0"},0,1,0,0,0,0,0,0,0,0,0,0,{"$nulls":5},{"v":0,"d":"0.0"},1,0,""]
[5,{"$f":"'Wettkampf 1'!B14","v":"Christian Grönheim"},{"$f":"'Wettkampf 1'!C14","v":"Spahnharrenstätte III"},null,null,{"v":0,"d":"0.0"},0,1,0,0,0,0,0,0,0,0,0,0,{"$nulls":5},{"v":0,"d":"0.0"},1,0,""]
[6,{"$f":"'Wettkampf 1'!B15","v":"Dieter Hanekamp"},{"$f":"'Wettkampf 1'!C15","v":"Spahnharrenstätte II"},null,null,{"v":0,"d":"0.0"},0,0,0,0,0,0,0,0,0,1,0,0,{"$nulls":5},{"v":0,"d":"0.0"},1,0,""]
[7,{"$f":"'Wettkampf 1'!B16","v":"Josef Langen"},{"$f":"'Wettkampf 1'!C16","v":"Spahnharrenstätte II"},null,null,{"v":0,"d":"0.0"},0,0,0,0,0,0,0,0,0,1,0,0,{"$nulls":5},{"v":0,"d":"0.0"},1,0,""]
[8,{"$f":"'Wettkampf 1'!B17","v":"Johannes Hülsmann"},{"$f":"'Wettkampf 1'!C17","v":"Spahnharrenstätte II"},null,null,{"v":0,"d":"0.0"},0,0,0,0,0,0,0,0,0,1,0,0,{"$nulls":5},{"v":0,"d":"0.0"},1,0,""]
[9,{"$f":"'Wettkampf 1'!B18","v":"Heiner Kröger"},{"$f":"'Wettkampf 1'!C18","v":"Spahnharrenstätte II"},null,null,{"v":0,"d":"0.0"},0,0,0,0,0,0,0,0,0,1,0,0,{"$nulls":5},{"v":0,"d":"0.0"},1,0,""]
[10,{"$f":"'Wettkampf 1'!B19","v":"Bernd Nortmann"},{"$f":"'Wettkampf 1'!C19","v":"Lahn V"},null,null,{"v":0,"d":"0.0"},0,0,0,0,0,0,0,1,0,0,0,0,{"$nulls":5},{"v":0,"d":"0.0"},1,0,""]
[11,{"$f":"'Wettkampf 1'!B20","v":"Oliver Reinelt"},{"$f":"'Wettkampf 1'!C20","v":"Lahn V"},null,null,{"v":0,"d":"0.0"},0,0,0,0,0,0,0,1,0,0,0,0,{"$nulls":5},{"v":0,"d":"0.0"},1,0,""]
[12,{"$f":"'Wettkampf 1'!B21","v":"Simon Schukenbrock"},{"$f":"'Wettkampf 1'!C21","v":"Lahn V"},null,null,{"v":0,"d":"0.0"},0,0,0,0,0,0,0,1,0,0,0,0,{"$nulls":5},{"v":0,"d":"0.0"},1,0,""]
[13,{"$f":"'Wettkampf 1'!B22","v":"Michael Boje"},{"$f":"'Wettkampf 1'!C22","v":"Lahn V"},null,null,{"v":0,"d":"0.0"},0,0,0,0,0,0,0,1,0,0,0,0,{"$nulls":5},{"v":0,"d":"0.0"},1,0,""]
[14,{"$f":"'Wettkampf 1'!B23","v":"Ludger Hermes"},{"$f":"'Wettkampf 1'!C23","v":"Neubörger II"},null,null,{"v":0,"d":"0.0"},0,0,0,0,0,1,0,0,0,0,0,0,{"$nulls":5},{"v":0,"d":"0.0"},1,0,""]
[15,{"$f":"'Wettkampf 1'!B24","v":"Rudi Fromme"},{"$f":"'Wettkampf 1'!C24","v":"Neubörger II"},null,null,{"v":0,"d":"0.0"},0,0,0,0,0,1,0,0,0,0,0,0,{"$nulls":5},{"v":0,"d":"0.0"},1,0,""]
[16,{"$f":"'Wettkampf 1'!B25","v":"Alois Schmitz"},{"$f":"'Wettkampf 1'!C25","v":"Neubörger II"},null,null,{"v":0,"d":"0.0"},0,0,0,0,0,1,0,0,0,0,0,0,{"$nulls":5},{"v":0,"d":"0.0"},1,0,""]
[17,{"$f":"'Wettkampf 1'!B26","v":"Ludwig Langen"},{"$f":"'Wettkampf 1'!C26","v":"Neubörger II"},null,null,{"v":0,"d":"0.0"},0,0,0,0,0,1,0,0,0,0,0,0,{"$nulls":5},{"v":0,"d":"0.0"},1,0,""]
[18,{"$f":"'Wettkampf 1'!B27","v":"Rainer Wielenberg"},{"$f":"'Wettkampf 1'!C27","v":"Esterwegen II"},null,null,{"v":0,"d":"0.0"},0,0,0,1,0,0,0,0,0,0,0,0,{"$nulls":5},{"v":0,"d":"0.0"},1,0,""]
[19,{"$f":"'Wettkampf 1'!B28","v":"Meik Sieger"},{"$f":"'Wettkampf 1'!C28","v":"Esterwegen II"},null,null,{"v":0,"d":"0.0"},0,0,0,1,0,0,0,0,0,0,0,0,{"$nulls":5},{"v":0,"d":"0.0"},1,0,""]
[20,{"$f":"'Wettkampf 1'!B29","v":"Dennis Lindemann"},{"$f":"'Wettkampf 1'!C29","v":"Esterwegen II"},null,null,{"v":0,"d":"0.0"},0,0,0,1,0,0,0,0,0,0,0,0,{"$nulls":5},{"v":0,"d":"0.0"},1,0,""]
[21,{"$f":"'Wettkampf 1'!B30","v":"Andreas Lindemann"},{"$f":"'Wettkampf 1'!C30","v":"Esterwegen II"},null,null,{"v":0,"d":"0.0"},0,0,0,1,0,0,0,0,0,0,0,0,{"$nulls":5},{"v":0,"d":"0.0"},1,0,""]
[22,{"$f":"'Wettkampf 1'!B31","v":"Johannes Gebken"},{"$f":"'Wettkampf 1'!C31","v":"Esterwegen II"},null,null,{"v":0,"d":"0.0"},0,0,0,1,0,0,0,0,0,0,0,0,{"$nulls":5},{"v":0,"d":"0.0"},1,0,""]
[23,{"$f":"'Wettkampf 1'!B32","v":"Jan-Niklas Lindemann"},{"$f":"'Wettkampf 1'!C32","v":"Esterwegen II"},null,null,{"v":0,"d":"0.0"},0,0,0,1,0,0,0,0,0,0,0,0,{"$nulls":5},{"v":0,"d":"0.0"},1,0,""]
[24,{"$f":"'Wettkampf 1'!B33","v":"Stefan Burlager"},{"$f":"'Wettkampf 1'!C33","v":"Esterwegen II"},null,null,{"v":0,"d":"0.0"},0,0,0,1,0,0,0,0,0,0,0,0,{"$nulls":5},{"v":0,"d":"0.0"},1,0,""]
[25,{"$f":"'Wettkampf 1'!B34","v":"Franz Ostermann"},{"$f":"'Wettkampf 1'!C34","v":"Eisten II "},null,null,{"v":0,"d":"0.0"},0,0,0,0,0,0,0,0,0,0,0,1,{"$nulls":5},{"v":0,"d":"0.0"},1,0,""]
[26,{"$f":"'Wettkampf 1'!B35","v":"Martin Hackmann"},{"$f":"'Wettkampf 1'!C35","v":"Eisten II "},null,null,{"v":0,"d":"0.0"},0,0,0,0,0,0,0,0,0,0,0,1,{"$nulls":5},{"v":0,"d":"0.0"},1,0,""]
[27,{"$f":"'Wettkampf 1'!B36","v":"Günther Baalmann"},{"$f":"'Wettkampf 1'!C36","v":"Eisten II "},null,null,{"v":0,"d":"0.0"},0,0,0,0,0,0,0,0,0,0,0,1,{"$nulls":5},{"v":0,"d":"0.0"},1,0,""]
[28,{"$f":"'Wettkampf 1'!B37","v":"Martin Poker"},{"$f":"'Wettkampf 1'!C37","v":"Eisten II "},null,null,{"v":0,"d":"0.0"},0,0,0,0,0,0,0,0,0,0,0,1,{"$nulls":5},{"v":0,"d":"0.0"},1,0,""]
[29,{"$f":"'Wettkampf 1'!B38","v":"Schütze 29"},{"$f":"'Wettkampf 1'!C38","v":{"v":0,"d":"0.0"}},null,null,{"v":0,"d":"0.0"},0,0,0,0,0,0,0,0,0,0,0,0,{"$nulls":5},{"v":0,"d":"0.0"},1,0,""]
[30,{"$f":"'Wettkampf 1'!B39","v":"Schütze 30"},{"$f":"'Wettkampf 1'!C39","v":{"v":0,"d":"0.0"}},null,null,{"v":0,"d":"0.0"},0,0,0,0,0,0,0,0,0,0,0,0,{"$nulls":5},{"v":0,"d":"0.0"},1,0,""]
[31,{"$f":"'Wettkampf 1'!B40","v":"Schütze 31"},{"$f":"'Wettkampf 1'!C40","v":{"v":0,"d":"0.0"}},null,null,{"v":0,"d":"0.0"},0,0,0,0,0,0,0,0,0,0,0,0,{"$nulls":5},{"v":0,"d":"0.0"},1,0,""]
[32,{"$f":"'Wettkampf 1'!B41","v":"Schütze 32"},{"$f":"'Wettkampf 1'!C41","v":{"v":0,"d":"0.0"}},null,null,{"v":0,"d":"0.0"},0,0,0,0,0,0,0,0,0,0,0,0,{"$nulls":5},{"v":0,"d":"0.0"},1,0,""]
[33,{"$f":"'Wettkampf 1'!B42","v":"Schütze 33"},{"$f":"'Wettkampf 1'!C42","v":{"v":0,"d":"0.0"}},null,null,{"v":0,"d":"0.0"},0,0,0,0,0,0,0,0,0,0,0,0,{"$nulls":5},{"v":0,"d":"0.0"},1,0,""]
[34,{"$f":"'Wettkampf 1'!B43","v":"Schütze 34"},{"$f":"'Wettkampf 1'!C43","v":{"v":0,"d":"0.0"}},null,null,{"v":0,"d":"0.0"},0,0,0,0,0,0,0,0,0,0,0,0,{"$nulls":5},{"v":0,"d":"0.0"},1,0,""]
[35,{"$f":"'Wettkampf 1'!B44","v":"Schütze 35"},{"$f":"'Wettkampf 1'!C44","v":{"v":0,"d":"0.0"}},null,null,{"v":0,"d":"0.0"},0,0,0,0,0,0,0,0,0,0,0,0,{"$nulls":5},{"v":0,"d":"0.0"},1,0,""]
[36,{"$f":"'Wettkampf 1'!B45","v":"Schütze 36"},{"$f":"'Wettkampf 1'!C45","v":{"v":0,"d":"0.0"}},null,null,{"v":0,"d":"0.0"},0,0,0,0,0,0,0,0,0,0,0,0,{"$nulls":5},{"v":0,"d":"0.0"},1,0,""]
[{"$nulls":6},{"$f":"LARGE(G10:G45,1)+LARGE(G10:G45,2)+LARGE(G10:G45,3)","v":0},{"$f":"SUM(H10:H45)","v":5},{"$f":"LARGE(I10:I45,1)+LARGE(I10:I45,2)+LARGE(I10:I45,3)","v":0},{"$f":"SUM(J10:J45)","v":7},{"$f":"LARGE(K10:K45,1)+LARGE(K10:K45,2)+LARGE(K10:K45,3)","v":0},{"$f":"SUM(L10:L45)","v":4},{"$f":"LARGE(M10:M45,1)+LARGE(M10:M45,2)+LARGE(M10:M45,3)","v":0},{"$f":"SUM(N10:N45)","v":4},{"$f":"LARGE(O10:O45,1)+LARGE(O10:O45,2)+LARGE(O10:O45,3)","v":0},{"$f":"SUM(P10:P45)","v":4},{"$f":"LARGE(Q10:Q45,1)+LARGE(Q10:Q45,2)+LARGE(Q10:Q45,3)","v":0},{"$f":"SUM(R10:S45)","v":4}]
[null,null,"per Email an: sk-huemmling@gmx.de"]

{"sheet":"Ausdruck","index":13,"n_rows":48,"n_cols":29,"rows_kept":48,"merged":[[0,3,0,19],[0,24,0,25],[1,3,1,19],[1,24,1,25],[2,3,2,19],[3,3,3,19],[4,24,4,25],[5,24,5,25],[6,24,6,25],[8,22,8,25]]}
[null,"Verein / Gruppe","Ergebnisse",{"$f":"Übersicht!K1","v":"2019/2020"},{"$nulls":19},"Austragungsort:"]
[1,{"$f":"'Wettkampf 1'!B2","v":"Spahnharrenstätte III"},null,"Klasse:",{"$nulls":19},"Wettkampftag:"]
[2,{"$f":"'Wettkampf 1'!B3","v":"Esterwegen II"},null,{"$f":"Übersicht!M1","v":"4. Kreisklasse"}]
[3,{"$f":"'Wettkampf 1'!B4","v":"Neubörger II"},null,{"$f":"Übersicht!P1","v":"Schützen"},{"$nulls":21},"Ansprechpartner für Rückfragen:"]
[4,{"$f":"'Wettkampf 1'!B5","v":"Lahn V"},{"$nulls":21},"Name:"]
[5,{"$f":"'Wettkampf 1'!B6","v":"Spahnharrenstätte II"},{"$nulls":21},"Tel:"]
[6,{"$f":"'Wettkampf 1'!B7","v":"Eisten II "},{"$nulls":21},"Standaufsicht:"]
[]
[null,"Name Schütze","Verein/Gruppe","Ergebnis","AW? ",null,"Verein 1",null,"Verein 2",null,"Verein 3",null,"Verein 4",null,"Verein 5",null,"Verein 6",{"$nulls":3},"Geburts-datum",null,"Proberechnung bei Streifen:"]
[1,{"$f":"'Wettkampf 1'!B10","v":"Heiko Micksch"},{"$f":"'Wettkampf 1'!C10","v":"Spahnharrenstätte III"},null,null,{"$f":"IF(E10=\"x\",\"0\",D10)","v":0},{"$f":"IF(C10=$B$2,F10,0)","v":0},{"$f":"(IF(AND($E10=\"\",$C10=$B$2),1,0))","v":1},{"$f":"IF($C10=$B$3,F10,0)","v":0},{"$f":"(IF(AND($E10=\"\",$C10=$B$3),1,0))","v":0},{"$f":"IF($C10=$B$4,F10,0)","v":0},{"$f":"(IF(AND($E10=\"\",$C10=$B$4),1,0))","v":0},{"$f":"IF($C10=$B$5,F10,0)","v":0},{"$f":"(IF(AND($E10=\"\",$C10=$B$5),1,0))","v":0},{"$f":"IF($C10=$B$6,F10,0)","v":0},{"$f":"(IF(AND($E10=\"\",$C10=$B$6),1,0))","v":0},{"$f":"IF($C10=$B$7,F10,0)","v":0},{"$f":"(IF(AND($E10=\"\",$C10=$B$7),1,0))","v":0},{"$nulls":8},{"$f":"IF(Z10=D10,1,0)","v":1},{"$f":"IF(Z10=0,0,1)","v":0},{"$f":"IF(AA10+AB10=2,\"Korrekt\",\"\")","v":""}]
[2,{"$f":"'Wettkampf 1'!B11","v":"Dirk Meyer"},{"$f":"'Wettkampf 1'!C11","v":"Spahnharrenstätte III"},null,null,{"$f":"IF(E11=\"x\",\"0\",D11)","v":0},{"$f":"IF(C11=$B$2,F11,0)","v":0},{"$f":"(IF(AND($E11=\"\",$C11=$B$2),1,0))","v":1},{"$f":"IF($C11=$B$3,F11,0)","v":0},{"$f":"(IF(AND($E11=\"\",$C11=$B$3),1,0))","v":0},{"$f":"IF($C11=$B$4,F11,0)","v":0},{"$f":"(IF(AND($E11=\"\",$C11=$B$4),1,0))","v":0},{"$f":"IF($C11=$B$5,F11,0)","v":0},{"$f":"(IF(AND($E11=\"\",$C11=$B$5),1,0))","v":0},{"$f":"IF($C11=$B$6,F11,0)","v":0},{"$f":"(IF(AND($E11=\"\",$C11=$B$6),1,0))","v":0},{"$f":"IF($C11=$B$7,F11,0)","v":0},{"$f":"(IF(AND($E11=\"\",$C11=$B$7),1,0))","v":0},{"$nulls":8},{"$f":"IF(Z11=D11,1,0)","v":1},{"$f":"IF(Z11=0,0,1)","v":0},{"$f":"IF(AA11+AB11=2,\"Korrekt\",\"\")","v":""}]
[3,{"$f":"'Wettkampf 1'!B12","v":"Sebastian Albers"},{"$f":"'Wettkampf 1'!C12","v":"Spahnharrenstätte III"},null,null,0,0,1,0,0,0,0,0,0,0,0,0,0,{"$nulls":8},1,0,""]
[4,{"$f":"'Wettkampf 1'!B13","v":"Achim Will"},{"$f":"'Wettkampf 1'!C13","v":"Spahnharrenstätte III"},null,null,0,0,1,0,0,0,0,0,0,0,0,0,0,{"$nulls":8},1,0,""]
[5,{"$f":"'Wettkampf 1'!B14","v":"Christian Grönheim"},{"$f":"'Wettkampf 1'!C14","v":"Spahnharrenstätte III"},null,null,0,0,1,0,0,0,0,0,0,0,0,0,0,{"$nulls":8},1,0,""]
[6,{"$f":"'Wettkampf 1'!B15","v":"Dieter Hanekamp"},{"$f":"'Wettkampf 1'!C15","v":"Spahnharrenstätte II"},null,null,0,0,0,0,0,0,0,0,0,0,1,0,0,{"$nulls":8},1,0,""]
[7,{"$f":"'Wettkampf 1'!B16","v":"Josef Langen"},{"$f":"'Wettkampf 1'!C16","v":"Spahnharrenstätte II"},null,null,0,0,0,0,0,0,0,0,0,0,1,0,0,{"$nulls":8},1,0,""]
[8,{"$f":"'Wettkampf 1'!B17","v":"Johannes Hülsmann"},{"$f":"'Wettkampf 1'!C17","v":"Spahnharrenstätte II"},null,null,0,0,0,0,0,0,0,0,0,0,1,0,0,{"$nulls":8},1,0,""]
[9,{"$f":"'Wettkampf 1'!B18","v":"Heiner Kröger"},{"$f":"'Wettkampf 1'!C18","v":"Spahnharrenstätte II"},null,null,0,0,0,0,0,0,0,0,0,0,1,0,0,{"$nulls":8},1,0,""]
[10,{"$f":"'Wettkampf 1'!B19","v":"Bernd Nortmann"},{"$f":"'Wettkampf 1'!C19","v":"Lahn V"},null,null,0,0,0,0,0,0,0,0,1,0,0,0,0,{"$nulls":8},1,0,""]
[11,{"$f":"'Wettkampf 1'!B20","v":"Oliver Reinelt"},{"$f":"'Wettkampf 1'!C20","v":"Lahn V"},null,null,0,0,0,0,0,0,0,0,1,0,0,0,0,{"$nulls":8},1,0,""]
[12,{"$f":"'Wettkampf 1'!B21","v":"Simon Schukenbrock"},{"$f":"'Wettkampf 1'!C21","v":"Lahn V"},null,null,0,0,0,0,0,0,0,0,1,0,0,0,0,{"$nulls":8},1,0,""]
[13,{"$f":"'Wettkampf 1'!B22","v":"Michael Boje"},{"$f":"'Wettkampf 1'!C22","v":"Lahn V"},null,null,0,0,0,0,0,0,0,0,1,0,0,0,0,{"$nulls":8},1,0,""]
[14,{"$f":"'Wettkampf 1'!B23","v":"Ludger Hermes"},{"$f":"'Wettkampf 1'!C23","v":"Neubörger II"},null,null,0,0,0,0,0,0,1,0,0,0,0,0,0,{"$nulls":8},1,0,""]
[15,{"$f":"'Wettkampf 1'!B24","v":"Rudi Fromme"},{"$f":"'Wettkampf 1'!C24","v":"Neubörger II"},null,null,0,0,0,0,0,0,1,0,0,0,0,0,0,{"$nulls":8},1,0,""]
[16,{"$f":"'Wettkampf 1'!B25","v":"Alois Schmitz"},{"$f":"'Wettkampf 1'!C25","v":"Neubörger II"},null,null,0,0,0,0,0,0,1,0,0,0,0,0,0,{"$nulls":8},1,0,""]
[17,{"$f":"'Wettkampf 1'!B26","v":"Ludwig Langen"},{"$f":"'Wettkampf 1'!C26","v":"Neubörger II"},null,null,0,0,0,0,0,0,1,0,0,0,0,0,0,{"$nulls":8},1,0,""]
[18,{"$f":"'Wettkampf 1'!B27","v":"Rainer Wielenberg"},{"$f":"'Wettkampf 1'!C27","v":"Esterwegen II"},null,null,0,0,0,0,1,0,0,0,0,0,0,0,0,{"$nulls":8},1,0,""]
[19,{"$f":"'Wettkampf 1'!B28","v":"Meik Sieger"},{"$f":"'Wettkampf 1'!C28","v":"Esterwegen II"},null,null,0,0,0,0,1,0,0,0,0,0,0,0,0,{"$nulls":8},1,0,""]
[20,{"$f":"'Wettkampf 1'!B29","v":"Dennis Lindemann"},{"$f":"'Wettkampf 1'!C29","v":"Esterwegen II"},null,null,0,0,0,0,1,0,0,0,0,0,0,0,0,{"$nulls":8},1,0,""]
[21,{"$f":"'Wettkampf 1'!B30","v":"Andreas Lindemann"},{"$f":"'Wettkampf 1'!C30","v":"Esterwegen II"},null,null,0,0,0,0,1,0,0,0,0,0,0,0,0,{"$nulls":8},1,0,""]
[22,{"$f":"'Wettkampf 1'!B31","v":"Johannes Gebken"},{"$f":"'Wettkampf 1'!C31","v":"Esterwegen II"},null,null,0,0,0,0,1,0,0,0,0,0,0,0,0,{"$nulls":8},1,0,""]
[23,{"$f":"'Wettkampf 1'!B32","v":"Jan-Niklas Lindemann"},{"$f":"'Wettkampf 1'!C32","v":"Esterwegen II"},null,null,0,0,0,0,1,0,0,0,0,0,0,0,0,{"$nulls":8},1,0,""]
[24,{"$f":"'Wettkampf 1'!B33","v":"Stefan Burlager"},{"$f":"'Wettkampf 1'!C33","v":"Esterwegen II"},null,null,0,0,0,0,1,0,0,0,0,0,0,0,0,{"$nulls":8},1,0,""]
[25,{"$f":"'Wettkampf 1'!B34","v":"Franz Ostermann"},{"$f":"'Wettkampf 1'!C34","v":"Eisten II "},null,null,0,0,0,0,0,0,0,0,0,0,0,0,1,{"$nulls":8},1,0,""]
[26,{"$f":"'Wettkampf 1'!B35","v":"Martin Hackmann"},{"$f":"'Wettkampf 1'!C35","v":"Eisten II "},null,null,0,0,0,0,0,0,0,0,0,0,0,0,1,{"$nulls":8},1,0,""]
[27,{"$f":"'Wettkampf 1'!B36","v":"Günther Baalmann"},{"$f":"'Wettkampf 1'!C36","v":"Eisten II "},null,null,0,0,0,0,0,0,0,0,0,0,0,0,1,{"$nulls":8},1,0,""]
[28,{"$f":"'Wettkampf 1'!B37","v":"Martin Poker"},{"$f":"'Wettkampf 1'!C37","v":"Eisten II "},null,null,0,0,0,0,0,0,0,0,0,0,0,0,1,{"$nulls":8},1,0,""]
[29,{"$f":"'Wettkampf 1'!B38","v":"Schütze 29"},{"$f":"'Wettkampf 1'!C38","v":0},null,null,0,0,0,0,0,0,0,0,0,0,0,0,0,{"$nulls":8},1,0,""]
[30,{"$f":"'Wettkampf 1'!B39","v":"Schütze 30"},{"$f":"'Wettkampf 1'!C39","v":0},null,null,0,0,0,0,0,0,0,0,0,0,0,0,0,{"$nulls":8},1,0,""]
[31,{"$f":"'Wettkampf 1'!B40","v":"Schütze 31"},{"$f":"'Wettkampf 1'!C40","v":0},null,null,0,0,0,0,0,0,0,0,0,0,0,0,0,{"$nulls":8},1,0,""]
[32,{"$f":"'Wettkampf 1'!B41","v":"Schütze 32"},{"$f":"'Wettkampf 1'!C41","v":0},null,null,0,0,0,0,0,0,0,0,0,0,0,0,0,{"$nulls":8},1,0,""]
[33,{"$f":"'Wettkampf 1'!B42","v":"Schütze 33"},{"$f":"'Wettkampf 1'!C42","v":0},null,null,0,0,0,0,0,0,0,0,0,0,0,0,0,{"$nulls":8},1,0,""]
[34,{"$f":"'Wettkampf 1'!B43","v":"Schütze 34"},{"$f":"'Wettkampf 1'!C43","v":0},null,null,0,0,0,0,0,0,0,0,0,0,0,0,0,{"$nulls":8},1,0,""]
[35,{"$f":"'Wettkampf 1'!B44","v":"Schütze 35"},{"$f":"'Wettkampf 1'!C44","v":0},null,null,0,0,0,0,0,0,0,0,0,0,0,0,0,{"$nulls":8},1,0,""]
[36,{"$f":"'Wettkampf 1'!B45","v":"Schütze 36"},{"$f":"'Wettkampf 1'!C45","v":0},null,null,0,0,0,0,0,0,0,0,0,0,0,0,0,{"$nulls":8},1,0,""]
[{"$nulls":6},{"$f":"LARGE(G10:G45,1)+LARGE(G10:G45,2)+LARGE(G10:G45,3)","v":0},{"$f":"SUM(H10:H45)","v":5},{"$f":"LARGE(I10:I45,1)+LARGE(I10:I45,2)+LARGE(I10:I45,3)","v":0},{"$f":"SUM(J10:J45)","v":7},{"$f":"LARGE(K10:K45,1)+LARGE(K10:K45,2)+LARGE(K10:K45,3)","v":0},{"$f":"SUM(L10:L45)","v":4},{"$f":"LARGE(M10:M45,1)+LARGE(M10:M45,2)+LARGE(M10:M45,3)","v":0},{"$f":"SUM(N10:N45)","v":4},{"$f":"LARGE(O10:O45,1)+LARGE(O10:O45,2)+LARGE(O10:O45,3)","v":0},{"$f":"SUM(P10:P45)","v":4},{"$f":"LARGE(Q10:Q45,1)+LARGE(Q10:Q45,2)+LARGE(Q10:Q45,3)","v":0},{"$f":"SUM(R10:S45)","v":4}]
[]
[null,"Bitte beachtet, dass die Standaufsicht benannt werden muss"]

{"sheet":"Ausdruck blank","index":14,"n_rows":48,"n_cols":29,"rows_kept":48,"merged":[[0,3,0,19],[0,24,0,25],[1,3,1,19],[1,24,1,25],[2,3,2,19],[3,3,3,19],[4,24,4,25],[5,24,5,25],[6,24,6,25],[8,22,8,25]]}
[null,"Verein / Gruppe","Ergebnisse",{"$f":"Übersicht!K1","v":"2019/2020"},{"$nulls":19},"Austragungsort:"]
[1,null,null,"Klasse:",{"$nulls":19},"Wettkampftag:"]
[2]
[3,{"$nulls":24},"Ansprechpartner für Rückfragen:"]
[4,{"$nulls":22},"Name:"]
[5,{"$nulls":22},"Tel:"]
[6,{"$nulls":22},"Standaufsicht:"]
[]
[null,"Name Schütze","Verein/Gruppe","Ergebnis","AW? ",null,"Verein 1",null,"Verein 2",null,"Verein 3",null,"Verein 4",null,"Verein 5",null,"Verein 6",{"$nulls":3},"Geburts-datum",null,"Proberechnung bei Streifen:"]
[1,{"$nulls":4},{"$f":"IF(E10=\"x\",\"0\",D10)","v":0},{"$f":"IF(C10=$B$2,F10,0)","v":0},{"$f":"(IF(AND($E10=\"\",$C10=$B$2),1,0))","v":1},{"$f":"IF($C10=$B$3,F10,0)","v":0},{"$f":"(IF(AND($E10=\"\",$C10=$B$3),1,0))","v":1},{"$f":"IF($C10=$B$4,F10,0)","v":0},{"$f":"(IF(AND($E10=\"\",$C10=$B$4),1,0))","v":1},{"$f":"IF($C10=$B$5,F10,0)","v":0},{"$f":"(IF(AND($E10=\"\",$C10=$B$5),1,0))","v":1},{"$f":"IF($C10=$B$6,F10,0)","v":0},{"$f":"(IF(AND($E10=\"\",$C10=$B$6),1,0))","v":1},{"$f":"IF($C10=$B$7,F10,0)","v":0},{"$f":"(IF(AND($E10=\"\",$C10=$B$7),1,0))","v":1},{"$nulls":8},{"$f":"IF(Z10=D10,1,0)","v":1},{"$f":"IF(Z10=0,0,1)","v":0},{"$f":"IF(AA10+AB10=2,\"Korrekt\",\"\")","v":""}]
[2,{"$nulls":4},{"$f":"IF(E11=\"x\",\"0\",D11)","v":0},{"$f":"IF(C11=$B$2,F11,0)","v":0},{"$f":"(IF(AND($E11=\"\",$C11=$B$2),1,0))","v":1},{"$f":"IF($C11=$B$3,F11,0)","v":0},{"$f":"(IF(AND($E11=\"\",$C11=$B$3),1,0))","v":1},{"$f":"IF($C11=$B$4,F11,0)","v":0},{"$f":"(IF(AND($E11=\"\",$C11=$B$4),1,0))","v":1},{"$f":"IF($C11=$B$5,F11,0)","v":0},{"$f":"(IF(AND($E11=\"\",$C11=$B$5),1,0))","v":1},{"$f":"IF($C11=$B$6,F11,0)","v":0},{"$f":"(IF(AND($E11=\"\",$C11=$B$6),1,0))","v":1},{"$f":"IF($C11=$B$7,F11,0)","v":0},{"$f":"(IF(AND($E11=\"\",$C11=$B$7),1,0))","v":1},{"$nulls":8},{"$f":"IF(Z11=D11,1,0)","v":1},{"$f":"IF(Z11=0,0,1)","v":0},{"$f":"IF(AA11+AB11=2,\"Korrekt\",\"\")","v":""}]
[3,{"$nulls":4},0,0,1,0,1,0,1,0,1,0,1,0,1,{"$nulls":8},1,0,""]
[4,{"$nulls":4},0,0,1,0,1,0,1,0,1,0,1,0,1,{"$nulls":8},1,0,""]
[5,{"$nulls":4},0,0,1,0,1,0,1,0,1,0,1,0,1,{"$nulls":8},1,0,""]
[6,{"$nulls":4},0,0,1,0,1,0,1,0,1,0,1,0,1,{"$nulls":8},1,0,""]
[7,{"$nulls":4},0,0,1,0,1,0,1,0,1,0,1,0,1,{"$nulls":8},1,0,""]
[8,{"$nulls":4},0,0,1,0,1,0,1,0,1,0,1,0,1,{"$nulls":8},1,0,""]
[9,{"$nulls":4},0,0,1,0,1,0,1,0,1,0,1,0,1,{"$nulls":8},1,0,""]
[10,{"$nulls":4},0,0,1,0,1,0,1,0,1,0,1,0,1,{"$nulls":8},1,0,""]
[11,{"$nulls":4},0,0,1,0,1,0,1,0,1,0,1,0,1,{"$nulls":8},1,0,""]
[12,{"$nulls":4},0,0,1,0,1,0,1,0,1,0,1,0,1,{"$nulls":8},1,0,""]
[13,{"$nulls":4},0,0,1,0,1,0,1,0,1,0,1,0,1,{"$nulls":8},1,0,""]
[14,{"$nulls":4},0,0,1,0,1,0,1,0,1,0,1,0,1,{"$nulls":8},1,0,""]
[15,{"$nulls":4},0,0,1,0,1,0,1,0,1,0,1,0,1,{"$nulls":8},1,0,""]
[16,{"$nulls":4},0,0,1,0,1,0,1,0,1,0,1,0,1,{"$nulls":8},1,0,""]
[17,{"$nulls":4},0,0,1,0,1,0,1,0,1,0,1,0,1,{"$nulls":8},1,0,""]
[18,{"$nulls":4},0,0,1,0,1,0,1,0,1,0,1,0,1,{"$nulls":8},1,0,""]
[19,{"$nulls":4},0,0,1,0,1,0,1,0,1,0,1,0,1,{"$nulls":8},1,0,""]
[20,{"$nulls":4},0,0,1,0,1,0,1,0,1,0,1,0,1,{"$nulls":8},1,0,""]
[21,{"$nulls":4},0,0,1,0,1,0,1,0,1,0,1,0,1,{"$nulls":8},1,0,""]
[22,{"$nulls":4},0,0,1,0,1,0,1,0,1,0,1,0,1,{"$nulls":8},1,0,""]
[23,{"$nulls":4},0,0,1,0,1,0,1,0,1,0,1,0,1,{"$nulls":8},1,0,""]
[24,{"$nulls":4},0,0,1,0,1,0,1,0,1,0,1,0,1,{"$nulls":8},1,0,""]
[25,{"$nulls":4},0,0,1,0,1,0,1,0,1,0,1,0,1,{"$nulls":8},1,0,""]
[26,{"$nulls":4},0,0,1,0,1,0,1,0,1,0,1,0,1,{"$nulls":8},1,0,""]
[27,{"$nulls":4},0,0,1,0,1,0,1,0,1,0,1,0,1,{"$nulls":8},1,0,""]
[28,{"$nulls":4},0,0,1,0,1,0,1,0,1,0,1,0,1,{"$nulls":8},1,0,""]
[29,{"$nulls":4},0,0,1,0,1,0,1,0,1,0,1,0,1,{"$nulls":8},1,0,""]
[30,{"$nulls":4},0,0,1,0,1,0,1,0,1,0,1,0,1,{"$nulls":8},1,0,""]
[31,{"$nulls":4},0,0,1,0,1,0,1,0,1,0,1,0,1,{"$nulls":8},1,0,""]
[32,{"$nulls":4},0,0,1,0,1,0,1,0,1,0,1,0,1,{"$nulls":8},1,0,""]
[33,{"$nulls":4},0,0,1,0,1,0,1,0,1,0,1,0,1,{"$nulls":8},1,0,""]
[34,{"$nulls":4},0,0,1,0,1,0,1,0,1,0,1,0,1,{"$nulls":8},1,0,""]
[35,{"$nulls":4},0,0,1,0,1,0,1,0,1,0,1,0,1,{"$nulls":8},1,0,""]
[36,{"$nulls":4},0,0,1,0,1,0,1,0,1,0,1,0,1,{"$nulls":8},1,0,""]
[{"$nulls":6},{"$f":"LARGE(G10:G45,1)+LARGE(G10:G45,2)+LARGE(G10:G45,3)","v":0},{"$f":"SUM(H10:H45)","v":36},{"$f":"LARGE(I10:I45,1)+LARGE(I10:I45,2)+LARGE(I10:I45,3)","v":0},{"$f":"SUM(J10:J45)","v":36},{"$f":"LARGE(K10:K45,1)+LARGE(K10:K45,2)+LARGE(K10:K45,3)","v":0},{"$f":"SUM(L10:L45)","v":36},{"$f":"LARGE(M10:M45,1)+LARGE(M10:M45,2)+LARGE(M10:M45,3)","v":0},{"$f":"SUM(N10:N45)","v":36},{"$f":"LARGE(O10:O45,1)+LARGE(O10:O45,2)+LARGE(O10:O45,3)","v":0},{"$f":"SUM(P10:P45)","v":36},{"$f":"LARGE(Q10:Q45,1)+LARGE(Q10:Q45,2)+LARGE(Q10:Q45,3)","v":0},{"$f":"SUM(R10:S45)","v":36}]
[]
[null,"Bitte beachtet, dass die Standaufsicht benannt werden muss"]

{"sheet":"Übersicht Schützen","index":15,"n_rows":37,"n_cols":23,"rows_kept":37,"hidden":true}
[null,null,{"v":1,"d":"1.0"},{"v":2,"d":"2.0"},{"v":3,"d":"3.0"},{"v":4,"d":"4.0"},{"v":5,"d":"5.0"},{"v":6,"d":"6.0"},{"$nulls":3},{"v":7,"d":"7.0"},{"v":8,"d":"8.0"},{"v":9,"d":"9.0"},{"v":10,"d":"10.0"},{"v":11,"d":"11.0"},{"v":12,"d":"12.0"}]
["Günther Baalmann",{"$f":"VLOOKUP(A2,'Wettkampf 1'!$B$10:$C$45,2,FALSE)","v":"Eisten II "},{"$f":"VLOOKUP(A2,'Wettkampf 1'!$B$10:$D$45,3,FALSE)","v":315.3},{"$f":"VLOOKUP($A2,'2'!$B$10:$D$45,3,FALSE)","v":312.1},{"$f":"VLOOKUP($A2,'3'!$B$10:$D$45,3,FALSE)","v":316.7},{"$f":"VLOOKUP($A2,'4'!$B$10:$D$45,3,FALSE)","v":313.7},{"$f":"VLOOKUP($A2,'5'!$B$10:$D$45,3,FALSE)","v":312.8},{"$f":"VLOOKUP($A2,'6'!$B$10:$D$45,3,FALSE)","v":311.4},{"$f":"K2/J2","v":{"v":313.6666666666667,"d":"313.7"}},{"$f":"VLOOKUP(A2,Formelhilfe!$A$9:$H$44,8,FALSE)","v":{"v":6,"d":"6.0"}},{"$f":"SUM(C2:H2)","v":{"v":1882,"d":"1,882.0"}},{"$f":"VLOOKUP($A2,'7'!$B$10:$D$45,3,FALSE)","v":315.4},{"$f":"VLOOKUP($A2,'8'!$B$10:$D$45,3,FALSE)","v":313.8},{"$f":"VLOOKUP($A2,'9'!$B$10:$D$45,3,FALSE)","v":314.5},{"$f":"VLOOKUP($A2,'10'!$B$10:$D$45,3,FALSE)","v":311.3},{"$f":"VLOOKUP($A2,'11'!$B$10:$D$45,3,FALSE)","v":315.7},{"$f":"VLOOKUP($A2,'12'!$B$10:$D$45,3,FALSE)","v":{"v":0,"d":"0.0"}},{"$f":"T2/S2","v":{"v":314.14,"d":"314.1"}},{"$f":"VLOOKUP(A2,Formelhilfe!$A$9:$O$44,15,FALSE)","v":{"v":5,"d":"5.0"}},{"$f":"SUM(L2:Q2)","v":{"v":1570.7,"d":"1,570.7"}},{"$f":"W2/V2","v":{"v":313.88181818181823,"d":"313.9"}},{"$f":"VLOOKUP(A2,Formelhilfe!$A$9:$P$44,16,FALSE)","v":{"v":11,"d":"11.0"}},{"$f":"SUM(C2:H2,L2:Q2)","v":{"v":3452.7000000000003,"d":"3,452.7"}}]
["Achim Will",{"$f":"VLOOKUP(A3,'Wettkampf 1'!$B$10:$C$45,2,FALSE)","v":"Spahnharrenstätte III"},{"$f":"VLOOKUP(A3,'Wettkampf 1'!$B$10:$D$45,3,FALSE)","v":307.9},{"$f":"VLOOKUP($A3,'2'!$B$10:$D$45,3,FALSE)","v":313.7},{"$f":"VLOOKUP($A3,'3'!$B$10:$D$45,3,FALSE)","v":310.4},{"$f":"VLOOKUP($A3,'4'!$B$10:$D$45,3,FALSE)","v":313.7},{"$f":"VLOOKUP($A3,'5'!$B$10:$D$45,3,FALSE)","v":315.1},{"$f":"VLOOKUP($A3,'6'!$B$10:$D$45,3,FALSE)","v":308.4},{"$f":"K3/J3","v":{"v":311.5333333333333,"d":"311.5"}},{"$f":"VLOOKUP(A3,Formelhilfe!$A$9:$H$44,8,FALSE)","v":{"v":6,"d":"6.0"}},{"$f":"SUM(C3:H3)","v":{"v":1869.1999999999998,"d":"1,869.2"}},{"$f":"VLOOKUP($A3,'7'!$B$10:$D$45,3,FALSE)","v":314.4},{"$f":"VLOOKUP($A3,'8'!$B$10:$D$45,3,FALSE)","v":308.4},{"$f":"VLOOKUP($A3,'9'!$B$10:$D$45,3,FALSE)","v":312.7},{"$f":"VLOOKUP($A3,'10'!$B$10:$D$45,3,FALSE)","v":315.3},{"$f":"VLOOKUP($A3,'11'!$B$10:$D$45,3,FALSE)","v":316.3},{"$f":"VLOOKUP($A3,'12'!$B$10:$D$45,3,FALSE)","v":{"v":0,"d":"0.0"}},{"$f":"T3/S3","v":{"v":313.41999999999996,"d":"313.4"}},{"$f":"VLOOKUP(A3,Formelhilfe!$A$9:$O$44,15,FALSE)","v":{"v":5,"d":"5.0"}},{"$f":"SUM(L3:Q3)","v":{"v":1567.1,"d":"1,567.1"}},{"$f":"W3/V3","v":{"v":312.39090909090913,"d":"312.4"}},{"$f":"VLOOKUP(A3,Formelhilfe!$A$9:$P$44,16,FALSE)","v":{"v":11,"d":"11.0"}},{"$f":"SUM(C3:H3,L3:Q3)","v":{"v":3436.3,"d":"3,436.3"}}]
["Martin Hackmann",{"$f":"VLOOKUP(A4,'Wettkampf 1'!$B$10:$C$45,2,FALSE)","v":"Eisten II "},{"$f":"VLOOKUP(A4,'Wettkampf 1'!$B$10:$D$45,3,FALSE)","v":313.5},{"$f":"VLOOKUP($A4,'2'!$B$10:$D$45,3,FALSE)","v":307.5},{"$f":"VLOOKUP($A4,'3'!$B$10:$D$45,3,FALSE)","v":311.4},{"$f":"VLOOKUP($A4,'4'!$B$10:$D$45,3,FALSE)","v":313.3},{"$f":"VLOOKUP($A4,'5'!$B$10:$D$45,3,FALSE)","v":{"v":313,"d":"313.0"}},{"$f":"VLOOKUP($A4,'6'!$B$10:$D$45,3,FALSE)","v":311.1},{"$f":"K4/J4","v":{"v":311.6333333333334,"d":"311.6"}},{"$f":"VLOOKUP(A4,Formelhilfe!$A$9:$H$44,8,FALSE)","v":{"v":6,"d":"6.0"}},{"$f":"SUM(C4:H4)","v":{"v":1869.8000000000002,"d":"1,869.8"}},{"$f":"VLOOKUP($A4,'7'!$B$10:$D$45,3,FALSE)","v":307.4},{"$f":"VLOOKUP($A4,'8'!$B$10:$D$45,3,FALSE)","v":308.9},{"$f":"VLOOKUP($A4,'9'!$B$10:$D$45,3,FALSE)","v":{"v":311,"d":"311.0"}},{"$f":"VLOOKUP($A4,'10'!$B$10:$D$45,3,FALSE)","v":310.6},{"$f":"VLOOKUP($A4,'11'!$B$10:$D$45,3,FALSE)","v":315.5},{"$f":"VLOOKUP($A4,'12'!$B$10:$D$45,3,FALSE)","v":{"v":0,"d":"0.0"}},{"$f":"T4/S4","v":{"v":310.68,"d":"310.7"}},{"$f":"VLOOKUP(A4,Formelhilfe!$A$9:$O$44,15,FALSE)","v":{"v":5,"d":"5.0"}},{"$f":"SUM(L4:Q4)","v":{"v":1553.4,"d":"1,553.4"}},{"$f":"W4/V4","v":{"v":311.20000000000005,"d":"311.2"}},{"$f":"VLOOKUP(A4,Formelhilfe!$A$9:$P$44,16,FALSE)","v":{"v":11,"d":"11.0"}},{"$f":"SUM(C4:H4,L4:Q4)","v":{"v":3423.2000000000003,"d":"3,423.2"}}]
["Martin Poker",{"$f":"VLOOKUP(A5,'Wettkampf 1'!$B$10:$C$45,2,FALSE)","v":"Eisten II "},{"$f":"VLOOKUP(A5,'Wettkampf 1'!$B$10:$D$45,3,FALSE)","v":307.3},{"$f":"VLOOKUP($A5,'2'!$B$10:$D$45,3,FALSE)","v":313.4},{"$f":"VLOOKUP($A5,'3'!$B$10:$D$45,3,FALSE)","v":{"v":311,"d":"311.0"}},{"$f":"VLOOKUP($A5,'4'!$B$10:$D$45,3,FALSE)","v":310.5},{"$f":"VLOOKUP($A5,'5'!$B$10:$D$45,3,FALSE)","v":310.9},{"$f":"VLOOKUP($A5,'6'!$B$10:$D$45,3,FALSE)","v":311.8},{"$f":"K5/J5","v":{"v":310.81666666666666,"d":"310.8"}},{"$f":"VLOOKUP(A5,Formelhilfe!$A$9:$H$44,8,FALSE)","v":{"v":6,"d":"6.0"}},{"$f":"SUM(C5:H5)","v":{"v":1864.8999999999999,"d":"1,864.9"}},{"$f":"VLOOKUP($A5,'7'!$B$10:$D$45,3,FALSE)","v":312.6},{"$f":"VLOOKUP($A5,'8'!$B$10:$D$45,3,FALSE)","v":305.4},{"$f":"VLOOKUP($A5,'9'!$B$10:$D$45,3,FALSE)","v":311.8},{"$f":"VLOOKUP($A5,'10'!$B$10:$D$45,3,FALSE)","v":314.2},{"$f":"VLOOKUP($A5,'11'!$B$10:$D$45,3,FALSE)","v":313.3},{"$f":"VLOOKUP($A5,'12'!$B$10:$D$45,3,FALSE)","v":{"v":0,"d":"0.0"}},{"$f":"T5/S5","v":{"v":311.46,"d":"311.5"}},{"$f":"VLOOKUP(A5,Formelhilfe!$A$9:$O$44,15,FALSE)","v":{"v":5,"d":"5.0"}},{"$f":"SUM(L5:Q5)","v":{"v":1557.3,"d":"1,557.3"}},{"$f":"W5/V5","v":{"v":311.1090909090909,"d":"311.1"}},{"$f":"VLOOKUP(A5,Formelhilfe!$A$9:$P$44,16,FALSE)","v":{"v":11,"d":"11.0"}},{"$f":"SUM(C5:H5,L5:Q5)","v":{"v":3422.2000000000003,"d":"3,422.2"}}]
["Dieter Hanekamp",{"$f":"VLOOKUP(A6,'Wettkampf 1'!$B$10:$C$45,2,FALSE)","v":"Spahnharrenstätte II"},{"$f":"VLOOKUP(A6,'Wettkampf 1'!$B$10:$D$45,3,FALSE)","v":311.2},{"$f":"VLOOKUP($A6,'2'!$B$10:$D$45,3,FALSE)","v":308.7},{"$f":"VLOOKUP($A6,'3'!$B$10:$D$45,3,FALSE)","v":309.8},{"$f":"VLOOKUP($A6,'4'!$B$10:$D$45,3,FALSE)","v":310.7},{"$f":"VLOOKUP($A6,'5'!$B$10:$D$45,3,FALSE)","v":{"v":312,"d":"312.0"}},{"$f":"VLOOKUP($A6,'6'!$B$10:$D$45,3,FALSE)","v":313.7},{"$f":"K6/J6","v":{"v":311.0166666666667,"d":"311.0"}},{"$f":"VLOOKUP(A6,Formelhilfe!$A$9:$H$44,8,FALSE)","v":{"v":6,"d":"6.0"}},{"$f":"SUM(C6:H6)","v":{"v":1866.1000000000001,"d":"1,866.1"}},{"$f":"VLOOKUP($A6,'7'!$B$10:$D$45,3,FALSE)","v":312.5},{"$f":"VLOOKUP($A6,'8'!$B$10:$D$45,3,FALSE)","v":311.5},{"$f":"VLOOKUP($A6,'9'!$B$10:$D$45,3,FALSE)","v":310.7},{"$f":"VLOOKUP($A6,'10'!$B$10:$D$45,3,FALSE)","v":309.5},{"$f":"VLOOKUP($A6,'11'!$B$10:$D$45,3,FALSE)","v":311.3},{"$f":"VLOOKUP($A6,'12'!$B$10:$D$45,3,FALSE)","v":{"v":0,"d":"0.0"}},{"$f":"T6/S6","v":311.1},{"$f":"VLOOKUP(A6,Formelhilfe!$A$9:$O$44,15,FALSE)","v":{"v":5,"d":"5.0"}},{"$f":"SUM(L6:Q6)","v":{"v":1555.5,"d":"1,555.5"}},{"$f":"W6/V6","v":{"v":311.05454545454546,"d":"311.1"}},{"$f":"VLOOKUP(A6,Formelhilfe!$A$9:$P$44,16,FALSE)","v":{"v":11,"d":"11.0"}},{"$f":"SUM(C6:H6,L6:Q6)","v":{"v":3421.6000000000004,"d":"3,421.6"}}]
["Alois Schmitz",{"$f":"VLOOKUP(A7,'Wettkampf 1'!$B$10:$C$45,2,FALSE)","v":"Neubörger II"},{"$f":"VLOOKUP(A7,'Wettkampf 1'!$B$10:$D$45,3,FALSE)","v":{"v":311,"d":"311.0"}},{"$f":"VLOOKUP($A7,'2'!$B$10:$D$45,3,FALSE)","v":{"v":310,"d":"310.0"}},{"$f":"VLOOKUP($A7,'3'!$B$10:$D$45,3,FALSE)","v":308.7},{"$f":"VLOOKUP($A7,'4'!$B$10:$D$45,3,FALSE)","v":311.8},{"$f":"VLOOKUP($A7,'5'!$B$10:$D$45,3,FALSE)","v":313.2},{"$f":"VLOOKUP($A7,'6'!$B$10:$D$45,3,FALSE)","v":305.6},{"$f":"K7/J7","v":{"v":310.05,"d":"310.1"}},{"$f":"VLOOKUP(A7,Formelhilfe!$A$9:$H$44,8,FALSE)","v":{"v":6,"d":"6.0"}},{"$f":"SUM(C7:H7)","v":{"v":1860.3000000000002,"d":"1,860.3"}},{"$f":"VLOOKUP($A7,'7'!$B$10:$D$45,3,FALSE)","v":307.5},{"$f":"VLOOKUP($A7,'8'!$B$10:$D$45,3,FALSE)","v":304.9},{"$f":"VLOOKUP($A7,'9'!$B$10:$D$45,3,FALSE)","v":310.5},{"$f":"VLOOKUP($A7,'10'!$B$10:$D$45,3,FALSE)","v":306.4},{"$f":"VLOOKUP($A7,'11'!$B$10:$D$45,3,FALSE)","v":311.8},{"$f":"VLOOKUP($A7,'12'!$B$10:$D$45,3,FALSE)","v":{"v":0,"d":"0.0"}},{"$f":"T7/S7","v":{"v":308.21999999999997,"d":"308.2"}},{"$f":"VLOOKUP(A7,Formelhilfe!$A$9:$O$44,15,FALSE)","v":{"v":5,"d":"5.0"}},{"$f":"SUM(L7:Q7)","v":{"v":1541.1,"d":"1,541.1"}},{"$f":"W7/V7","v":{"v":309.21818181818185,"d":"309.2"}},{"$f":"VLOOKUP(A7,Formelhilfe!$A$9:$P$44,16,FALSE)","v":{"v":11,"d":"11.0"}},{"$f":"SUM(C7:H7,L7:Q7)","v":{"v":3401.4000000000005,"d":"3,401.4"}}]
["Heiner Kröger",{"$f":"VLOOKUP(A8,'Wettkampf 1'!$B$10:$C$45,2,FALSE)","v":"Spahnharrenstätte II"},{"$f":"VLOOKUP(A8,'Wettkampf 1'!$B$10:$D$45,3,FALSE)","v":307.9},{"$f":"VLOOKUP($A8,'2'!$B$10:$D$45,3,FALSE)","v":308.1},{"$f":"VLOOKUP($A8,'3'!$B$10:$D$45,3,FALSE)","v":306.9},{"$f":"VLOOKUP($A8,'4'!$B$10:$D$45,3,FALSE)","v":310.2},{"$f":"VLOOKUP($A8,'5'!$B$10:$D$45,3,FALSE)","v":306.9},{"$f":"VLOOKUP($A8,'6'!$B$10:$D$45,3,FALSE)","v":309.3},{"$f":"K8/J8","v":{"v":308.21666666666664,"d":"308.2"}},{"$f":"VLOOKUP(A8,Formelhilfe!$A$9:$H$44,8,FALSE)","v":{"v":6,"d":"6.0"}},{"$f":"SUM(C8:H8)","v":{"v":1849.3,"d":"1,849.3"}},{"$f":"VLOOKUP($A8,'7'!$B$10:$D$45,3,FALSE)","v":311.6},{"$f":"VLOOKUP($A8,'8'!$B$10:$D$45,3,FALSE)","v":307.5},{"$f":"VLOOKUP($A8,'9'!$B$10:$D$45,3,FALSE)","v":308.9},{"$f":"VLOOKUP($A8,'10'!$B$10:$D$45,3,FALSE)","v":311.7},{"$f":"VLOOKUP($A8,'11'!$B$10:$D$45,3,FALSE)","v":311.7},{"$f":"VLOOKUP($A8,'12'!$B$10:$D$45,3,FALSE)","v":{"v":0,"d":"0.0"}},{"$f":"T8/S8","v":{"v":310.28000000000003,"d":"310.3"}},{"$f":"VLOOKUP(A8,Formelhilfe!$A$9:$O$44,15,FALSE)","v":{"v":5,"d":"5.0"}},{"$f":"SUM(L8:Q8)","v":{"v":1551.4,"d":"1,551.4"}},{"$f":"W8/V8","v":{"v":309.1545454545454,"d":"309.2"}},{"$f":"VLOOKUP(A8,Formelhilfe!$A$9:$P$44,16,FALSE)","v":{"v":11,"d":"11.0"}},{"$f":"SUM(C8:H8,L8:Q8)","v":{"v":3400.7,"d":"3,400.7"}}]
["Meik Sieger",{"$f":"VLOOKUP(A9,'Wettkampf 1'!$B$10:$C$45,2,FALSE)","v":"Esterwegen II"},{"$f":"VLOOKUP(A9,'Wettkampf 1'!$B$10:$D$45,3,FALSE)","v":307.8},{"$f":"VLOOKUP($A9,'2'!$B$10:$D$45,3,FALSE)","v":305.8},{"$f":"VLOOKUP($A9,'3'!$B$10:$D$45,3,FALSE)","v":309.2},{"$f":"VLOOKUP($A9,'4'!$B$10:$D$45,3,FALSE)","v":312.3},{"$f":"VLOOKUP($A9,'5'!$B$10:$D$45,3,FALSE)","v":{"v":311,"d":"311.0"}},{"$f":"VLOOKUP($A9,'6'!$B$10:$D$45,3,FALSE)","v":306.5},{"$f":"K9/J9","v":{"v":308.76666666666665,"d":"308.8"}},{"$f":"VLOOKUP(A9,Formelhilfe!$A$9:$H$44,8,FALSE)","v":{"v":6,"d":"6.0"}},{"$f":"SUM(C9:H9)","v":{"v":1852.6,"d":"1,852.6"}},{"$f":"VLOOKUP($A9,'7'!$B$10:$D$45,3,FALSE)","v":311.1},{"$f":"VLOOKUP($A9,'8'!$B$10:$D$45,3,FALSE)","v":306.6},{"$f":"VLOOKUP($A9,'9'!$B$10:$D$45,3,FALSE)","v":311.7},{"$f":"VLOOKUP($A9,'10'!$B$10:$D$45,3,FALSE)","v":306.8},{"$f":"VLOOKUP($A9,'11'!$B$10:$D$45,3,FALSE)","v":310.1},{"$f":"VLOOKUP($A9,'12'!$B$10:$D$45,3,FALSE)","v":{"v":0,"d":"0.0"}},{"$f":"T9/S9","v":{"v":309.26000000000005,"d":"309.3"}},{"$f":"VLOOKUP(A9,Formelhilfe!$A$9:$O$44,15,FALSE)","v":{"v":5,"d":"5.0"}},{"$f":"SUM(L9:Q9)","v":{"v":1546.3000000000002,"d":"1,546.3"}},{"$f":"W9/V9","v":{"v":308.99090909090904,"d":"309.0"}},{"$f":"VLOOKUP(A9,Formelhilfe!$A$9:$P$44,16,FALSE)","v":{"v":11,"d":"11.0"}},{"$f":"SUM(C9:H9,L9:Q9)","v":{"v":3398.8999999999996,"d":"3,398.9"}}]
["Ludger Hermes",{"$f":"VLOOKUP(A10,'Wettkampf 1'!$B$10:$C$45,2,FALSE)","v":"Neubörger II"},{"$f":"VLOOKUP(A10,'Wettkampf 1'!$B$10:$D$45,3,FALSE)","v":311.9},{"$f":"VLOOKUP($A10,'2'!$B$10:$D$45,3,FALSE)","v":309.3},{"$f":"VLOOKUP($A10,'3'!$B$10:$D$45,3,FALSE)","v":312.9},{"$f":"VLOOKUP($A10,'4'!$B$10:$D$45,3,FALSE)","v":308.2},{"$f":"VLOOKUP($A10,'5'!$B$10:$D$45,3,FALSE)","v":309.9},{"$f":"VLOOKUP($A10,'6'!$B$10:$D$45,3,FALSE)","v":301.6},{"$f":"K10/J10","v":{"v":308.96666666666664,"d":"309.0"}},{"$f":"VLOOKUP(A10,Formelhilfe!$A$9:$H$44,8,FALSE)","v":{"v":6,"d":"6.0"}},{"$f":"SUM(C10:H10)","v":{"v":1853.7999999999997,"d":"1,853.8"}},{"$f":"VLOOKUP($A10,'7'!$B$10:$D$45,3,FALSE)","v":309.1},{"$f":"VLOOKUP($A10,'8'!$B$10:$D$45,3,FALSE)","v":310.6},{"$f":"VLOOKUP($A10,'9'!$B$10:$D$45,3,FALSE)","v":304.5},{"$f":"VLOOKUP($A10,'10'!$B$10:$D$45,3,FALSE)","v":305.8},{"$f":"VLOOKUP($A10,'11'!$B$10:$D$45,3,FALSE)","v":310.9},{"$f":"VLOOKUP($A10,'12'!$B$10:$D$45,3,FALSE)","v":{"v":0,"d":"0.0"}},{"$f":"T10/S10","v":{"v":308.18,"d":"308.2"}},{"$f":"VLOOKUP(A10,Formelhilfe!$A$9:$O$44,15,FALSE)","v":{"v":5,"d":"5.0"}},{"$f":"SUM(L10:Q10)","v":{"v":1540.9,"d":"1,540.9"}},{"$f":"W10/V10","v":{"v":308.60909090909087,"d":"308.6"}},{"$f":"VLOOKUP(A10,Formelhilfe!$A$9:$P$44,16,FALSE)","v":{"v":11,"d":"11.0"}},{"$f":"SUM(C10:H10,L10:Q10)","v":{"v":3394.7,"d":"3,394.7"}}]
["Johannes Hülsmann",{"$f":"VLOOKUP(A11,'Wettkampf 1'!$B$10:$C$45,2,FALSE)","v":"Spahnharrenstätte II"},{"$f":"VLOOKUP(A11,'Wettkampf 1'!$B$10:$D$45,3,FALSE)","v":305.6},{"$f":"VLOOKUP($A11,'2'!$B$10:$D$45,3,FALSE)","v":312.4},{"$f":"VLOOKUP($A11,'3'!$B$10:$D$45,3,FALSE)","v":303.4},{"$f":"VLOOKUP($A11,'4'!$B$10:$D$45,3,FALSE)","v":308.8},{"$f":"VLOOKUP($A11,'5'!$B$10:$D$45,3,FALSE)","v":{"v":312,"d":"312.0"}},{"$f":"VLOOKUP($A11,'6'!$B$10:$D$45,3,FALSE)","v":311.5},{"$f":"K11/J11","v":{"v":308.95,"d":"309.0"}},{"$f":"VLOOKUP(A11,Formelhilfe!$A$9:$H$44,8,FALSE)","v":{"v":6,"d":"6.0"}},{"$f":"SUM(C11:H11)","v":{"v":1853.7,"d":"1,853.7"}},{"$f":"VLOOKUP($A11,'7'!$B$10:$D$45,3,FALSE)","v":307.8},{"$f":"VLOOKUP($A11,'8'!$B$10:$D$45,3,FALSE)","v":309.5},{"$f":"VLOOKUP($A11,'9'!$B$10:$D$45,3,FALSE)","v":310.1},{"$f":"VLOOKUP($A11,'10'!$B$10:$D$45,3,FALSE)","v":308.5},{"$f":"VLOOKUP($A11,'11'!$B$10:$D$45,3,FALSE)","v":{"v":305,"d":"305.0"}},{"$f":"VLOOKUP($A11,'12'!$B$10:$D$45,3,FALSE)","v":{"v":0,"d":"0.0"}},{"$f":"T11/S11","v":{"v":308.18,"d":"308.2"}},{"$f":"VLOOKUP(A11,Formelhilfe!$A$9:$O$44,15,FALSE)","v":{"v":5,"d":"5.0"}},{"$f":"SUM(L11:Q11)","v":{"v":1540.9,"d":"1,540.9"}},{"$f":"W11/V11","v":{"v":308.59999999999997,"d":"308.6"}},{"$f":"VLOOKUP(A11,Formelhilfe!$A$9:$P$44,16,FALSE)","v":{"v":11,"d":"11.0"}},{"$f":"SUM(C11:H11,L11:Q11)","v":{"v":3394.6,"d":"3,394.6"}}]
["Dennis Lindemann",{"$f":"VLOOKUP(A12,'Wettkampf 1'!$B$10:$C$45,2,FALSE)","v":"Esterwegen II"},{"$f":"VLOOKUP(A12,'Wettkampf 1'!$B$10:$D$45,3,FALSE)","v":302.4},{"$f":"VLOOKUP($A12,'2'!$B$10:$D$45,3,FALSE)","v":306.6},{"$f":"VLOOKUP($A12,'3'!$B$10:$D$45,3,FALSE)","v":310.3},{"$f":"VLOOKUP($A12,'4'!$B$10:$D$45,3,FALSE)","v":306.5},{"$f":"VLOOKUP($A12,'5'!$B$10:$D$45,3,FALSE)","v":311.5},{"$f":"VLOOKUP($A12,'6'!$B$10:$D$45,3,FALSE)","v":308.9},{"$f":"K12/J12","v":307.7},{"$f":"VLOOKUP(A12,Formelhilfe!$A$9:$H$44,8,FALSE)","v":{"v":6,"d":"6.0"}},{"$f":"SUM(C12:H12)","v":{"v":1846.1999999999998,"d":"1,846.2"}},{"$f":"VLOOKUP($A12,'7'!$B$10:$D$45,3,FALSE)","v":310.4},{"$f":"VLOOKUP($A12,'8'!$B$10:$D$45,3,FALSE)","v":312.5},{"$f":"VLOOKUP($A12,'9'!$B$10:$D$45,3,FALSE)","v":308.2},{"$f":"VLOOKUP($A12,'10'!$B$10:$D$45,3,FALSE)","v":{"v":307,"d":"307.0"}},{"$f":"VLOOKUP($A12,'11'!$B$10:$D$45,3,FALSE)","v":306.7},{"$f":"VLOOKUP($A12,'12'!$B$10:$D$45,3,FALSE)","v":{"v":0,"d":"0.0"}},{"$f":"T12/S12","v":{"v":308.96,"d":"309.0"}},{"$f":"VLOOKUP(A12,Formelhilfe!$A$9:$O$44,15,FALSE)","v":{"v":5,"d":"5.0"}},{"$f":"SUM(L12:Q12)","v":{"v":1544.8,"d":"1,544.8"}},{"$f":"W12/V12","v":{"v":308.27272727272725,"d":"308.3"}},{"$f":"VLOOKUP(A12,Formelhilfe!$A$9:$P$44,16,FALSE)","v":{"v":11,"d":"11.0"}},{"$f":"SUM(C12:H12,L12:Q12)","v":{"v":3390.9999999999995,"d":"3,391.0"}}]
["Christian Grönheim",{"$f":"VLOOKUP(A13,'Wettkampf 1'!$B$10:$C$45,2,FALSE)","v":"Spahnharrenstätte III"},{"$f":"VLOOKUP(A13,'Wettkampf 1'!$B$10:$D$45,3,FALSE)","v":310.8},{"$f":"VLOOKUP($A13,'2'!$B$10:$D$45,3,FALSE)","v":309.9},{"$f":"VLOOKUP($A13,'3'!$B$10:$D$45,3,FALSE)","v":307.7},{"$f":"VLOOKUP($A13,'4'!$B$10:$D$45,3,FALSE)","v":{"v":310,"d":"310.0"}},{"$f":"VLOOKUP($A13,'5'!$B$10:$D$45,3,FALSE)","v":309.6},{"$f":"VLOOKUP($A13,'6'!$B$10:$D$45,3,FALSE)","v":302.6},{"$f":"K13/J13","v":{"v":308.43333333333334,"d":"308.4"}},{"$f":"VLOOKUP(A13,Formelhilfe!$A$9:$H$44,8,FALSE)","v":{"v":6,"d":"6.0"}},{"$f":"SUM(C13:H13)","v":{"v":1850.6,"d":"1,850.6"}},{"$f":"VLOOKUP($A13,'7'!$B$10:$D$45,3,FALSE)","v":303.1},{"$f":"VLOOKUP($A13,'8'!$B$10:$D$45,3,FALSE)","v":{"v":308,"d":"308.0"}},{"$f":"VLOOKUP($A13,'9'!$B$10:$D$45,3,FALSE)","v":{"v":310,"d":"310.0"}},{"$f":"VLOOKUP($A13,'10'!$B$10:$D$45,3,FALSE)","v":303.1},{"$f":"VLOOKUP($A13,'11'!$B$10:$D$45,3,FALSE)","v":311.2},{"$f":"VLOOKUP($A13,'12'!$B$10:$D$45,3,FALSE)","v":{"v":0,"d":"0.0"}},{"$f":"T13/S13","v":{"v":307.08000000000004,"d":"307.1"}},{"$f":"VLOOKUP(A13,Formelhilfe!$A$9:$O$44,15,FALSE)","v":{"v":5,"d":"5.0"}},{"$f":"SUM(L13:Q13)","v":{"v":1535.4,"d":"1,535.4"}},{"$f":"W13/V13","v":{"v":307.81818181818176,"d":"307.8"}},{"$f":"VLOOKUP(A13,Formelhilfe!$A$9:$P$44,16,FALSE)","v":{"v":11,"d":"11.0"}},{"$f":"SUM(C13:H13,L13:Q13)","v":{"v":3385.9999999999995,"d":"3,386.0"}}]
["Franz Ostermann",{"$f":"VLOOKUP(A14,'Wettkampf 1'!$B$10:$C$45,2,FALSE)","v":"Eisten II "},{"$f":"VLOOKUP(A14,'Wettkampf 1'!$B$10:$D$45,3,FALSE)","v":308.3},{"$f":"VLOOKUP($A14,'2'!$B$10:$D$45,3,FALSE)","v":309.6},{"$f":"VLOOKUP($A14,'3'!$B$10:$D$45,3,FALSE)","v":306.8},{"$f":"VLOOKUP($A14,'4'!$B$10:$D$45,3,FALSE)","v":300.2},{"$f":"VLOOKUP($A14,'5'!$B$10:$D$45,3,FALSE)","v":310.3},{"$f":"VLOOKUP($A14,'6'!$B$10:$D$45,3,FALSE)","v":312.2},{"$f":"K14/J14","v":{"v":307.90000000000003,"d":"307.9"}},{"$f":"VLOOKUP(A14,Formelhilfe!$A$9:$H$44,8,FALSE)","v":{"v":6,"d":"6.0"}},{"$f":"SUM(C14:H14)","v":{"v":1847.4,"d":"1,847.4"}},{"$f":"VLOOKUP($A14,'7'!$B$10:$D$45,3,FALSE)","v":307.4},{"$f":"VLOOKUP($A14,'8'!$B$10:$D$45,3,FALSE)","v":309.7},{"$f":"VLOOKUP($A14,'9'!$B$10:$D$45,3,FALSE)","v":308.2},{"$f":"VLOOKUP($A14,'10'!$B$10:$D$45,3,FALSE)","v":297.8},{"$f":"VLOOKUP($A14,'11'!$B$10:$D$45,3,FALSE)","v":306.5},{"$f":"VLOOKUP($A14,'12'!$B$10:$D$45,3,FALSE)","v":{"v":0,"d":"0.0"}},{"$f":"T14/S14","v":{"v":305.91999999999996,"d":"305.9"}},{"$f":"VLOOKUP(A14,Formelhilfe!$A$9:$O$44,15,FALSE)","v":{"v":5,"d":"5.0"}},{"$f":"SUM(L14:Q14)","v":{"v":1529.6,"d":"1,529.6"}},{"$f":"W14/V14","v":{"v":307,"d":"307.0"}},{"$f":"VLOOKUP(A14,Formelhilfe!$A$9:$P$44,16,FALSE)","v":{"v":11,"d":"11.0"}},{"$f":"SUM(C14:H14,L14:Q14)","v":{"v":3377,"d":"3,377.0"}}]
["Ludwig Langen",{"$f":"VLOOKUP(A15,'Wettkampf 1'!$B$10:$C$45,2,FALSE)","v":"Neubörger II"},{"$f":"VLOOKUP(A15,'Wettkampf 1'!$B$10:$D$45,3,FALSE)","v":305.8},{"$f":"VLOOKUP($A15,'2'!$B$10:$D$45,3,FALSE)","v":299.5},{"$f":"VLOOKUP($A15,'3'!$B$10:$D$45,3,FALSE)","v":305.8},{"$f":"VLOOKUP($A15,'4'!$B$10:$D$45,3,FALSE)","v":{"v":308,"d":"308.0"}},{"$f":"VLOOKUP($A15,'5'!$B$10:$D$45,3,FALSE)","v":312.2},{"$f":"VLOOKUP($A15,'6'!$B$10:$D$45,3,FALSE)","v":307.9},{"$f":"K15/J15","v":{"v":306.5333333333333,"d":"306.5"}},{"$f":"VLOOKUP(A15,Formelhilfe!$A$9:$H$44,8,FALSE)","v":{"v":6,"d":"6.0"}},{"$f":"SUM(C15:H15)","v":{"v":1839.1999999999998,"d":"1,839.2"}},{"$f":"VLOOKUP($A15,'7'!$B$10:$D$45,3,FALSE)","v":304.4},{"$f":"VLOOKUP($A15,'8'!$B$10:$D$45,3,FALSE)","v":305.8},{"$f":"VLOOKUP($A15,'9'!$B$10:$D$45,3,FALSE)","v":309.4},{"$f":"VLOOKUP($A15,'10'!$B$10:$D$45,3,FALSE)","v":308.3},{"$f":"VLOOKUP($A15,'11'!$B$10:$D$45,3,FALSE)","v":304.9},{"$f":"VLOOKUP($A15,'12'!$B$10:$D$45,3,FALSE)","v":{"v":0,"d":"0.0"}},{"$f":"T15/S15","v":{"v":306.56000000000006,"d":"306.6"}},{"$f":"VLOOKUP(A15,Formelhilfe!$A$9:$O$44,15,FALSE)","v":{"v":5,"d":"5.0"}},{"$f":"SUM(L15:Q15)","v":{"v":1532.8000000000002,"d":"1,532.8"}},{"$f":"W15/V15","v":{"v":306.54545454545456,"d":"306.5"}},{"$f":"VLOOKUP(A15,Formelhilfe!$A$9:$P$44,16,FALSE)","v":{"v":11,"d":"11.0"}},{"$f":"SUM(C15:H15,L15:Q15)","v":{"v":3372.0000000000005,"d":"3,372.0"}}]
["Sebastian Albers",{"$f":"VLOOKUP(A16,'Wettkampf 1'!$B$10:$C$45,2,FALSE)","v":"Spahnharrenstätte III"},{"$f":"VLOOKUP(A16,'Wettkampf 1'!$B$10:$D$45,3,FALSE)","v":304.5},{"$f":"VLOOKUP($A16,'2'!$B$10:$D$45,3,FALSE)","v":303.8},{"$f":"VLOOKUP($A16,'3'!$B$10:$D$45,3,FALSE)","v":307.5},{"$f":"VLOOKUP($A16,'4'!$B$10:$D$45,3,FALSE)","v":304.7},{"$f":"VLOOKUP($A16,'5'!$B$10:$D$45,3,FALSE)","v":305.7},{"$f":"VLOOKUP($A16,'6'!$B$10:$D$45,3,FALSE)","v":307.4},{"$f":"K16/J16","v":{"v":305.59999999999997,"d":"305.6"}},{"$f":"VLOOKUP(A16,Formelhilfe!$A$9:$H$44,8,FALSE)","v":{"v":6,"d":"6.0"}},{"$f":"SUM(C16:H16)","v":{"v":1833.6,"d":"1,833.6"}},{"$f":"VLOOKUP($A16,'7'!$B$10:$D$45,3,FALSE)","v":308.6},{"$f":"VLOOKUP($A16,'8'!$B$10:$D$45,3,FALSE)","v":307.2},{"$f":"VLOOKUP($A16,'9'!$B$10:$D$45,3,FALSE)","v":306.3},{"$f":"VLOOKUP($A16,'10'!$B$10:$D$45,3,FALSE)","v":304.8},{"$f":"VLOOKUP($A16,'11'!$B$10:$D$45,3,FALSE)","v":311.3},{"$f":"VLOOKUP($A16,'12'!$B$10:$D$45,3,FALSE)","v":{"v":0,"d":"0.0"}},{"$f":"T16/S16","v":{"v":307.64,"d":"307.6"}},{"$f":"VLOOKUP(A16,Formelhilfe!$A$9:$O$44,15,FALSE)","v":{"v":5,"d":"5.0"}},{"$f":"SUM(L16:Q16)","v":{"v":1538.1999999999998,"d":"1,538.2"}},{"$f":"W16/V16","v":{"v":306.52727272727276,"d":"306.5"}},{"$f":"VLOOKUP(A16,Formelhilfe!$A$9:$P$44,16,FALSE)","v":{"v":11,"d":"11.0"}},{"$f":"SUM(C16:H16,L16:Q16)","v":{"v":3371.8,"d":"3,371.8"}}]
["Heiko Micksch",{"$f":"VLOOKUP(A17,'Wettkampf 1'!$B$10:$C$45,2,FALSE)","v":"Spahnharrenstätte III"},{"$f":"VLOOKUP(A17,'Wettkampf 1'!$B$10:$D$45,3,FALSE)","v":302.8},{"$f":"VLOOKUP($A17,'2'!$B$10:$D$45,3,FALSE)","v":302.5},{"$f":"VLOOKUP($A17,'3'!$B$10:$D$45,3,FALSE)","v":309.4},{"$f":"VLOOKUP($A17,'4'!$B$10:$D$45,3,FALSE)","v":303.6},{"$f":"VLOOKUP($A17,'5'!$B$10:$D$45,3,FALSE)","v":304.3},{"$f":"VLOOKUP($A17,'6'!$B$10:$D$45,3,FALSE)","v":306.5},{"$f":"K17/J17","v":{"v":304.84999999999997,"d":"304.9"}},{"$f":"VLOOKUP(A17,Formelhilfe!$A$9:$H$44,8,FALSE)","v":{"v":6,"d":"6.0"}},{"$f":"SUM(C17:H17)","v":{"v":1829.1,"d":"1,829.1"}},{"$f":"VLOOKUP($A17,'7'!$B$10:$D$45,3,FALSE)","v":303.6},{"$f":"VLOOKUP($A17,'8'!$B$10:$D$45,3,FALSE)","v":305.7},{"$f":"VLOOKUP($A17,'9'!$B$10:$D$45,3,FALSE)","v":306.3},{"$f":"VLOOKUP($A17,'10'!$B$10:$D$45,3,FALSE)","v":306.9},{"$f":"VLOOKUP($A17,'11'!$B$10:$D$45,3,FALSE)","v":309.6},{"$f":"VLOOKUP($A17,'12'!$B$10:$D$45,3,FALSE)","v":{"v":0,"d":"0.0"}},{"$f":"T17/S17","v":{"v":306.41999999999996,"d":"306.4"}},{"$f":"VLOOKUP(A17,Formelhilfe!$A$9:$O$44,15,FALSE)","v":{"v":5,"d":"5.0"}},{"$f":"SUM(L17:Q17)","v":{"v":1532.1,"d":"1,532.1"}},{"$f":"W17/V17","v":{"v":305.56363636363636,"d":"305.6"}},{"$f":"VLOOKUP(A17,Formelhilfe!$A$9:$P$44,16,FALSE)","v":{"v":11,"d":"11.0"}},{"$f":"SUM(C17:H17,L17:Q17)","v":{"v":3361.2,"d":"3,361.2"}}]
["Bernd Nortmann",{"$f":"VLOOKUP(A18,'Wettkampf 1'!$B$10:$C$45,2,FALSE)","v":"Lahn V"},{"$f":"VLOOKUP(A18,'Wettkampf 1'!$B$10:$D$45,3,FALSE)","v":307.8},{"$f":"VLOOKUP($A18,'2'!$B$10:$D$45,3,FALSE)","v":302.2},{"$f":"VLOOKUP($A18,'3'!$B$10:$D$45,3,FALSE)","v":301.5},{"$f":"VLOOKUP($A18,'4'!$B$10:$D$45,3,FALSE)","v":308.6},{"$f":"VLOOKUP($A18,'5'!$B$10:$D$45,3,FALSE)","v":309.7},{"$f":"VLOOKUP($A18,'6'!$B$10:$D$45,3,FALSE)","v":{"v":306,"d":"306.0"}},{"$f":"K18/J18","v":{"v":305.96666666666664,"d":"306.0"}},{"$f":"VLOOKUP(A18,Formelhilfe!$A$9:$H$44,8,FALSE)","v":{"v":6,"d":"6.0"}},{"$f":"SUM(C18:H18)","v":{"v":1835.8,"d":"1,835.8"}},{"$f":"VLOOKUP($A18,'7'!$B$10:$D$45,3,FALSE)","v":304.1},{"$f":"VLOOKUP($A18,'8'!$B$10:$D$45,3,FALSE)","v":308.9},{"$f":"VLOOKUP($A18,'9'!$B$10:$D$45,3,FALSE)","v":302.7},{"$f":"VLOOKUP($A18,'10'!$B$10:$D$45,3,FALSE)","v":304.5},{"$f":"VLOOKUP($A18,'11'!$B$10:$D$45,3,FALSE)","v":303.8},{"$f":"VLOOKUP($A18,'12'!$B$10:$D$45,3,FALSE)","v":{"v":0,"d":"0.0"}},{"$f":"T18/S18","v":304.8},{"$f":"VLOOKUP(A18,Formelhilfe!$A$9:$O$44,15,FALSE)","v":{"v":5,"d":"5.0"}},{"$f":"SUM(L18:Q18)","v":{"v":1524,"d":"1,524.0"}},{"$f":"W18/V18","v":{"v":305.43636363636364,"d":"305.4"}},{"$f":"VLOOKUP(A18,Formelhilfe!$A$9:$P$44,16,FALSE)","v":{"v":11,"d":"11.0"}},{"$f":"SUM(C18:H18,L18:Q18)","v":{"v":3359.8,"d":"3,359.8"}}]
["Josef Langen",{"$f":"VLOOKUP(A19,'Wettkampf 1'!$B$10:$C$45,2,FALSE)","v":"Spahnharrenstätte II"},{"$f":"VLOOKUP(A19,'Wettkampf 1'!$B$10:$D$45,3,FALSE)","v":{"v":306,"d":"306.0"}},{"$f":"VLOOKUP($A19,'2'!$B$10:$D$45,3,FALSE)","v":304.9},{"$f":"VLOOKUP($A19,'3'!$B$10:$D$45,3,FALSE)","v":304.9},{"$f":"VLOOKUP($A19,'4'!$B$10:$D$45,3,FALSE)","v":300.3},{"$f":"VLOOKUP($A19,'5'!$B$10:$D$45,3,FALSE)","v":302.2},{"$f":"VLOOKUP($A19,'6'!$B$10:$D$45,3,FALSE)","v":308.2},{"$f":"K19/J19","v":{"v":304.4166666666667,"d":"304.4"}},{"$f":"VLOOKUP(A19,Formelhilfe!$A$9:$H$44,8,FALSE)","v":{"v":6,"d":"6.0"}},{"$f":"SUM(C19:H19)","v":{"v":1826.5,"d":"1,826.5"}},{"$f":"VLOOKUP($A19,'7'!$B$10:$D$45,3,FALSE)","v":302.9},{"$f":"VLOOKUP($A19,'8'!$B$10:$D$45,3,FALSE)","v":306.7},{"$f":"VLOOKUP($A19,'9'!$B$10:$D$45,3,FALSE)","v":305.8},{"$f":"VLOOKUP($A19,'10'!$B$10:$D$45,3,FALSE)","v":307.9},{"$f":"VLOOKUP($A19,'11'!$B$10:$D$45,3,FALSE)","v":304.9},{"$f":"VLOOKUP($A19,'12'!$B$10:$D$45,3,FALSE)","v":{"v":0,"d":"0.0"}},{"$f":"T19/S19","v":{"v":305.64,"d":"305.6"}},{"$f":"VLOOKUP(A19,Formelhilfe!$A$9:$O$44,15,FALSE)","v":{"v":5,"d":"5.0"}},{"$f":"SUM(L19:Q19)","v":{"v":1528.1999999999998,"d":"1,528.2"}},{"$f":"W19/V19","v":{"v":304.9727272727273,"d":"305.0"}},{"$f":"VLOOKUP(A19,Formelhilfe!$A$9:$P$44,16,FALSE)","v":{"v":11,"d":"11.0"}},{"$f":"SUM(C19:H19,L19:Q19)","v":{"v":3354.7000000000003,"d":"3,354.7"}}]
["Andreas Lindemann",{"$f":"VLOOKUP(A20,'Wettkampf 1'!$B$10:$C$45,2,FALSE)","v":"Esterwegen II"},{"$f":"VLOOKUP(A20,'Wettkampf 1'!$B$10:$D$45,3,FALSE)","v":301.3},{"$f":"VLOOKUP($A20,'2'!$B$10:$D$45,3,FALSE)","v":{"v":308,"d":"308.0"}},{"$f":"VLOOKUP($A20,'3'!$B$10:$D$45,3,FALSE)","v":{"v":312,"d":"312.0"}},{"$f":"VLOOKUP($A20,'4'!$B$10:$D$45,3,FALSE)","v":301.7},{"$f":"VLOOKUP($A20,'5'!$B$10:$D$45,3,FALSE)","v":282.1},{"$f":"VLOOKUP($A20,'6'!$B$10:$D$45,3,FALSE)","v":304.9},{"$f":"K20/J20","v":{"v":301.6666666666667,"d":"301.7"}},{"$f":"VLOOKUP(A20,Formelhilfe!$A$9:$H$44,8,FALSE)","v":{"v":6,"d":"6.0"}},{"$f":"SUM(C20:H20)","v":{"v":1810,"d":"1,810.0"}},{"$f":"VLOOKUP($A20,'7'!$B$10:$D$45,3,FALSE)","v":{"v":303,"d":"303.0"}},{"$f":"VLOOKUP($A20,'8'!$B$10:$D$45,3,FALSE)","v":307.8},{"$f":"VLOOKUP($A20,'9'!$B$10:$D$45,3,FALSE)","v":305.5},{"$f":"VLOOKUP($A20,'10'!$B$10:$D$45,3,FALSE)","v":302.7},{"$f":"VLOOKUP($A20,'11'!$B$10:$D$45,3,FALSE)","v":305.8},{"$f":"VLOOKUP($A20,'12'!$B$10:$D$45,3,FALSE)","v":{"v":0,"d":"0.0"}},{"$f":"T20/S20","v":{"v":304.96,"d":"305.0"}},{"$f":"VLOOKUP(A20,Formelhilfe!$A$9:$O$44,15,FALSE)","v":{"v":5,"d":"5.0"}},{"$f":"SUM(L20:Q20)","v":{"v":1524.8,"d":"1,524.8"}},{"$f":"W20/V20","v":{"v":303.1636363636364,"d":"303.2"}},{"$f":"VLOOKUP(A20,Formelhilfe!$A$9:$P$44,16,FALSE)","v":{"v":11,"d":"11.0"}},{"$f":"SUM(C20:H20,L20:Q20)","v":{"v":3334.8,"d":"3,334.8"}}]
["Rudi Fromme",{"$f":"VLOOKUP(A21,'Wettkampf 1'!$B$10:$C$45,2,FALSE)","v":"Neubörger II"},{"$f":"VLOOKUP(A21,'Wettkampf 1'!$B$10:$D$45,3,FALSE)","v":303.4},{"$f":"VLOOKUP($A21,'2'!$B$10:$D$45,3,FALSE)","v":298.5},{"$f":"VLOOKUP($A21,'3'!$B$10:$D$45,3,FALSE)","v":306.3},{"$f":"VLOOKUP($A21,'4'!$B$10:$D$45,3,FALSE)","v":302.3},{"$f":"VLOOKUP($A21,'5'!$B$10:$D$45,3,FALSE)","v":301.4},{"$f":"VLOOKUP($A21,'6'!$B$10:$D$45,3,FALSE)","v":305.4},{"$f":"K21/J21","v":{"v":302.8833333333334,"d":"302.9"}},{"$f":"VLOOKUP(A21,Formelhilfe!$A$9:$H$44,8,FALSE)","v":{"v":6,"d":"6.0"}},{"$f":"SUM(C21:H21)","v":{"v":1817.3000000000002,"d":"1,817.3"}},{"$f":"VLOOKUP($A21,'7'!$B$10:$D$45,3,FALSE)","v":304.7},{"$f":"VLOOKUP($A21,'8'!$B$10:$D$45,3,FALSE)","v":303.2},{"$f":"VLOOKUP($A21,'9'!$B$10:$D$45,3,FALSE)","v":300.8},{"$f":"VLOOKUP($A21,'10'!$B$10:$D$45,3,FALSE)","v":304.2},{"$f":"VLOOKUP($A21,'11'!$B$10:$D$45,3,FALSE)","v":303.8},{"$f":"VLOOKUP($A21,'12'!$B$10:$D$45,3,FALSE)","v":{"v":0,"d":"0.0"}},{"$f":"T21/S21","v":{"v":303.34000000000003,"d":"303.3"}},{"$f":"VLOOKUP(A21,Formelhilfe!$A$9:$O$44,15,FALSE)","v":{"v":5,"d":"5.0"}},{"$f":"SUM(L21:Q21)","v":{"v":1516.7,"d":"1,516.7"}},{"$f":"W21/V21","v":{"v":303.09090909090907,"d":"303.1"}},{"$f":"VLOOKUP(A21,Formelhilfe!$A$9:$P$44,16,FALSE)","v":{"v":11,"d":"11.0"}},{"$f":"SUM(C21:H21,L21:Q21)","v":{"v":3334,"d":"3,334.0"}}]
["Oliver Reinelt",{"$f":"VLOOKUP(A22,'Wettkampf 1'!$B$10:$C$45,2,FALSE)","v":"Lahn V"},{"$f":"VLOOKUP(A22,'Wettkampf 1'!$B$10:$D$45,3,FALSE)","v":294.1},{"$f":"VLOOKUP($A22,'2'!$B$10:$D$45,3,FALSE)","v":299.7},{"$f":"VLOOKUP($A22,'3'!$B$10:$D$45,3,FALSE)","v":293.1},{"$f":"VLOOKUP($A22,'4'!$B$10:$D$45,3,FALSE)","v":298.5},{"$f":"VLOOKUP($A22,'5'!$B$10:$D$45,3,FALSE)","v":303.3},{"$f":"VLOOKUP($A22,'6'!$B$10:$D$45,3,FALSE)","v":294.5},{"$f":"K22/J22","v":297.2},{"$f":"VLOOKUP(A22,Formelhilfe!$A$9:$H$44,8,FALSE)","v":{"v":6,"d":"6.0"}},{"$f":"SUM(C22:H22)","v":{"v":1783.2,"d":"1,783.2"}},{"$f":"VLOOKUP($A22,'7'!$B$10:$D$45,3,FALSE)","v":301.4},{"$f":"VLOOKUP($A22,'8'!$B$10:$D$45,3,FALSE)","v":304.4},{"$f":"VLOOKUP($A22,'9'!$B$10:$D$45,3,FALSE)","v":305.8},{"$f":"VLOOKUP($A22,'10'!$B$10:$D$45,3,FALSE)","v":{"v":299,"d":"299.0"}},{"$f":"VLOOKUP($A22,'11'!$B$10:$D$45,3,FALSE)","v":304.3},{"$f":"VLOOKUP($A22,'12'!$B$10:$D$45,3,FALSE)","v":{"v":0,"d":"0.0"}},{"$f":"T22/S22","v":{"v":302.97999999999996,"d":"303.0"}},{"$f":"VLOOKUP(A22,Formelhilfe!$A$9:$O$44,15,FALSE)","v":{"v":5,"d":"5.0"}},{"$f":"SUM(L22:Q22)","v":{"v":1514.8999999999999,"d":"1,514.9"}},{"$f":"W22/V22","v":{"v":299.82727272727277,"d":"299.8"}},{"$f":"VLOOKUP(A22,Formelhilfe!$A$9:$P$44,16,FALSE)","v":{"v":11,"d":"11.0"}},{"$f":"SUM(C22:H22,L22:Q22)","v":{"v":3298.1000000000004,"d":"3,298.1"}}]
["Dirk Meyer",{"$f":"VLOOKUP(A23,'Wettkampf 1'!$B$10:$C$45,2,FALSE)","v":"Spahnharrenstätte III"},{"$f":"VLOOKUP(A23,'Wettkampf 1'!$B$10:$D$45,3,FALSE)","v":308.6},{"$f":"VLOOKUP($A23,'2'!$B$10:$D$45,3,FALSE)","v":311.2},{"$f":"VLOOKUP($A23,'3'!$B$10:$D$45,3,FALSE)","v":310.4},{"$f":"VLOOKUP($A23,'4'!$B$10:$D$45,3,FALSE)","v":311.9},{"$f":"VLOOKUP($A23,'5'!$B$10:$D$45,3,FALSE)","v":312.8},{"$f":"VLOOKUP($A23,'6'!$B$10:$D$45,3,FALSE)","v":312.3},{"$f":"K23/J23","v":311.2},{"$f":"VLOOKUP(A23,Formelhilfe!$A$9:$H$44,8,FALSE)","v":{"v":6,"d":"6.0"}},{"$f":"SUM(C23:H23)","v":{"v":1867.1999999999998,"d":"1,867.2"}},{"$f":"VLOOKUP($A23,'7'!$B$10:$D$45,3,FALSE)","v":{"v":0,"d":"0.0"}},{"$f":"VLOOKUP($A23,'8'!$B$10:$D$45,3,FALSE)","v":311.6},{"$f":"VLOOKUP($A23,'9'!$B$10:$D$45,3,FALSE)","v":312.7},{"$f":"VLOOKUP($A23,'10'!$B$10:$D$45,3,FALSE)","v":312.7},{"$f":"VLOOKUP($A23,'11'!$B$10:$D$45,3,FALSE)","v":311.4},{"$f":"VLOOKUP($A23,'12'!$B$10:$D$45,3,FALSE)","v":{"v":0,"d":"0.0"}},{"$f":"T23/S23","v":312.1},{"$f":"VLOOKUP(A23,Formelhilfe!$A$9:$O$44,15,FALSE)","v":{"v":4,"d":"4.0"}},{"$f":"SUM(L23:Q23)","v":{"v":1248.4,"d":"1,248.4"}},{"$f":"W23/V23","v":{"v":311.55999999999995,"d":"311.6"}},{"$f":"VLOOKUP(A23,Formelhilfe!$A$9:$P$44,16,FALSE)","v":{"v":10,"d":"10.0"}},{"$f":"SUM(C23:H23,L23:Q23)","v":{"v":3115.5999999999995,"d":"3,115.6"}}]
["Simon Schukenbrock",{"$f":"VLOOKUP(A24,'Wettkampf 1'!$B$10:$C$45,2,FALSE)","v":"Lahn V"},{"$f":"VLOOKUP(A24,'Wettkampf 1'!$B$10:$D$45,3,FALSE)","v":309.4},{"$f":"VLOOKUP($A24,'2'!$B$10:$D$45,3,FALSE)","v":308.5},{"$f":"VLOOKUP($A24,'3'!$B$10:$D$45,3,FALSE)","v":309.1},{"$f":"VLOOKUP($A24,'4'!$B$10:$D$45,3,FALSE)","v":308.2},{"$f":"VLOOKUP($A24,'5'!$B$10:$D$45,3,FALSE)","v":312.3},{"$f":"VLOOKUP($A24,'6'!$B$10:$D$45,3,FALSE)","v":309.9},{"$f":"K24/J24","v":{"v":309.56666666666666,"d":"309.6"}},{"$f":"VLOOKUP(A24,Formelhilfe!$A$9:$H$44,8,FALSE)","v":{"v":6,"d":"6.0"}},{"$f":"SUM(C24:H24)","v":{"v":1857.4,"d":"1,857.4"}},{"$f":"VLOOKUP($A24,'7'!$B$10:$D$45,3,FALSE)","v":310.2},{"$f":"VLOOKUP($A24,'8'!$B$10:$D$45,3,FALSE)","v":301.9},{"$f":"VLOOKUP($A24,'9'!$B$10:$D$45,3,FALSE)","v":311.9},{"$f":"VLOOKUP($A24,'10'!$B$10:$D$45,3,FALSE)","v":308.4},{"$f":"VLOOKUP($A24,'11'!$B$10:$D$45,3,FALSE)","v":{"v":0,"d":"0.0"}},{"$f":"VLOOKUP($A24,'12'!$B$10:$D$45,3,FALSE)","v":{"v":0,"d":"0.0"}},{"$f":"T24/S24","v":{"v":308.09999999999997,"d":"308.1"}},{"$f":"VLOOKUP(A24,Formelhilfe!$A$9:$O$44,15,FALSE)","v":{"v":4,"d":"4.0"}},{"$f":"SUM(L24:Q24)","v":{"v":1232.3999999999999,"d":"1,232.4"}},{"$f":"W24/V24","v":{"v":308.98,"d":"309.0"}},{"$f":"VLOOKUP(A24,Formelhilfe!$A$9:$P$44,16,FALSE)","v":{"v":10,"d":"10.0"}},{"$f":"SUM(C24:H24,L24:Q24)","v":{"v":3089.8,"d":"3,089.8"}}]
["Stefan Burlager",{"$f":"VLOOKUP(A25,'Wettkampf 1'!$B$10:$C$45,2,FALSE)","v":"Esterwegen II"},{"$f":"VLOOKUP(A25,'Wettkampf 1'!$B$10:$D$45,3,FALSE)","v":304.3},{"$f":"VLOOKUP($A25,'2'!$B$10:$D$45,3,FALSE)","v":301.4},{"$f":"VLOOKUP($A25,'3'!$B$10:$D$45,3,FALSE)","v":296.8},{"$f":"VLOOKUP($A25,'4'!$B$10:$D$45,3,FALSE)","v":{"v":0,"d":"0.0"}},{"$f":"VLOOKUP($A25,'5'!$B$10:$D$45,3,FALSE)","v":306.5},{"$f":"VLOOKUP($A25,'6'!$B$10:$D$45,3,FALSE)","v":310.4},{"$f":"K25/J25","v":{"v":303.88,"d":"303.9"}},{"$f":"VLOOKUP(A25,Formelhilfe!$A$9:$H$44,8,FALSE)","v":{"v":5,"d":"5.0"}},{"$f":"SUM(C25:H25)","v":{"v":1519.4,"d":"1,519.4"}},{"$f":"VLOOKUP($A25,'7'!$B$10:$D$45,3,FALSE)","v":304.6},{"$f":"VLOOKUP($A25,'8'!$B$10:$D$45,3,FALSE)","v":303.5},{"$f":"VLOOKUP($A25,'9'!$B$10:$D$45,3,FALSE)","v":306.8},{"$f":"VLOOKUP($A25,'10'!$B$10:$D$45,3,FALSE)","v":306.5},{"$f":"VLOOKUP($A25,'11'!$B$10:$D$45,3,FALSE)","v":306.8},{"$f":"VLOOKUP($A25,'12'!$B$10:$D$45,3,FALSE)","v":{"v":0,"d":"0.0"}},{"$f":"T25/S25","v":{"v":305.64,"d":"305.6"}},{"$f":"VLOOKUP(A25,Formelhilfe!$A$9:$O$44,15,FALSE)","v":{"v":5,"d":"5.0"}},{"$f":"SUM(L25:Q25)","v":{"v":1528.2,"d":"1,528.2"}},{"$f":"W25/V25","v":{"v":304.76000000000005,"d":"304.8"}},{"$f":"VLOOKUP(A25,Formelhilfe!$A$9:$P$44,16,FALSE)","v":{"v":10,"d":"10.0"}},{"$f":"SUM(C25:H25,L25:Q25)","v":{"v":3047.6000000000004,"d":"3,047.6"}}]
["Rainer Wielenberg",{"$f":"VLOOKUP(A26,'Wettkampf 1'!$B$10:$C$45,2,FALSE)","v":"Esterwegen II"},{"$f":"VLOOKUP(A26,'Wettkampf 1'!$B$10:$D$45,3,FALSE)","v":305.9},{"$f":"VLOOKUP($A26,'2'!$B$10:$D$45,3,FALSE)","v":306.6},{"$f":"VLOOKUP($A26,'3'!$B$10:$D$45,3,FALSE)","v":306.4},{"$f":"VLOOKUP($A26,'4'!$B$10:$D$45,3,FALSE)","v":302.9},{"$f":"VLOOKUP($A26,'5'!$B$10:$D$45,3,FALSE)","v":302.9},{"$f":"VLOOKUP($A26,'6'!$B$10:$D$45,3,FALSE)","v":299.6},{"$f":"K26/J26","v":{"v":304.04999999999995,"d":"304.1"}},{"$f":"VLOOKUP(A26,Formelhilfe!$A$9:$H$44,8,FALSE)","v":{"v":6,"d":"6.0"}},{"$f":"SUM(C26:H26)","v":{"v":1824.2999999999997,"d":"1,824.3"}},{"$f":"VLOOKUP($A26,'7'!$B$10:$D$45,3,FALSE)","v":{"v":0,"d":"0.0"}},{"$f":"VLOOKUP($A26,'8'!$B$10:$D$45,3,FALSE)","v":298.3},{"$f":"VLOOKUP($A26,'9'!$B$10:$D$45,3,FALSE)","v":303.5},{"$f":"VLOOKUP($A26,'10'!$B$10:$D$45,3,FALSE)","v":299.5},{"$f":"VLOOKUP($A26,'11'!$B$10:$D$45,3,FALSE)","v":{"v":0,"d":"0.0"}},{"$f":"VLOOKUP($A26,'12'!$B$10:$D$45,3,FALSE)","v":{"v":0,"d":"0.0"}},{"$f":"T26/S26","v":{"v":300.43333333333334,"d":"300.4"}},{"$f":"VLOOKUP(A26,Formelhilfe!$A$9:$O$44,15,FALSE)","v":{"v":3,"d":"3.0"}},{"$f":"SUM(L26:Q26)","v":901.3},{"$f":"W26/V26","v":{"v":302.84444444444443,"d":"302.8"}},{"$f":"VLOOKUP(A26,Formelhilfe!$A$9:$P$44,16,FALSE)","v":{"v":9,"d":"9.0"}},{"$f":"SUM(C26:H26,L26:Q26)","v":{"v":2725.6,"d":"2,725.6"}}]
["Johannes Gebken",{"$f":"VLOOKUP(A27,'Wettkampf 1'!$B$10:$C$45,2,FALSE)","v":"Esterwegen II"},{"$f":"VLOOKUP(A27,'Wettkampf 1'!$B$10:$D$45,3,FALSE)","v":299.9},{"$f":"VLOOKUP($A27,'2'!$B$10:$D$45,3,FALSE)","v":291.1},{"$f":"VLOOKUP($A27,'3'!$B$10:$D$45,3,FALSE)","v":290.6},{"$f":"VLOOKUP($A27,'4'!$B$10:$D$45,3,FALSE)","v":{"v":0,"d":"0.0"}},{"$f":"VLOOKUP($A27,'5'!$B$10:$D$45,3,FALSE)","v":{"v":0,"d":"0.0"}},{"$f":"VLOOKUP($A27,'6'!$B$10:$D$45,3,FALSE)","v":{"v":0,"d":"0.0"}},{"$f":"K27/J27","v":{"v":293.8666666666667,"d":"293.9"}},{"$f":"VLOOKUP(A27,Formelhilfe!$A$9:$H$44,8,FALSE)","v":{"v":3,"d":"3.0"}},{"$f":"SUM(C27:H27)","v":881.6},{"$f":"VLOOKUP($A27,'7'!$B$10:$D$45,3,FALSE)","v":{"v":0,"d":"0.0"}},{"$f":"VLOOKUP($A27,'8'!$B$10:$D$45,3,FALSE)","v":{"v":0,"d":"0.0"}},{"$f":"VLOOKUP($A27,'9'!$B$10:$D$45,3,FALSE)","v":{"v":0,"d":"0.0"}},{"$f":"VLOOKUP($A27,'10'!$B$10:$D$45,3,FALSE)","v":{"v":0,"d":"0.0"}},{"$f":"VLOOKUP($A27,'11'!$B$10:$D$45,3,FALSE)","v":{"v":0,"d":"0.0"}},{"$f":"VLOOKUP($A27,'12'!$B$10:$D$45,3,FALSE)","v":{"v":0,"d":"0.0"}},{"$f":"T27/S27","v":{"$error":"#DIV/0!"}},{"$f":"VLOOKUP(A27,Formelhilfe!$A$9:$O$44,15,FALSE)","v":{"v":0,"d":"0.0"}},{"$f":"SUM(L27:Q27)","v":{"v":0,"d":"0.0"}},{"$f":"W27/V27","v":{"v":293.8666666666667,"d":"293.9"}},{"$f":"VLOOKUP(A27,Formelhilfe!$A$9:$P$44,16,FALSE)","v":{"v":3,"d":"3.0"}},{"$f":"SUM(C27:H27,L27:Q27)","v":881.6}]
["Michael Boje",{"$f":"VLOOKUP(A28,'Wettkampf 1'!$B$10:$C$45,2,FALSE)","v":"Lahn V"},{"$f":"VLOOKUP(A28,'Wettkampf 1'!$B$10:$D$45,3,FALSE)","v":{"v":0,"d":"0.0"}},{"$f":"VLOOKUP($A28,'2'!$B$10:$D$45,3,FALSE)","v":298.7},{"$f":"VLOOKUP($A28,'3'!$B$10:$D$45,3,FALSE)","v":{"v":0,"d":"0.0"}},{"$f":"VLOOKUP($A28,'4'!$B$10:$D$45,3,FALSE)","v":{"v":0,"d":"0.0"}},{"$f":"VLOOKUP($A28,'5'!$B$10:$D$45,3,FALSE)","v":{"v":0,"d":"0.0"}},{"$f":"VLOOKUP($A28,'6'!$B$10:$D$45,3,FALSE)","v":{"v":0,"d":"0.0"}},{"$f":"K28/J28","v":298.7},{"$f":"VLOOKUP(A28,Formelhilfe!$A$9:$H$44,8,FALSE)","v":{"v":1,"d":"1.0"}},{"$f":"SUM(C28:H28)","v":298.7},{"$f":"VLOOKUP($A28,'7'!$B$10:$D$45,3,FALSE)","v":{"v":0,"d":"0.0"}},{"$f":"VLOOKUP($A28,'8'!$B$10:$D$45,3,FALSE)","v":{"v":0,"d":"0.0"}},{"$f":"VLOOKUP($A28,'9'!$B$10:$D$45,3,FALSE)","v":{"v":0,"d":"0.0"}},{"$f":"VLOOKUP($A28,'10'!$B$10:$D$45,3,FALSE)","v":{"v":0,"d":"0.0"}},{"$f":"VLOOKUP($A28,'11'!$B$10:$D$45,3,FALSE)","v":{"v":0,"d":"0.0"}},{"$f":"VLOOKUP($A28,'12'!$B$10:$D$45,3,FALSE)","v":{"v":0,"d":"0.0"}},{"$f":"T28/S28","v":{"$error":"#DIV/0!"}},{"$f":"VLOOKUP(A28,Formelhilfe!$A$9:$O$44,15,FALSE)","v":{"v":0,"d":"0.0"}},{"$f":"SUM(L28:Q28)","v":{"v":0,"d":"0.0"}},{"$f":"W28/V28","v":298.7},{"$f":"VLOOKUP(A28,Formelhilfe!$A$9:$P$44,16,FALSE)","v":{"v":1,"d":"1.0"}},{"$f":"SUM(C28:H28,L28:Q28)","v":298.7}]
["Jan-Niklas Lindemann",{"$f":"VLOOKUP(A29,'Wettkampf 1'!$B$10:$C$45,2,FALSE)","v":"Esterwegen II"},{"$f":"VLOOKUP(A29,'Wettkampf 1'!$B$10:$D$45,3,FALSE)","v":{"v":0,"d":"0.0"}},{"$f":"VLOOKUP($A29,'2'!$B$10:$D$45,3,FALSE)","v":{"v":0,"d":"0.0"}},{"$f":"VLOOKUP($A29,'3'!$B$10:$D$45,3,FALSE)","v":{"v":0,"d":"0.0"}},{"$f":"VLOOKUP($A29,'4'!$B$10:$D$45,3,FALSE)","v":{"v":0,"d":"0.0"}},{"$f":"VLOOKUP($A29,'5'!$B$10:$D$45,3,FALSE)","v":{"v":0,"d":"0.0"}},{"$f":"VLOOKUP($A29,'6'!$B$10:$D$45,3,FALSE)","v":{"v":0,"d":"0.0"}},{"$f":"K29/J29","v":{"$error":"#DIV/0!"}},{"$f":"VLOOKUP(A29,Formelhilfe!$A$9:$H$44,8,FALSE)","v":{"v":0,"d":"0.0"}},{"$f":"SUM(C29:H29)","v":{"v":0,"d":"0.0"}},{"$f":"VLOOKUP($A29,'7'!$B$10:$D$45,3,FALSE)","v":{"v":0,"d":"0.0"}},{"$f":"VLOOKUP($A29,'8'!$B$10:$D$45,3,FALSE)","v":{"v":0,"d":"0.0"}},{"$f":"VLOOKUP($A29,'9'!$B$10:$D$45,3,FALSE)","v":{"v":0,"d":"0.0"}},{"$f":"VLOOKUP($A29,'10'!$B$10:$D$45,3,FALSE)","v":{"v":0,"d":"0.0"}},{"$f":"VLOOKUP($A29,'11'!$B$10:$D$45,3,FALSE)","v":{"v":0,"d":"0.0"}},{"$f":"VLOOKUP($A29,'12'!$B$10:$D$45,3,FALSE)","v":{"v":0,"d":"0.0"}},{"$f":"T29/S29","v":{"$error":"#DIV/0!"}},{"$f":"VLOOKUP(A29,Formelhilfe!$A$9:$O$44,15,FALSE)","v":{"v":0,"d":"0.0"}},{"$f":"SUM(L29:Q29)","v":{"v":0,"d":"0.0"}},{"$f":"W29/V29","v":{"$error":"#DIV/0!"}},{"$f":"VLOOKUP(A29,Formelhilfe!$A$9:$P$44,16,FALSE)","v":{"v":0,"d":"0.0"}},{"$f":"SUM(C29:H29,L29:Q29)","v":{"v":0,"d":"0.0"}}]
["Schütze 29",{"$f":"VLOOKUP(A30,'Wettkampf 1'!$B$10:$C$45,2,FALSE)","v":{"v":0,"d":"0.0"}},{"$f":"VLOOKUP(A30,'Wettkampf 1'!$B$10:$D$45,3,FALSE)","v":{"v":0,"d":"0.0"}},{"$f":"VLOOKUP($A30,'2'!$B$10:$D$45,3,FALSE)","v":{"v":0,"d":"0.0"}},{"$f":"VLOOKUP($A30,'3'!$B$10:$D$45,3,FALSE)","v":{"v":0,"d":"0.0"}},{"$f":"VLOOKUP($A30,'4'!$B$10:$D$45,3,FALSE)","v":{"v":0,"d":"0.0"}},{"$f":"VLOOKUP($A30,'5'!$B$10:$D$45,3,FALSE)","v":{"v":0,"d":"0.0"}},{"$f":"VLOOKUP($A30,'6'!$B$10:$D$45,3,FALSE)","v":{"v":0,"d":"0.0"}},{"$f":"K30/J30","v":{"$error":"#DIV/0!"}},{"$f":"VLOOKUP(A30,Formelhilfe!$A$9:$H$44,8,FALSE)","v":{"v":0,"d":"0.0"}},{"$f":"SUM(C30:H30)","v":{"v":0,"d":"0.0"}},{"$f":"VLOOKUP($A30,'7'!$B$10:$D$45,3,FALSE)","v":{"v":0,"d":"0.0"}},{"$f":"VLOOKUP($A30,'8'!$B$10:$D$45,3,FALSE)","v":{"v":0,"d":"0.0"}},{"$f":"VLOOKUP($A30,'9'!$B$10:$D$45,3,FALSE)","v":{"v":0,"d":"0.0"}},{"$f":"VLOOKUP($A30,'10'!$B$10:$D$45,3,FALSE)","v":{"v":0,"d":"0.0"}},{"$f":"VLOOKUP($A30,'11'!$B$10:$D$45,3,FALSE)","v":{"v":0,"d":"0.0"}},{"$f":"VLOOKUP($A30,'12'!$B$10:$D$45,3,FALSE)","v":{"v":0,"d":"0.0"}},{"$f":"T30/S30","v":{"$error":"#DIV/0!"}},{"$f":"VLOOKUP(A30,Formelhilfe!$A$9:$O$44,15,FALSE)","v":{"v":0,"d":"0.0"}},{"$f":"SUM(L30:Q30)","v":{"v":0,"d":"0.0"}},{"$f":"W30/V30","v":{"$error":"#DIV/0!"}},{"$f":"VLOOKUP(A30,Formelhilfe!$A$9:$P$44,16,FALSE)","v":{"v":0,"d":"0.0"}},{"$f":"SUM(C30:H30,L30:Q30)","v":{"v":0,"d":"0.0"}}]
["Schütze 30",{"$f":"VLOOKUP(A31,'Wettkampf 1'!$B$10:$C$45,2,FALSE)","v":{"v":0,"d":"0.0"}},{"$f":"VLOOKUP(A31,'Wettkampf 1'!$B$10:$D$45,3,FALSE)","v":{"v":0,"d":"0.0"}},{"$f":"VLOOKUP($A31,'2'!$B$10:$D$45,3,FALSE)","v":{"v":0,"d":"0.0"}},{"$f":"VLOOKUP($A31,'3'!$B$10:$D$45,3,FALSE)","v":{"v":0,"d":"0.0"}},{"$f":"VLOOKUP($A31,'4'!$B$10:$D$45,3,FALSE)","v":{"v":0,"d":"0.0"}},{"$f":"VLOOKUP($A31,'5'!$B$10:$D$45,3,FALSE)","v":{"v":0,"d":"0.0"}},{"$f":"VLOOKUP($A31,'6'!$B$10:$D$45,3,FALSE)","v":{"v":0,"d":"0.0"}},{"$f":"K31/J31","v":{"$error":"#DIV/0!"}},{"$f":"VLOOKUP(A31,Formelhilfe!$A$9:$H$44,8,FALSE)","v":{"v":0,"d":"0.0"}},{"$f":"SUM(C31:H31)","v":{"v":0,"d":"0.0"}},{"$f":"VLOOKUP($A31,'7'!$B$10:$D$45,3,FALSE)","v":{"v":0,"d":"0.0"}},{"$f":"VLOOKUP($A31,'8'!$B$10:$D$45,3,FALSE)","v":{"v":0,"d":"0.0"}},{"$f":"VLOOKUP($A31,'9'!$B$10:$D$45,3,FALSE)","v":{"v":0,"d":"0.0"}},{"$f":"VLOOKUP($A31,'10'!$B$10:$D$45,3,FALSE)","v":{"v":0,"d":"0.0"}},{"$f":"VLOOKUP($A31,'11'!$B$10:$D$45,3,FALSE)","v":{"v":0,"d":"0.0"}},{"$f":"VLOOKUP($A31,'12'!$B$10:$D$45,3,FALSE)","v":{"v":0,"d":"0.0"}},{"$f":"T31/S31","v":{"$error":"#DIV/0!"}},{"$f":"VLOOKUP(A31,Formelhilfe!$A$9:$O$44,15,FALSE)","v":{"v":0,"d":"0.0"}},{"$f":"SUM(L31:Q31)","v":{"v":0,"d":"0.0"}},{"$f":"W31/V31","v":{"$error":"#DIV/0!"}},{"$f":"VLOOKUP(A31,Formelhilfe!$A$9:$P$44,16,FALSE)","v":{"v":0,"d":"0.0"}},{"$f":"SUM(C31:H31,L31:Q31)","v":{"v":0,"d":"0.0"}}]
["Schütze 31",{"$f":"VLOOKUP(A32,'Wettkampf 1'!$B$10:$C$45,2,FALSE)","v":{"v":0,"d":"0.0"}},{"$f":"VLOOKUP(A32,'Wettkampf 1'!$B$10:$D$45,3,FALSE)","v":{"v":0,"d":"0.0"}},{"$f":"VLOOKUP($A32,'2'!$B$10:$D$45,3,FALSE)","v":{"v":0,"d":"0.0"}},{"$f":"VLOOKUP($A32,'3'!$B$10:$D$45,3,FALSE)","v":{"v":0,"d":"0.0"}},{"$f":"VLOOKUP($A32,'4'!$B$10:$D$45,3,FALSE)","v":{"v":0,"d":"0.0"}},{"$f":"VLOOKUP($A32,'5'!$B$10:$D$45,3,FALSE)","v":{"v":0,"d":"0.0"}},{"$f":"VLOOKUP($A32,'6'!$B$10:$D$45,3,FALSE)","v":{"v":0,"d":"0.0"}},{"$f":"K32/J32","v":{"$error":"#DIV/0!"}},{"$f":"VLOOKUP(A32,Formelhilfe!$A$9:$H$44,8,FALSE)","v":{"v":0,"d":"0.0"}},{"$f":"SUM(C32:H32)","v":{"v":0,"d":"0.0"}},{"$f":"VLOOKUP($A32,'7'!$B$10:$D$45,3,FALSE)","v":{"v":0,"d":"0.0"}},{"$f":"VLOOKUP($A32,'8'!$B$10:$D$45,3,FALSE)","v":{"v":0,"d":"0.0"}},{"$f":"VLOOKUP($A32,'9'!$B$10:$D$45,3,FALSE)","v":{"v":0,"d":"0.0"}},{"$f":"VLOOKUP($A32,'10'!$B$10:$D$45,3,FALSE)","v":{"v":0,"d":"0.0"}},{"$f":"VLOOKUP($A32,'11'!$B$10:$D$45,3,FALSE)","v":{"v":0,"d":"0.0"}},{"$f":"VLOOKUP($A32,'12'!$B$10:$D$45,3,FALSE)","v":{"v":0,"d":"0.0"}},{"$f":"T32/S32","v":{"$error":"#DIV/0!"}},{"$f":"VLOOKUP(A32,Formelhilfe!$A$9:$O$44,15,FALSE)","v":{"v":0,"d":"0.0"}},{"$f":"SUM(L32:Q32)","v":{"v":0,"d":"0.0"}},{"$f":"W32/V32","v":{"$error":"#DIV/0!"}},{"$f":"VLOOKUP(A32,Formelhilfe!$A$9:$P$44,16,FALSE)","v":{"v":0,"d":"0.0"}},{"$f":"SUM(C32:H32,L32:Q32)","v":{"v":0,"d":"0.0"}}]
["Schütze 32",{"$f":"VLOOKUP(A33,'Wettkampf 1'!$B$10:$C$45,2,FALSE)","v":{"v":0,"d":"0.0"}},{"$f":"VLOOKUP(A33,'Wettkampf 1'!$B$10:$D$45,3,FALSE)","v":{"v":0,"d":"0.0"}},{"$f":"VLOOKUP($A33,'2'!$B$10:$D$45,3,FALSE)","v":{"v":0,"d":"0.0"}},{"$f":"VLOOKUP($A33,'3'!$B$10:$D$45,3,FALSE)","v":{"v":0,"d":"0.0"}},{"$f":"VLOOKUP($A33,'4'!$B$10:$D$45,3,FALSE)","v":{"v":0,"d":"0.0"}},{"$f":"VLOOKUP($A33,'5'!$B$10:$D$45,3,FALSE)","v":{"v":0,"d":"0.0"}},{"$f":"VLOOKUP($A33,'6'!$B$10:$D$45,3,FALSE)","v":{"v":0,"d":"0.0"}},{"$f":"K33/J33","v":{"$error":"#DIV/0!"}},{"$f":"VLOOKUP(A33,Formelhilfe!$A$9:$H$44,8,FALSE)","v":{"v":0,"d":"0.0"}},{"$f":"SUM(C33:H33)","v":{"v":0,"d":"0.0"}},{"$f":"VLOOKUP($A33,'7'!$B$10:$D$45,3,FALSE)","v":{"v":0,"d":"0.0"}},{"$f":"VLOOKUP($A33,'8'!$B$10:$D$45,3,FALSE)","v":{"v":0,"d":"0.0"}},{"$f":"VLOOKUP($A33,'9'!$B$10:$D$45,3,FALSE)","v":{"v":0,"d":"0.0"}},{"$f":"VLOOKUP($A33,'10'!$B$10:$D$45,3,FALSE)","v":{"v":0,"d":"0.0"}},{"$f":"VLOOKUP($A33,'11'!$B$10:$D$45,3,FALSE)","v":{"v":0,"d":"0.0"}},{"$f":"VLOOKUP($A33,'12'!$B$10:$D$45,3,FALSE)","v":{"v":0,"d":"0.0"}},{"$f":"T33/S33","v":{"$error":"#DIV/0!"}},{"$f":"VLOOKUP(A33,Formelhilfe!$A$9:$O$44,15,FALSE)","v":{"v":0,"d":"0.0"}},{"$f":"SUM(L33:Q33)","v":{"v":0,"d":"0.0"}},{"$f":"W33/V33","v":{"$error":"#DIV/0!"}},{"$f":"VLOOKUP(A33,Formelhilfe!$A$9:$P$44,16,FALSE)","v":{"v":0,"d":"0.0"}},{"$f":"SUM(C33:H33,L33:Q33)","v":{"v":0,"d":"0.0"}}]
["Schütze 33",{"$f":"VLOOKUP(A34,'Wettkampf 1'!$B$10:$C$45,2,FALSE)","v":{"v":0,"d":"0.0"}},{"$f":"VLOOKUP(A34,'Wettkampf 1'!$B$10:$D$45,3,FALSE)","v":{"v":0,"d":"0.0"}},{"$f":"VLOOKUP($A34,'2'!$B$10:$D$45,3,FALSE)","v":{"v":0,"d":"0.0"}},{"$f":"VLOOKUP($A34,'3'!$B$10:$D$45,3,FALSE)","v":{"v":0,"d":"0.0"}},{"$f":"VLOOKUP($A34,'4'!$B$10:$D$45,3,FALSE)","v":{"v":0,"d":"0.0"}},{"$f":"VLOOKUP($A34,'5'!$B$10:$D$45,3,FALSE)","v":{"v":0,"d":"0.0"}},{"$f":"VLOOKUP($A34,'6'!$B$10:$D$45,3,FALSE)","v":{"v":0,"d":"0.0"}},{"$f":"K34/J34","v":{"$error":"#DIV/0!"}},{"$f":"VLOOKUP(A34,Formelhilfe!$A$9:$H$44,8,FALSE)","v":{"v":0,"d":"0.0"}},{"$f":"SUM(C34:H34)","v":{"v":0,"d":"0.0"}},{"$f":"VLOOKUP($A34,'7'!$B$10:$D$45,3,FALSE)","v":{"v":0,"d":"0.0"}},{"$f":"VLOOKUP($A34,'8'!$B$10:$D$45,3,FALSE)","v":{"v":0,"d":"0.0"}},{"$f":"VLOOKUP($A34,'9'!$B$10:$D$45,3,FALSE)","v":{"v":0,"d":"0.0"}},{"$f":"VLOOKUP($A34,'10'!$B$10:$D$45,3,FALSE)","v":{"v":0,"d":"0.0"}},{"$f":"VLOOKUP($A34,'11'!$B$10:$D$45,3,FALSE)","v":{"v":0,"d":"0.0"}},{"$f":"VLOOKUP($A34,'12'!$B$10:$D$45,3,FALSE)","v":{"v":0,"d":"0.0"}},{"$f":"T34/S34","v":{"$error":"#DIV/0!"}},{"$f":"VLOOKUP(A34,Formelhilfe!$A$9:$O$44,15,FALSE)","v":{"v":0,"d":"0.0"}},{"$f":"SUM(L34:Q34)","v":{"v":0,"d":"0.0"}},{"$f":"W34/V34","v":{"$error":"#DIV/0!"}},{"$f":"VLOOKUP(A34,Formelhilfe!$A$9:$P$44,16,FALSE)","v":{"v":0,"d":"0.0"}},{"$f":"SUM(C34:H34,L34:Q34)","v":{"v":0,"d":"0.0"}}]
["Schütze 34",{"$f":"VLOOKUP(A35,'Wettkampf 1'!$B$10:$C$45,2,FALSE)","v":{"v":0,"d":"0.0"}},{"$f":"VLOOKUP(A35,'Wettkampf 1'!$B$10:$D$45,3,FALSE)","v":{"v":0,"d":"0.0"}},{"$f":"VLOOKUP($A35,'2'!$B$10:$D$45,3,FALSE)","v":{"v":0,"d":"0.0"}},{"$f":"VLOOKUP($A35,'3'!$B$10:$D$45,3,FALSE)","v":{"v":0,"d":"0.0"}},{"$f":"VLOOKUP($A35,'4'!$B$10:$D$45,3,FALSE)","v":{"v":0,"d":"0.0"}},{"$f":"VLOOKUP($A35,'5'!$B$10:$D$45,3,FALSE)","v":{"v":0,"d":"0.0"}},{"$f":"VLOOKUP($A35,'6'!$B$10:$D$45,3,FALSE)","v":{"v":0,"d":"0.0"}},{"$f":"K35/J35","v":{"$error":"#DIV/0!"}},{"$f":"VLOOKUP(A35,Formelhilfe!$A$9:$H$44,8,FALSE)","v":{"v":0,"d":"0.0"}},{"$f":"SUM(C35:H35)","v":{"v":0,"d":"0.0"}},{"$f":"VLOOKUP($A35,'7'!$B$10:$D$45,3,FALSE)","v":{"v":0,"d":"0.0"}},{"$f":"VLOOKUP($A35,'8'!$B$10:$D$45,3,FALSE)","v":{"v":0,"d":"0.0"}},{"$f":"VLOOKUP($A35,'9'!$B$10:$D$45,3,FALSE)","v":{"v":0,"d":"0.0"}},{"$f":"VLOOKUP($A35,'10'!$B$10:$D$45,3,FALSE)","v":{"v":0,"d":"0.0"}},{"$f":"VLOOKUP($A35,'11'!$B$10:$D$45,3,FALSE)","v":{"v":0,"d":"0.0"}},{"$f":"VLOOKUP($A35,'12'!$B$10:$D$45,3,FALSE)","v":{"v":0,"d":"0.0"}},{"$f":"T35/S35","v":{"$error":"#DIV/0!"}},{"$f":"VLOOKUP(A35,Formelhilfe!$A$9:$O$44,15,FALSE)","v":{"v":0,"d":"0.0"}},{"$f":"SUM(L35:Q35)","v":{"v":0,"d":"0.0"}},{"$f":"W35/V35","v":{"$error":"#DIV/0!"}},{"$f":"VLOOKUP(A35,Formelhilfe!$A$9:$P$44,16,FALSE)","v":{"v":0,"d":"0.0"}},{"$f":"SUM(C35:H35,L35:Q35)","v":{"v":0,"d":"0.0"}}]
["Schütze 35",{"$f":"VLOOKUP(A36,'Wettkampf 1'!$B$10:$C$45,2,FALSE)","v":{"v":0,"d":"0.0"}},{"$f":"VLOOKUP(A36,'Wettkampf 1'!$B$10:$D$45,3,FALSE)","v":{"v":0,"d":"0.0"}},{"$f":"VLOOKUP($A36,'2'!$B$10:$D$45,3,FALSE)","v":{"v":0,"d":"0.0"}},{"$f":"VLOOKUP($A36,'3'!$B$10:$D$45,3,FALSE)","v":{"v":0,"d":"0.0"}},{"$f":"VLOOKUP($A36,'4'!$B$10:$D$45,3,FALSE)","v":{"v":0,"d":"0.0"}},{"$f":"VLOOKUP($A36,'5'!$B$10:$D$45,3,FALSE)","v":{"v":0,"d":"0.0"}},{"$f":"VLOOKUP($A36,'6'!$B$10:$D$45,3,FALSE)","v":{"v":0,"d":"0.0"}},{"$f":"K36/J36","v":{"$error":"#DIV/0!"}},{"$f":"VLOOKUP(A36,Formelhilfe!$A$9:$H$44,8,FALSE)","v":{"v":0,"d":"0.0"}},{"$f":"SUM(C36:H36)","v":{"v":0,"d":"0.0"}},{"$f":"VLOOKUP($A36,'7'!$B$10:$D$45,3,FALSE)","v":{"v":0,"d":"0.0"}},{"$f":"VLOOKUP($A36,'8'!$B$10:$D$45,3,FALSE)","v":{"v":0,"d":"0.0"}},{"$f":"VLOOKUP($A36,'9'!$B$10:$D$45,3,FALSE)","v":{"v":0,"d":"0.0"}},{"$f":"VLOOKUP($A36,'10'!$B$10:$D$45,3,FALSE)","v":{"v":0,"d":"0.0"}},{"$f":"VLOOKUP($A36,'11'!$B$10:$D$45,3,FALSE)","v":{"v":0,"d":"0.0"}},{"$f":"VLOOKUP($A36,'12'!$B$10:$D$45,3,FALSE)","v":{"v":0,"d":"0.0"}},{"$f":"T36/S36","v":{"$error":"#DIV/0!"}},{"$f":"VLOOKUP(A36,Formelhilfe!$A$9:$O$44,15,FALSE)","v":{"v":0,"d":"0.0"}},{"$f":"SUM(L36:Q36)","v":{"v":0,"d":"0.0"}},{"$f":"W36/V36","v":{"$error":"#DIV/0!"}},{"$f":"VLOOKUP(A36,Formelhilfe!$A$9:$P$44,16,FALSE)","v":{"v":0,"d":"0.0"}},{"$f":"SUM(C36:H36,L36:Q36)","v":{"v":0,"d":"0.0"}}]
["Schütze 36",{"$f":"VLOOKUP(A37,'Wettkampf 1'!$B$10:$C$45,2,FALSE)","v":{"v":0,"d":"0.0"}},{"$f":"VLOOKUP(A37,'Wettkampf 1'!$B$10:$D$45,3,FALSE)","v":{"v":0,"d":"0.0"}},{"$f":"VLOOKUP($A37,'2'!$B$10:$D$45,3,FALSE)","v":{"v":0,"d":"0.0"}},{"$f":"VLOOKUP($A37,'3'!$B$10:$D$45,3,FALSE)","v":{"v":0,"d":"0.0"}},{"$f":"VLOOKUP($A37,'4'!$B$10:$D$45,3,FALSE)","v":{"v":0,"d":"0.0"}},{"$f":"VLOOKUP($A37,'5'!$B$10:$D$45,3,FALSE)","v":{"v":0,"d":"0.0"}},{"$f":"VLOOKUP($A37,'6'!$B$10:$D$45,3,FALSE)","v":{"v":0,"d":"0.0"}},{"$f":"K37/J37","v":{"$error":"#DIV/0!"}},{"$f":"VLOOKUP(A37,Formelhilfe!$A$9:$H$44,8,FALSE)","v":{"v":0,"d":"0.0"}},{"$f":"SUM(C37:H37)","v":{"v":0,"d":"0.0"}},{"$f":"VLOOKUP($A37,'7'!$B$10:$D$45,3,FALSE)","v":{"v":0,"d":"0.0"}},{"$f":"VLOOKUP($A37,'8'!$B$10:$D$45,3,FALSE)","v":{"v":0,"d":"0.0"}},{"$f":"VLOOKUP($A37,'9'!$B$10:$D$45,3,FALSE)","v":{"v":0,"d":"0.0"}},{"$f":"VLOOKUP($A37,'10'!$B$10:$D$45,3,FALSE)","v":{"v":0,"d":"0.0"}},{"$f":"VLOOKUP($A37,'11'!$B$10:$D$45,3,FALSE)","v":{"v":0,"d":"0.0"}},{"$f":"VLOOKUP($A37,'12'!$B$10:$D$45,3,FALSE)","v":{"v":0,"d":"0.0"}},{"$f":"T37/S37","v":{"$error":"#DIV/0!"}},{"$f":"VLOOKUP(A37,Formelhilfe!$A$9:$O$44,15,FALSE)","v":{"v":0,"d":"0.0"}},{"$f":"SUM(L37:Q37)","v":{"v":0,"d":"0.0"}},{"$f":"W37/V37","v":{"$error":"#DIV/0!"}},{"$f":"VLOOKUP(A37,Formelhilfe!$A$9:$P$44,16,FALSE)","v":{"v":0,"d":"0.0"}},{"$f":"SUM(C37:H37,L37:Q37)","v":{"v":0,"d":"0.0"}}]

{"sheet":"Formelhilfe","index":16,"n_rows":45,"n_cols":21,"rows_kept":45,"hidden":true}
[null,1,2,3,4,5,6,"Hinrunde Schnitt",7,8,9,10,11,12,"Rückrunde Schnitt","Gesamt Schnitt",null,null,"Kreisoberliga","Schützen","2019/2020"]
[{"$f":"'Wettkampf 1'!B2","v":"Spahnharrenstätte III"},{"$f":"IF('Wettkampf 1'!D2>0,1,0)","v":1},{"$f":"IF('2'!$D2>0,1,0)","v":1},{"$f":"IF('3'!$D2>0,1,0)","v":1},{"$f":"IF('4'!$D2>0,1,0)","v":1},{"$f":"IF('5'!$D2>0,1,0)","v":1},{"$f":"IF('6'!$D2>0,1,0)","v":1},{"$f":"B2+C2+D2+E2+F2+G2","v":6},{"$f":"IF('7'!$D2>0,1,0)","v":1},{"$f":"IF('8'!$D2>0,1,0)","v":1},{"$f":"IF('9'!$D2>0,1,0)","v":1},{"$f":"IF('10'!$D2>0,1,0)","v":1},{"$f":"IF('11'!$D2>0,1,0)","v":1},{"$f":"IF('12'!$D2>0,1,0)","v":0},{"$f":"I2+J2+K2+L2+M2+N2","v":5},{"$f":"O2+H2","v":11},null,null,"1. Kreisliga","Damen","2020/2021"]
[{"$f":"'Wettkampf 1'!B3","v":"Esterwegen II"},{"$f":"IF('Wettkampf 1'!D3>0,1,0)","v":1},{"$f":"IF('2'!$D3>0,1,0)","v":1},{"$f":"IF('3'!$D3>0,1,0)","v":1},{"$f":"IF('4'!$D3>0,1,0)","v":1},{"$f":"IF('5'!$D3>0,1,0)","v":1},{"$f":"IF('6'!$D3>0,1,0)","v":1},6,{"$f":"IF('7'!$D3>0,1,0)","v":1},{"$f":"IF('8'!$D3>0,1,0)","v":1},{"$f":"IF('9'!$D3>0,1,0)","v":1},{"$f":"IF('10'!$D3>0,1,0)","v":1},{"$f":"IF('11'!$D3>0,1,0)","v":1},{"$f":"IF('12'!$D3>0,1,0)","v":0},5,11,null,null,"2. Kreisliga","Altersgruppe","2021/2022"]
[{"$f":"'Wettkampf 1'!B4","v":"Neubörger II"},{"$f":"IF('Wettkampf 1'!D4>0,1,0)","v":1},{"$f":"IF('2'!$D4>0,1,0)","v":1},{"$f":"IF('3'!$D4>0,1,0)","v":1},{"$f":"IF('4'!$D4>0,1,0)","v":1},{"$f":"IF('5'!$D4>0,1,0)","v":1},{"$f":"IF('6'!$D4>0,1,0)","v":1},6,{"$f":"IF('7'!$D4>0,1,0)","v":1},{"$f":"IF('8'!$D4>0,1,0)","v":1},{"$f":"IF('9'!$D4>0,1,0)","v":1},{"$f":"IF('10'!$D4>0,1,0)","v":1},{"$f":"IF('11'!$D4>0,1,0)","v":1},{"$f":"IF('12'!$D4>0,1,0)","v":0},5,11,null,null,"1. Kreisklasse","Senioren","2022/2023"]
[{"$f":"'Wettkampf 1'!B5","v":"Lahn V"},{"$f":"IF('Wettkampf 1'!D5>0,1,0)","v":1},{"$f":"IF('2'!$D5>0,1,0)","v":1},{"$f":"IF('3'!$D5>0,1,0)","v":1},{"$f":"IF('4'!$D5>0,1,0)","v":1},{"$f":"IF('5'!$D5>0,1,0)","v":1},{"$f":"IF('6'!$D5>0,1,0)","v":1},6,{"$f":"IF('7'!$D5>0,1,0)","v":1},{"$f":"IF('8'!$D5>0,1,0)","v":1},{"$f":"IF('9'!$D5>0,1,0)","v":1},{"$f":"IF('10'!$D5>0,1,0)","v":1},{"$f":"IF('11'!$D5>0,1,0)","v":1},{"$f":"IF('12'!$D5>0,1,0)","v":0},5,11,null,null,"2. Kreisklasse","   ","2023/2024"]
[{"$f":"'Wettkampf 1'!B6","v":"Spahnharrenstätte II"},{"$f":"IF('Wettkampf 1'!D6>0,1,0)","v":1},{"$f":"IF('2'!$D6>0,1,0)","v":1},{"$f":"IF('3'!$D6>0,1,0)","v":1},{"$f":"IF('4'!$D6>0,1,0)","v":1},{"$f":"IF('5'!$D6>0,1,0)","v":1},{"$f":"IF('6'!$D6>0,1,0)","v":1},6,{"$f":"IF('7'!$D6>0,1,0)","v":1},{"$f":"IF('8'!$D6>0,1,0)","v":1},{"$f":"IF('9'!$D6>0,1,0)","v":1},{"$f":"IF('10'!$D6>0,1,0)","v":1},{"$f":"IF('11'!$D6>0,1,0)","v":1},{"$f":"IF('12'!$D6>0,1,0)","v":0},5,11,null,null,"3. Kreisklasse"]
[{"$f":"'Wettkampf 1'!B7","v":"Eisten II "},{"$f":"IF('Wettkampf 1'!D7>0,1,0)","v":1},{"$f":"IF('2'!$D7>0,1,0)","v":1},{"$f":"IF('3'!$D7>0,1,0)","v":1},{"$f":"IF('4'!$D7>0,1,0)","v":1},{"$f":"IF('5'!$D7>0,1,0)","v":1},{"$f":"IF('6'!$D7>0,1,0)","v":1},6,{"$f":"IF('7'!$D7>0,1,0)","v":1},{"$f":"IF('8'!$D7>0,1,0)","v":1},{"$f":"IF('9'!$D7>0,1,0)","v":1},{"$f":"IF('10'!$D7>0,1,0)","v":1},{"$f":"IF('11'!$D7>0,1,0)","v":1},{"$f":"IF('12'!$D7>0,1,0)","v":0},5,11,null,null,"4. Kreisklasse"]
[{"$nulls":18},"5. Kreisklasse"]
["Heiko Micksch",{"$f":"IF('Wettkampf 1'!D10>0,1,0)","v":1},{"$f":"IF('2'!$D10>0,1,0)","v":1},{"$f":"IF('3'!$D10>0,1,0)","v":1},{"$f":"IF('4'!$D10>0,1,0)","v":1},{"$f":"IF('5'!$D10>0,1,0)","v":1},{"$f":"IF('6'!$D10>0,1,0)","v":1},{"$f":"B9+C9+D9+E9+F9+G9","v":6},{"$f":"IF('7'!$D10>0,1,0)","v":1},{"$f":"IF('8'!$D10>0,1,0)","v":1},{"$f":"IF('9'!$D10>0,1,0)","v":1},{"$f":"IF('10'!$D10>0,1,0)","v":1},{"$f":"IF('11'!$D10>0,1,0)","v":1},{"$f":"IF('12'!$D10>0,1,0)","v":0},{"$f":"I9+J9+K9+L9+M9+N9","v":5},{"$f":"O9+H9","v":11},null,null,"6. Kreisklasse"]
["Dirk Meyer",{"$f":"IF('Wettkampf 1'!D11>0,1,0)","v":1},{"$f":"IF('2'!$D11>0,1,0)","v":1},{"$f":"IF('3'!$D11>0,1,0)","v":1},{"$f":"IF('4'!$D11>0,1,0)","v":1},{"$f":"IF('5'!$D11>0,1,0)","v":1},{"$f":"IF('6'!$D11>0,1,0)","v":1},{"$f":"B10+C10+D10+E10+F10+G10","v":6},{"$f":"IF('7'!$D11>0,1,0)","v":0},{"$f":"IF('8'!$D11>0,1,0)","v":1},{"$f":"IF('9'!$D11>0,1,0)","v":1},{"$f":"IF('10'!$D11>0,1,0)","v":1},{"$f":"IF('11'!$D11>0,1,0)","v":1},{"$f":"IF('12'!$D11>0,1,0)","v":0},{"$f":"I10+J10+K10+L10+M10+N10","v":4},{"$f":"O10+H10","v":10},null,null,"7. Kreisklasse"]
["Sebastian Albers",{"$f":"IF('Wettkampf 1'!D12>0,1,0)","v":1},{"$f":"IF('2'!$D12>0,1,0)","v":1},{"$f":"IF('3'!$D12>0,1,0)","v":1},{"$f":"IF('4'!$D12>0,1,0)","v":1},{"$f":"IF('5'!$D12>0,1,0)","v":1},{"$f":"IF('6'!$D12>0,1,0)","v":1},6,{"$f":"IF('7'!$D12>0,1,0)","v":1},{"$f":"IF('8'!$D12>0,1,0)","v":1},{"$f":"IF('9'!$D12>0,1,0)","v":1},{"$f":"IF('10'!$D12>0,1,0)","v":1},{"$f":"IF('11'!$D12>0,1,0)","v":1},{"$f":"IF('12'!$D12>0,1,0)","v":0},5,11]
["Achim Will",{"$f":"IF('Wettkampf 1'!D13>0,1,0)","v":1},{"$f":"IF('2'!$D13>0,1,0)","v":1},{"$f":"IF('3'!$D13>0,1,0)","v":1},{"$f":"IF('4'!$D13>0,1,0)","v":1},{"$f":"IF('5'!$D13>0,1,0)","v":1},{"$f":"IF('6'!$D13>0,1,0)","v":1},6,{"$f":"IF('7'!$D13>0,1,0)","v":1},{"$f":"IF('8'!$D13>0,1,0)","v":1},{"$f":"IF('9'!$D13>0,1,0)","v":1},{"$f":"IF('10'!$D13>0,1,0)","v":1},{"$f":"IF('11'!$D13>0,1,0)","v":1},{"$f":"IF('12'!$D13>0,1,0)","v":0},5,11]
["Christian Grönheim",{"$f":"IF('Wettkampf 1'!D14>0,1,0)","v":1},{"$f":"IF('2'!$D14>0,1,0)","v":1},{"$f":"IF('3'!$D14>0,1,0)","v":1},{"$f":"IF('4'!$D14>0,1,0)","v":1},{"$f":"IF('5'!$D14>0,1,0)","v":1},{"$f":"IF('6'!$D14>0,1,0)","v":1},6,{"$f":"IF('7'!$D14>0,1,0)","v":1},{"$f":"IF('8'!$D14>0,1,0)","v":1},{"$f":"IF('9'!$D14>0,1,0)","v":1},{"$f":"IF('10'!$D14>0,1,0)","v":1},{"$f":"IF('11'!$D14>0,1,0)","v":1},{"$f":"IF('12'!$D14>0,1,0)","v":0},5,11]
["Dieter Hanekamp",{"$f":"IF('Wettkampf 1'!D15>0,1,0)","v":1},{"$f":"IF('2'!$D15>0,1,0)","v":1},{"$f":"IF('3'!$D15>0,1,0)","v":1},{"$f":"IF('4'!$D15>0,1,0)","v":1},{"$f":"IF('5'!$D15>0,1,0)","v":1},{"$f":"IF('6'!$D15>0,1,0)","v":1},6,{"$f":"IF('7'!$D15>0,1,0)","v":1},{"$f":"IF('8'!$D15>0,1,0)","v":1},{"$f":"IF('9'!$D15>0,1,0)","v":1},{"$f":"IF('10'!$D15>0,1,0)","v":1},{"$f":"IF('11'!$D15>0,1,0)","v":1},{"$f":"IF('12'!$D15>0,1,0)","v":0},5,11]
["Josef Langen",{"$f":"IF('Wettkampf 1'!D16>0,1,0)","v":1},{"$f":"IF('2'!$D16>0,1,0)","v":1},{"$f":"IF('3'!$D16>0,1,0)","v":1},{"$f":"IF('4'!$D16>0,1,0)","v":1},{"$f":"IF('5'!$D16>0,1,0)","v":1},{"$f":"IF('6'!$D16>0,1,0)","v":1},6,{"$f":"IF('7'!$D16>0,1,0)","v":1},{"$f":"IF('8'!$D16>0,1,0)","v":1},{"$f":"IF('9'!$D16>0,1,0)","v":1},{"$f":"IF('10'!$D16>0,1,0)","v":1},{"$f":"IF('11'!$D16>0,1,0)","v":1},{"$f":"IF('12'!$D16>0,1,0)","v":0},5,11]
["Johannes Hülsmann",{"$f":"IF('Wettkampf 1'!D17>0,1,0)","v":1},{"$f":"IF('2'!$D17>0,1,0)","v":1},{"$f":"IF('3'!$D17>0,1,0)","v":1},{"$f":"IF('4'!$D17>0,1,0)","v":1},{"$f":"IF('5'!$D17>0,1,0)","v":1},{"$f":"IF('6'!$D17>0,1,0)","v":1},6,{"$f":"IF('7'!$D17>0,1,0)","v":1},{"$f":"IF('8'!$D17>0,1,0)","v":1},{"$f":"IF('9'!$D17>0,1,0)","v":1},{"$f":"IF('10'!$D17>0,1,0)","v":1},{"$f":"IF('11'!$D17>0,1,0)","v":1},{"$f":"IF('12'!$D17>0,1,0)","v":0},5,11]
["Heiner Kröger",{"$f":"IF('Wettkampf 1'!D18>0,1,0)","v":1},{"$f":"IF('2'!$D18>0,1,0)","v":1},{"$f":"IF('3'!$D18>0,1,0)","v":1},{"$f":"IF('4'!$D18>0,1,0)","v":1},{"$f":"IF('5'!$D18>0,1,0)","v":1},{"$f":"IF('6'!$D18>0,1,0)","v":1},6,{"$f":"IF('7'!$D18>0,1,0)","v":1},{"$f":"IF('8'!$D18>0,1,0)","v":1},{"$f":"IF('9'!$D18>0,1,0)","v":1},{"$f":"IF('10'!$D18>0,1,0)","v":1},{"$f":"IF('11'!$D18>0,1,0)","v":1},{"$f":"IF('12'!$D18>0,1,0)","v":0},5,11]
["Bernd Nortmann",{"$f":"IF('Wettkampf 1'!D19>0,1,0)","v":1},{"$f":"IF('2'!$D19>0,1,0)","v":1},{"$f":"IF('3'!$D19>0,1,0)","v":1},{"$f":"IF('4'!$D19>0,1,0)","v":1},{"$f":"IF('5'!$D19>0,1,0)","v":1},{"$f":"IF('6'!$D19>0,1,0)","v":1},6,{"$f":"IF('7'!$D19>0,1,0)","v":1},{"$f":"IF('8'!$D19>0,1,0)","v":1},{"$f":"IF('9'!$D19>0,1,0)","v":1},{"$f":"IF('10'!$D19>0,1,0)","v":1},{"$f":"IF('11'!$D19>0,1,0)","v":1},{"$f":"IF('12'!$D19>0,1,0)","v":0},5,11]
["Oliver Reinelt",{"$f":"IF('Wettkampf 1'!D20>0,1,0)","v":1},{"$f":"IF('2'!$D20>0,1,0)","v":1},{"$f":"IF('3'!$D20>0,1,0)","v":1},{"$f":"IF('4'!$D20>0,1,0)","v":1},{"$f":"IF('5'!$D20>0,1,0)","v":1},{"$f":"IF('6'!$D20>0,1,0)","v":1},6,{"$f":"IF('7'!$D20>0,1,0)","v":1},{"$f":"IF('8'!$D20>0,1,0)","v":1},{"$f":"IF('9'!$D20>0,1,0)","v":1},{"$f":"IF('10'!$D20>0,1,0)","v":1},{"$f":"IF('11'!$D20>0,1,0)","v":1},{"$f":"IF('12'!$D20>0,1,0)","v":0},5,11]
["Simon Schukenbrock",{"$f":"IF('Wettkampf 1'!D21>0,1,0)","v":1},{"$f":"IF('2'!$D21>0,1,0)","v":1},{"$f":"IF('3'!$D21>0,1,0)","v":1},{"$f":"IF('4'!$D21>0,1,0)","v":1},{"$f":"IF('5'!$D21>0,1,0)","v":1},{"$f":"IF('6'!$D21>0,1,0)","v":1},6,{"$f":"IF('7'!$D21>0,1,0)","v":1},{"$f":"IF('8'!$D21>0,1,0)","v":1},{"$f":"IF('9'!$D21>0,1,0)","v":1},{"$f":"IF('10'!$D21>0,1,0)","v":1},{"$f":"IF('11'!$D21>0,1,0)","v":0},{"$f":"IF('12'!$D21>0,1,0)","v":0},4,10]
["Michael Boje",{"$f":"IF('Wettkampf 1'!D22>0,1,0)","v":0},{"$f":"IF('2'!$D22>0,1,0)","v":1},{"$f":"IF('3'!$D22>0,1,0)","v":0},{"$f":"IF('4'!$D22>0,1,0)","v":0},{"$f":"IF('5'!$D22>0,1,0)","v":0},{"$f":"IF('6'!$D22>0,1,0)","v":0},1,{"$f":"IF('7'!$D22>0,1,0)","v":0},{"$f":"IF('8'!$D22>0,1,0)","v":0},{"$f":"IF('9'!$D22>0,1,0)","v":0},{"$f":"IF('10'!$D22>0,1,0)","v":0},{"$f":"IF('11'!$D22>0,1,0)","v":0},{"$f":"IF('12'!$D22>0,1,0)","v":0},0,1]
["Ludger Hermes",{"$f":"IF('Wettkampf 1'!D23>0,1,0)","v":1},{"$f":"IF('2'!$D23>0,1,0)","v":1},{"$f":"IF('3'!$D23>0,1,0)","v":1},{"$f":"IF('4'!$D23>0,1,0)","v":1},{"$f":"IF('5'!$D23>0,1,0)","v":1},{"$f":"IF('6'!$D23>0,1,0)","v":1},6,{"$f":"IF('7'!$D23>0,1,0)","v":1},{"$f":"IF('8'!$D23>0,1,0)","v":1},{"$f":"IF('9'!$D23>0,1,0)","v":1},{"$f":"IF('10'!$D23>0,1,0)","v":1},{"$f":"IF('11'!$D23>0,1,0)","v":1},{"$f":"IF('12'!$D23>0,1,0)","v":0},5,11]
["Rudi Fromme",{"$f":"IF('Wettkampf 1'!D24>0,1,0)","v":1},{"$f":"IF('2'!$D24>0,1,0)","v":1},{"$f":"IF('3'!$D24>0,1,0)","v":1},{"$f":"IF('4'!$D24>0,1,0)","v":1},{"$f":"IF('5'!$D24>0,1,0)","v":1},{"$f":"IF('6'!$D24>0,1,0)","v":1},6,{"$f":"IF('7'!$D24>0,1,0)","v":1},{"$f":"IF('8'!$D24>0,1,0)","v":1},{"$f":"IF('9'!$D24>0,1,0)","v":1},{"$f":"IF('10'!$D24>0,1,0)","v":1},{"$f":"IF('11'!$D24>0,1,0)","v":1},{"$f":"IF('12'!$D24>0,1,0)","v":0},5,11]
["Alois Schmitz",{"$f":"IF('Wettkampf 1'!D25>0,1,0)","v":1},{"$f":"IF('2'!$D25>0,1,0)","v":1},{"$f":"IF('3'!$D25>0,1,0)","v":1},{"$f":"IF('4'!$D25>0,1,0)","v":1},{"$f":"IF('5'!$D25>0,1,0)","v":1},{"$f":"IF('6'!$D25>0,1,0)","v":1},6,{"$f":"IF('7'!$D25>0,1,0)","v":1},{"$f":"IF('8'!$D25>0,1,0)","v":1},{"$f":"IF('9'!$D25>0,1,0)","v":1},{"$f":"IF('10'!$D25>0,1,0)","v":1},{"$f":"IF('11'!$D25>0,1,0)","v":1},{"$f":"IF('12'!$D25>0,1,0)","v":0},5,11]
["Ludwig Langen",{"$f":"IF('Wettkampf 1'!D26>0,1,0)","v":1},{"$f":"IF('2'!$D26>0,1,0)","v":1},{"$f":"IF('3'!$D26>0,1,0)","v":1},{"$f":"IF('4'!$D26>0,1,0)","v":1},{"$f":"IF('5'!$D26>0,1,0)","v":1},{"$f":"IF('6'!$D26>0,1,0)","v":1},6,{"$f":"IF('7'!$D26>0,1,0)","v":1},{"$f":"IF('8'!$D26>0,1,0)","v":1},{"$f":"IF('9'!$D26>0,1,0)","v":1},{"$f":"IF('10'!$D26>0,1,0)","v":1},{"$f":"IF('11'!$D26>0,1,0)","v":1},{"$f":"IF('12'!$D26>0,1,0)","v":0},5,11]
["Rainer Wielenberg",{"$f":"IF('Wettkampf 1'!D27>0,1,0)","v":1},{"$f":"IF('2'!$D27>0,1,0)","v":1},{"$f":"IF('3'!$D27>0,1,0)","v":1},{"$f":"IF('4'!$D27>0,1,0)","v":1},{"$f":"IF('5'!$D27>0,1,0)","v":1},{"$f":"IF('6'!$D27>0,1,0)","v":1},6,{"$f":"IF('7'!$D27>0,1,0)","v":0},{"$f":"IF('8'!$D27>0,1,0)","v":1},{"$f":"IF('9'!$D27>0,1,0)","v":1},{"$f":"IF('10'!$D27>0,1,0)","v":1},{"$f":"IF('11'!$D27>0,1,0)","v":0},{"$f":"IF('12'!$D27>0,1,0)","v":0},3,9]
["Meik Sieger",{"$f":"IF('Wettkampf 1'!D28>0,1,0)","v":1},{"$f":"IF('2'!$D28>0,1,0)","v":1},{"$f":"IF('3'!$D28>0,1,0)","v":1},{"$f":"IF('4'!$D28>0,1,0)","v":1},{"$f":"IF('5'!$D28>0,1,0)","v":1},{"$f":"IF('6'!$D28>0,1,0)","v":1},6,{"$f":"IF('7'!$D28>0,1,0)","v":1},{"$f":"IF('8'!$D28>0,1,0)","v":1},{"$f":"IF('9'!$D28>0,1,0)","v":1},{"$f":"IF('10'!$D28>0,1,0)","v":1},{"$f":"IF('11'!$D28>0,1,0)","v":1},{"$f":"IF('12'!$D28>0,1,0)","v":0},5,11]
["Dennis Lindemann",{"$f":"IF('Wettkampf 1'!D29>0,1,0)","v":1},{"$f":"IF('2'!$D29>0,1,0)","v":1},{"$f":"IF('3'!$D29>0,1,0)","v":1},{"$f":"IF('4'!$D29>0,1,0)","v":1},{"$f":"IF('5'!$D29>0,1,0)","v":1},{"$f":"IF('6'!$D29>0,1,0)","v":1},6,{"$f":"IF('7'!$D29>0,1,0)","v":1},{"$f":"IF('8'!$D29>0,1,0)","v":1},{"$f":"IF('9'!$D29>0,1,0)","v":1},{"$f":"IF('10'!$D29>0,1,0)","v":1},{"$f":"IF('11'!$D29>0,1,0)","v":1},{"$f":"IF('12'!$D29>0,1,0)","v":0},5,11]
["Andreas Lindemann",{"$f":"IF('Wettkampf 1'!D30>0,1,0)","v":1},{"$f":"IF('2'!$D30>0,1,0)","v":1},{"$f":"IF('3'!$D30>0,1,0)","v":1},{"$f":"IF('4'!$D30>0,1,0)","v":1},{"$f":"IF('5'!$D30>0,1,0)","v":1},{"$f":"IF('6'!$D30>0,1,0)","v":1},6,{"$f":"IF('7'!$D30>0,1,0)","v":1},{"$f":"IF('8'!$D30>0,1,0)","v":1},{"$f":"IF('9'!$D30>0,1,0)","v":1},{"$f":"IF('10'!$D30>0,1,0)","v":1},{"$f":"IF('11'!$D30>0,1,0)","v":1},{"$f":"IF('12'!$D30>0,1,0)","v":0},5,11]
["Johannes Gebken",{"$f":"IF('Wettkampf 1'!D31>0,1,0)","v":1},{"$f":"IF('2'!$D31>0,1,0)","v":1},{"$f":"IF('3'!$D31>0,1,0)","v":1},{"$f":"IF('4'!$D31>0,1,0)","v":0},{"$f":"IF('5'!$D31>0,1,0)","v":0},{"$f":"IF('6'!$D31>0,1,0)","v":0},3,{"$f":"IF('7'!$D31>0,1,0)","v":0},{"$f":"IF('8'!$D31>0,1,0)","v":0},{"$f":"IF('9'!$D31>0,1,0)","v":0},{"$f":"IF('10'!$D31>0,1,0)","v":0},{"$f":"IF('11'!$D31>0,1,0)","v":0},{"$f":"IF('12'!$D31>0,1,0)","v":0},0,3]
["Jan-Niklas Lindemann",{"$f":"IF('Wettkampf 1'!D32>0,1,0)","v":0},{"$f":"IF('2'!$D32>0,1,0)","v":0},{"$f":"IF('3'!$D32>0,1,0)","v":0},{"$f":"IF('4'!$D32>0,1,0)","v":0},{"$f":"IF('5'!$D32>0,1,0)","v":0},{"$f":"IF('6'!$D32>0,1,0)","v":0},0,{"$f":"IF('7'!$D32>0,1,0)","v":0},{"$f":"IF('8'!$D32>0,1,0)","v":0},{"$f":"IF('9'!$D32>0,1,0)","v":0},{"$f":"IF('10'!$D32>0,1,0)","v":0},{"$f":"IF('11'!$D32>0,1,0)","v":0},{"$f":"IF('12'!$D32>0,1,0)","v":0},0,0]
["Stefan Burlager",{"$f":"IF('Wettkampf 1'!D33>0,1,0)","v":1},{"$f":"IF('2'!$D33>0,1,0)","v":1},{"$f":"IF('3'!$D33>0,1,0)","v":1},{"$f":"IF('4'!$D33>0,1,0)","v":0},{"$f":"IF('5'!$D33>0,1,0)","v":1},{"$f":"IF('6'!$D33>0,1,0)","v":1},5,{"$f":"IF('7'!$D33>0,1,0)","v":1},{"$f":"IF('8'!$D33>0,1,0)","v":1},{"$f":"IF('9'!$D33>0,1,0)","v":1},{"$f":"IF('10'!$D33>0,1,0)","v":1},{"$f":"IF('11'!$D33>0,1,0)","v":1},{"$f":"IF('12'!$D33>0,1,0)","v":0},5,10]
["Franz Ostermann",{"$f":"IF('Wettkampf 1'!D34>0,1,0)","v":1},{"$f":"IF('2'!$D34>0,1,0)","v":1},{"$f":"IF('3'!$D34>0,1,0)","v":1},{"$f":"IF('4'!$D34>0,1,0)","v":1},{"$f":"IF('5'!$D34>0,1,0)","v":1},{"$f":"IF('6'!$D34>0,1,0)","v":1},6,{"$f":"IF('7'!$D34>0,1,0)","v":1},{"$f":"IF('8'!$D34>0,1,0)","v":1},{"$f":"IF('9'!$D34>0,1,0)","v":1},{"$f":"IF('10'!$D34>0,1,0)","v":1},{"$f":"IF('11'!$D34>0,1,0)","v":1},{"$f":"IF('12'!$D34>0,1,0)","v":0},5,11]
["Martin Hackmann",{"$f":"IF('Wettkampf 1'!D35>0,1,0)","v":1},{"$f":"IF('2'!$D35>0,1,0)","v":1},{"$f":"IF('3'!$D35>0,1,0)","v":1},{"$f":"IF('4'!$D35>0,1,0)","v":1},{"$f":"IF('5'!$D35>0,1,0)","v":1},{"$f":"IF('6'!$D35>0,1,0)","v":1},6,{"$f":"IF('7'!$D35>0,1,0)","v":1},{"$f":"IF('8'!$D35>0,1,0)","v":1},{"$f":"IF('9'!$D35>0,1,0)","v":1},{"$f":"IF('10'!$D35>0,1,0)","v":1},{"$f":"IF('11'!$D35>0,1,0)","v":1},{"$f":"IF('12'!$D35>0,1,0)","v":0},5,11]
["Günther Baalmann",{"$f":"IF('Wettkampf 1'!D36>0,1,0)","v":1},{"$f":"IF('2'!$D36>0,1,0)","v":1},{"$f":"IF('3'!$D36>0,1,0)","v":1},{"$f":"IF('4'!$D36>0,1,0)","v":1},{"$f":"IF('5'!$D36>0,1,0)","v":1},{"$f":"IF('6'!$D36>0,1,0)","v":1},6,{"$f":"IF('7'!$D36>0,1,0)","v":1},{"$f":"IF('8'!$D36>0,1,0)","v":1},{"$f":"IF('9'!$D36>0,1,0)","v":1},{"$f":"IF('10'!$D36>0,1,0)","v":1},{"$f":"IF('11'!$D36>0,1,0)","v":1},{"$f":"IF('12'!$D36>0,1,0)","v":0},5,11]
["Martin Poker",{"$f":"IF('Wettkampf 1'!D37>0,1,0)","v":1},{"$f":"IF('2'!$D37>0,1,0)","v":1},{"$f":"IF('3'!$D37>0,1,0)","v":1},{"$f":"IF('4'!$D37>0,1,0)","v":1},{"$f":"IF('5'!$D37>0,1,0)","v":1},{"$f":"IF('6'!$D37>0,1,0)","v":1},6,{"$f":"IF('7'!$D37>0,1,0)","v":1},{"$f":"IF('8'!$D37>0,1,0)","v":1},{"$f":"IF('9'!$D37>0,1,0)","v":1},{"$f":"IF('10'!$D37>0,1,0)","v":1},{"$f":"IF('11'!$D37>0,1,0)","v":1},{"$f":"IF('12'!$D37>0,1,0)","v":0},5,11]
["Schütze 29",{"$f":"IF('Wettkampf 1'!D38>0,1,0)","v":0},{"$f":"IF('2'!$D38>0,1,0)","v":0},{"$f":"IF('3'!$D38>0,1,0)","v":0},{"$f":"IF('4'!$D38>0,1,0)","v":0},{"$f":"IF('5'!$D38>0,1,0)","v":0},{"$f":"IF('6'!$D38>0,1,0)","v":0},0,{"$f":"IF('7'!$D38>0,1,0)","v":0},{"$f":"IF('8'!$D38>0,1,0)","v":0},{"$f":"IF('9'!$D38>0,1,0)","v":0},{"$f":"IF('10'!$D38>0,1,0)","v":0},{"$f":"IF('11'!$D38>0,1,0)","v":0},{"$f":"IF('12'!$D38>0,1,0)","v":0},0,0]
["Schütze 30",{"$f":"IF('Wettkampf 1'!D39>0,1,0)","v":0},{"$f":"IF('2'!$D39>0,1,0)","v":0},{"$f":"IF('3'!$D39>0,1,0)","v":0},{"$f":"IF('4'!$D39>0,1,0)","v":0},{"$f":"IF('5'!$D39>0,1,0)","v":0},{"$f":"IF('6'!$D39>0,1,0)","v":0},0,{"$f":"IF('7'!$D39>0,1,0)","v":0},{"$f":"IF('8'!$D39>0,1,0)","v":0},{"$f":"IF('9'!$D39>0,1,0)","v":0},{"$f":"IF('10'!$D39>0,1,0)","v":0},{"$f":"IF('11'!$D39>0,1,0)","v":0},{"$f":"IF('12'!$D39>0,1,0)","v":0},0,0]
["Schütze 31",{"$f":"IF('Wettkampf 1'!D40>0,1,0)","v":0},{"$f":"IF('2'!$D40>0,1,0)","v":0},{"$f":"IF('3'!$D40>0,1,0)","v":0},{"$f":"IF('4'!$D40>0,1,0)","v":0},{"$f":"IF('5'!$D40>0,1,0)","v":0},{"$f":"IF('6'!$D40>0,1,0)","v":0},{"$f":"B39+C39+D39+E39+F39+G39","v":0},{"$f":"IF('7'!$D40>0,1,0)","v":0},{"$f":"IF('8'!$D40>0,1,0)","v":0},{"$f":"IF('9'!$D40>0,1,0)","v":0},{"$f":"IF('10'!$D40>0,1,0)","v":0},{"$f":"IF('11'!$D40>0,1,0)","v":0},{"$f":"IF('12'!$D40>0,1,0)","v":0},{"$f":"I39+J39+K39+L39+M39+N39","v":0},{"$f":"O39+H39","v":0}]
["Schütze 32",{"$f":"IF('Wettkampf 1'!D41>0,1,0)","v":0},{"$f":"IF('2'!$D41>0,1,0)","v":0},{"$f":"IF('3'!$D41>0,1,0)","v":0},{"$f":"IF('4'!$D41>0,1,0)","v":0},{"$f":"IF('5'!$D41>0,1,0)","v":0},{"$f":"IF('6'!$D41>0,1,0)","v":0},0,{"$f":"IF('7'!$D41>0,1,0)","v":0},{"$f":"IF('8'!$D41>0,1,0)","v":0},{"$f":"IF('9'!$D41>0,1,0)","v":0},{"$f":"IF('10'!$D41>0,1,0)","v":0},{"$f":"IF('11'!$D41>0,1,0)","v":0},{"$f":"IF('12'!$D41>0,1,0)","v":0},0,0]
["Schütze 33",{"$f":"IF('Wettkampf 1'!D42>0,1,0)","v":0},{"$f":"IF('2'!$D42>0,1,0)","v":0},{"$f":"IF('3'!$D42>0,1,0)","v":0},{"$f":"IF('4'!$D42>0,1,0)","v":0},{"$f":"IF('5'!$D42>0,1,0)","v":0},{"$f":"IF('6'!$D42>0,1,0)","v":0},0,{"$f":"IF('7'!$D42>0,1,0)","v":0},{"$f":"IF('8'!$D42>0,1,0)","v":0},{"$f":"IF('9'!$D42>0,1,0)","v":0},{"$f":"IF('10'!$D42>0,1,0)","v":0},{"$f":"IF('11'!$D42>0,1,0)","v":0},{"$f":"IF('12'!$D42>0,1,0)","v":0},0,0]
["Schütze 34",{"$f":"IF('Wettkampf 1'!D43>0,1,0)","v":0},{"$f":"IF('2'!$D43>0,1,0)","v":0},{"$f":"IF('3'!$D43>0,1,0)","v":0},{"$f":"IF('4'!$D43>0,1,0)","v":0},{"$f":"IF('5'!$D43>0,1,0)","v":0},{"$f":"IF('6'!$D43>0,1,0)","v":0},0,{"$f":"IF('7'!$D43>0,1,0)","v":0},{"$f":"IF('8'!$D43>0,1,0)","v":0},{"$f":"IF('9'!$D43>0,1,0)","v":0},{"$f":"IF('10'!$D43>0,1,0)","v":0},{"$f":"IF('11'!$D43>0,1,0)","v":0},{"$f":"IF('12'!$D43>0,1,0)","v":0},0,0]
["Schütze 35",{"$f":"IF('Wettkampf 1'!D44>0,1,0)","v":0},{"$f":"IF('2'!$D44>0,1,0)","v":0},{"$f":"IF('3'!$D44>0,1,0)","v":0},{"$f":"IF('4'!$D44>0,1,0)","v":0},{"$f":"IF('5'!$D44>0,1,0)","v":0},{"$f":"IF('6'!$D44>0,1,0)","v":0},0,{"$f":"IF('7'!$D44>0,1,0)","v":0},{"$f":"IF('8'!$D44>0,1,0)","v":0},{"$f":"IF('9'!$D44>0,1,0)","v":0},{"$f":"IF('10'!$D44>0,1,0)","v":0},{"$f":"IF('11'!$D44>0,1,0)","v":0},{"$f":"IF('12'!$D44>0,1,0)","v":0},0,0]
["Schütze 36",{"$f":"IF('Wettkampf 1'!D45>0,1,0)","v":0},{"$f":"IF('2'!$D45>0,1,0)","v":0},{"$f":"IF('3'!$D45>0,1,0)","v":0},{"$f":"IF('4'!$D45>0,1,0)","v":0},{"$f":"IF('5'!$D45>0,1,0)","v":0},{"$f":"IF('6'!$D45>0,1,0)","v":0},0,{"$f":"IF('7'!$D45>0,1,0)","v":0},{"$f":"IF('8'!$D45>0,1,0)","v":0},{"$f":"IF('9'!$D45>0,1,0)","v":0},{"$f":"IF('10'!$D45>0,1,0)","v":0},{"$f":"IF('11'!$D45>0,1,0)","v":0},{"$f":"IF('12'!$D45>0,1,0)","v":0},0,0]
[null,{"$f":"SUM(B9:B44)","v":{"v":26,"d":"26.00"}},{"$f":"SUM(C9:C44)","v":{"v":27,"d":"27.00"}},{"v":26,"d":"26.00"},{"v":24,"d":"24.00"},{"v":25,"d":"25.00"},{"v":25,"d":"25.00"},{"$f":"SUM(H9:H38)","v":{"v":153,"d":"153.00"}},{"$f":"SUM(I9:I44)","v":{"v":23,"d":"23.00"}},{"$f":"SUM(J9:J44)","v":{"v":25,"d":"25.00"}},{"v":25,"d":"25.00"},{"v":25,"d":"25.00"},{"v":23,"d":"23.00"},{"v":0,"d":"0.00"},{"$f":"SUM(O9:O44)","v":{"v":121,"d":"121.00"}},{"$f":"SUM(P9:P44)","v":{"v":274,"d":"274.00"}}]

{"sheet":"Übersicht Gruppen","index":17,"n_rows":7,"n_cols":20,"rows_kept":7,"hidden":true}
[]
[null,"Eisten II ",{"$f":"VLOOKUP($B$2:$B$7,'Wettkampf 1'!$B$2:$D$7,3,FALSE)","v":{"v":937.0999999999999,"d":"937.1"}},{"$f":"VLOOKUP($B$2:$B$7,'2'!$B$2:$D$7,3,FALSE)","v":935.1},{"$f":"VLOOKUP($B$2:$B$7,'3'!$B$2:$D$7,3,FALSE)","v":{"v":939.0999999999999,"d":"939.1"}},{"$f":"VLOOKUP($B$2:$B$7,'4'!$B$2:$D$7,3,FALSE)","v":937.5},{"$f":"VLOOKUP($B$2:$B$7,'5'!$B$2:$D$7,3,FALSE)","v":{"v":936.6999999999999,"d":"936.7"}},{"$f":"VLOOKUP($B$2:$B$7,'6'!$B$2:$D$7,3,FALSE)","v":935.4},{"$f":"J2/Formelhilfe!H5","v":{"v":936.8166666666666,"d":"936.8"}},{"$f":"SUM(C2:H2)","v":{"v":5620.9,"d":"5,620.9"}},{"$f":"VLOOKUP($B$2:$B$7,'7'!$B$2:$D$7,3,FALSE)","v":935.4},{"$f":"VLOOKUP($B$2:$B$7,'8'!$B$2:$D$7,3,FALSE)","v":932.4},{"$f":"VLOOKUP($B$2:$B$7,'9'!$B$2:$D$7,3,FALSE)","v":937.3},{"$f":"VLOOKUP($B$2:$B$7,'10'!$B$2:$D$7,3,FALSE)","v":936.1},{"$f":"VLOOKUP($B$2:$B$7,'11'!$B$2:$D$7,3,FALSE)","v":944.5},{"$f":"VLOOKUP($B$2:$B$7,'12'!$B$2:$D$7,3,FALSE)","v":{"v":0,"d":"0.0"}},{"$f":"R2/Formelhilfe!O5","v":{"v":937.14,"d":"937.1"}},{"$f":"SUM(K2:P2)","v":{"v":4685.7,"d":"4,685.7"}},{"$f":"T2/Formelhilfe!P5","v":{"v":936.9636363636363,"d":"937.0"}},{"$f":"SUM(C2:H2,K2:P2)","v":{"v":10306.599999999999,"d":"10,306.6"}}]
[null,"Spahnharrenstätte III",{"$f":"VLOOKUP($B$2:$B$7,'Wettkampf 1'!$B$2:$D$7,3,FALSE)","v":{"v":927.3000000000001,"d":"927.3"}},{"$f":"VLOOKUP($B$2:$B$7,'2'!$B$2:$D$7,3,FALSE)","v":934.8},{"$f":"VLOOKUP($B$2:$B$7,'3'!$B$2:$D$7,3,FALSE)","v":928.5},{"$f":"VLOOKUP($B$2:$B$7,'4'!$B$2:$D$7,3,FALSE)","v":{"v":935.5999999999999,"d":"935.6"}},{"$f":"VLOOKUP($B$2:$B$7,'5'!$B$2:$D$7,3,FALSE)","v":{"v":937.5000000000001,"d":"937.5"}},{"$f":"VLOOKUP($B$2:$B$7,'6'!$B$2:$D$7,3,FALSE)","v":927.2},{"$f":"J3/Formelhilfe!H3","v":{"v":931.8166666666666,"d":"931.8"}},{"$f":"SUM(C3:H3)","v":{"v":5590.9,"d":"5,590.9"}},{"$f":"VLOOKUP($B$2:$B$7,'7'!$B$2:$D$7,3,FALSE)","v":921.1},{"$f":"VLOOKUP($B$2:$B$7,'8'!$B$2:$D$7,3,FALSE)","v":{"v":928,"d":"928.0"}},{"$f":"VLOOKUP($B$2:$B$7,'9'!$B$2:$D$7,3,FALSE)","v":935.4},{"$f":"VLOOKUP($B$2:$B$7,'10'!$B$2:$D$7,3,FALSE)","v":934.9},{"$f":"VLOOKUP($B$2:$B$7,'11'!$B$2:$D$7,3,FALSE)","v":{"v":938.9000000000001,"d":"938.9"}},{"$f":"VLOOKUP($B$2:$B$7,'12'!$B$2:$D$7,3,FALSE)","v":{"v":0,"d":"0.0"}},{"$f":"R3/Formelhilfe!O3","v":{"v":931.6600000000001,"d":"931.7"}},{"$f":"SUM(K3:P3)","v":{"v":4658.3,"d":"4,658.3"}},{"$f":"T3/Formelhilfe!P3","v":{"v":931.7454545454544,"d":"931.7"}},{"$f":"SUM(C3:H3,K3:P3)","v":{"v":10249.199999999999,"d":"10,249.2"}}]
[null,"Spahnharrenstätte II",{"$f":"VLOOKUP($B$2:$B$7,'Wettkampf 1'!$B$2:$D$7,3,FALSE)","v":{"v":925.0999999999999,"d":"925.1"}},{"$f":"VLOOKUP($B$2:$B$7,'2'!$B$2:$D$7,3,FALSE)","v":{"v":929.1999999999999,"d":"929.2"}},{"$f":"VLOOKUP($B$2:$B$7,'3'!$B$2:$D$7,3,FALSE)","v":921.6},{"$f":"VLOOKUP($B$2:$B$7,'4'!$B$2:$D$7,3,FALSE)","v":929.7},{"$f":"VLOOKUP($B$2:$B$7,'5'!$B$2:$D$7,3,FALSE)","v":930.9},{"$f":"VLOOKUP($B$2:$B$7,'6'!$B$2:$D$7,3,FALSE)","v":934.5},{"$f":"J4/Formelhilfe!H7","v":{"v":928.4999999999999,"d":"928.5"}},{"$f":"SUM(C4:H4)","v":{"v":5570.999999999999,"d":"5,571.0"}},{"$f":"VLOOKUP($B$2:$B$7,'7'!$B$2:$D$7,3,FALSE)","v":{"v":931.9000000000001,"d":"931.9"}},{"$f":"VLOOKUP($B$2:$B$7,'8'!$B$2:$D$7,3,FALSE)","v":928.5},{"$f":"VLOOKUP($B$2:$B$7,'9'!$B$2:$D$7,3,FALSE)","v":{"v":929.6999999999999,"d":"929.7"}},{"$f":"VLOOKUP($B$2:$B$7,'10'!$B$2:$D$7,3,FALSE)","v":929.7},{"$f":"VLOOKUP($B$2:$B$7,'11'!$B$2:$D$7,3,FALSE)","v":{"v":928,"d":"928.0"}},{"$f":"VLOOKUP($B$2:$B$7,'12'!$B$2:$D$7,3,FALSE)","v":{"v":0,"d":"0.0"}},{"$f":"R4/Formelhilfe!O7","v":{"v":929.5600000000001,"d":"929.6"}},{"$f":"SUM(K4:P4)","v":{"v":4647.8,"d":"4,647.8"}},{"$f":"T4/Formelhilfe!P7","v":{"v":928.9818181818183,"d":"929.0"}},{"$f":"SUM(C4:H4,K4:P4)","v":{"v":10218.800000000001,"d":"10,218.8"}}]
[null,"Neubörger II",{"$f":"VLOOKUP($B$2:$B$7,'Wettkampf 1'!$B$2:$D$7,3,FALSE)","v":928.7},{"$f":"VLOOKUP($B$2:$B$7,'2'!$B$2:$D$7,3,FALSE)","v":918.8},{"$f":"VLOOKUP($B$2:$B$7,'3'!$B$2:$D$7,3,FALSE)","v":{"v":927.8999999999999,"d":"927.9"}},{"$f":"VLOOKUP($B$2:$B$7,'4'!$B$2:$D$7,3,FALSE)","v":{"v":928,"d":"928.0"}},{"$f":"VLOOKUP($B$2:$B$7,'5'!$B$2:$D$7,3,FALSE)","v":935.3},{"$f":"VLOOKUP($B$2:$B$7,'6'!$B$2:$D$7,3,FALSE)","v":918.9},{"$f":"J5/Formelhilfe!H6","v":{"v":926.2666666666665,"d":"926.3"}},{"$f":"SUM(C5:H5)","v":{"v":5557.599999999999,"d":"5,557.6"}},{"$f":"VLOOKUP($B$2:$B$7,'7'!$B$2:$D$7,3,FALSE)","v":921.3},{"$f":"VLOOKUP($B$2:$B$7,'8'!$B$2:$D$7,3,FALSE)","v":{"v":921.3000000000001,"d":"921.3"}},{"$f":"VLOOKUP($B$2:$B$7,'9'!$B$2:$D$7,3,FALSE)","v":924.4},{"$f":"VLOOKUP($B$2:$B$7,'10'!$B$2:$D$7,3,FALSE)","v":920.5},{"$f":"VLOOKUP($B$2:$B$7,'11'!$B$2:$D$7,3,FALSE)","v":927.6},{"$f":"VLOOKUP($B$2:$B$7,'12'!$B$2:$D$7,3,FALSE)","v":{"v":0,"d":"0.0"}},{"$f":"R5/Formelhilfe!O6","v":{"v":923.0200000000001,"d":"923.0"}},{"$f":"SUM(K5:P5)","v":{"v":4615.1,"d":"4,615.1"}},{"$f":"T5/Formelhilfe!P6","v":{"v":924.7909090909092,"d":"924.8"}},{"$f":"SUM(C5:H5,K5:P5)","v":{"v":10172.7,"d":"10,172.7"}}]
[null,"Esterwegen II",{"$f":"VLOOKUP($B$2:$B$7,'Wettkampf 1'!$B$2:$D$7,3,FALSE)","v":916.1},{"$f":"VLOOKUP($B$2:$B$7,'2'!$B$2:$D$7,3,FALSE)","v":{"v":919,"d":"919.0"}},{"$f":"VLOOKUP($B$2:$B$7,'3'!$B$2:$D$7,3,FALSE)","v":931.5},{"$f":"VLOOKUP($B$2:$B$7,'4'!$B$2:$D$7,3,FALSE)","v":{"v":921.6999999999999,"d":"921.7"}},{"$f":"VLOOKUP($B$2:$B$7,'5'!$B$2:$D$7,3,FALSE)","v":925.4},{"$f":"VLOOKUP($B$2:$B$7,'6'!$B$2:$D$7,3,FALSE)","v":925.8},{"$f":"J6/Formelhilfe!H2","v":{"v":923.25,"d":"923.3"}},{"$f":"SUM(C6:H6)","v":{"v":5539.5,"d":"5,539.5"}},{"$f":"VLOOKUP($B$2:$B$7,'7'!$B$2:$D$7,3,FALSE)","v":926.1},{"$f":"VLOOKUP($B$2:$B$7,'8'!$B$2:$D$7,3,FALSE)","v":926.9},{"$f":"VLOOKUP($B$2:$B$7,'9'!$B$2:$D$7,3,FALSE)","v":926.7},{"$f":"VLOOKUP($B$2:$B$7,'10'!$B$2:$D$7,3,FALSE)","v":920.3},{"$f":"VLOOKUP($B$2:$B$7,'11'!$B$2:$D$7,3,FALSE)","v":{"v":923.6000000000001,"d":"923.6"}},{"$f":"VLOOKUP($B$2:$B$7,'12'!$B$2:$D$7,3,FALSE)","v":{"v":0,"d":"0.0"}},{"$f":"R6/Formelhilfe!O2","v":{"v":924.72,"d":"924.7"}},{"$f":"SUM(K6:P6)","v":{"v":4623.6,"d":"4,623.6"}},{"$f":"T6/Formelhilfe!P2","v":{"v":923.9181818181819,"d":"923.9"}},{"$f":"SUM(C6:H6,K6:P6)","v":{"v":10163.1,"d":"10,163.1"}}]
[null,"Lahn V",{"$f":"VLOOKUP($B$2:$B$7,'Wettkampf 1'!$B$2:$D$7,3,FALSE)","v":{"v":911.3000000000001,"d":"911.3"}},{"$f":"VLOOKUP($B$2:$B$7,'2'!$B$2:$D$7,3,FALSE)","v":{"v":910.4000000000001,"d":"910.4"}},{"$f":"VLOOKUP($B$2:$B$7,'3'!$B$2:$D$7,3,FALSE)","v":903.7},{"$f":"VLOOKUP($B$2:$B$7,'4'!$B$2:$D$7,3,FALSE)","v":915.3},{"$f":"VLOOKUP($B$2:$B$7,'5'!$B$2:$D$7,3,FALSE)","v":925.3},{"$f":"VLOOKUP($B$2:$B$7,'6'!$B$2:$D$7,3,FALSE)","v":910.4},{"$f":"J7/Formelhilfe!H4","v":{"v":912.7333333333335,"d":"912.7"}},{"$f":"SUM(C7:H7)","v":{"v":5476.400000000001,"d":"5,476.4"}},{"$f":"VLOOKUP($B$2:$B$7,'7'!$B$2:$D$7,3,FALSE)","v":{"v":915.6999999999999,"d":"915.7"}},{"$f":"VLOOKUP($B$2:$B$7,'8'!$B$2:$D$7,3,FALSE)","v":{"v":915.1999999999999,"d":"915.2"}},{"$f":"VLOOKUP($B$2:$B$7,'9'!$B$2:$D$7,3,FALSE)","v":{"v":920.4000000000001,"d":"920.4"}},{"$f":"VLOOKUP($B$2:$B$7,'10'!$B$2:$D$7,3,FALSE)","v":911.9},{"$f":"VLOOKUP($B$2:$B$7,'11'!$B$2:$D$7,3,FALSE)","v":608.1},{"$f":"VLOOKUP($B$2:$B$7,'12'!$B$2:$D$7,3,FALSE)","v":{"v":0,"d":"0.0"}},{"$f":"R7/Formelhilfe!O4","v":{"v":854.26,"d":"854.3"}},{"$f":"SUM(K7:P7)","v":{"v":4271.3,"d":"4,271.3"}},{"$f":"T7/Formelhilfe!P4","v":{"v":886.1545454545455,"d":"886.2"}},{"$f":"SUM(C7:H7,K7:P7)","v":{"v":9747.7,"d":"9,747.7"}}]