{"text_format":"3","workbook":"xlsx","n_sheets":18,"sheets":["Übersicht","Wettkampf 1","2","3","4"," 5"," 6","7","8","9"," 10","11","12","Ausdruck","Ausdruck blank","Übersicht Schützen","Formelhilfe","Übersicht Gruppen"],"not_rendered":{"images":3,"macros":1,"defined_names":12,"comments":3},"read":"whole","date_system":"1900"}

{"sheet":"Übersicht","index":0,"n_rows":54,"n_cols":22,"rows_kept":54,"merged":[[0,10,0,11],[0,12,0,14],[0,15,0,16],[2,9,2,10],[2,17,2,18],[2,19,2,20],[3,1,3,2],[3,21,5,21],[5,1,5,2],[6,1,6,2],[7,1,7,2],[8,1,8,2],[9,1,9,2],[10,1,10,2],[14,9,14,10],[14,17,14,18],[14,19,14,20],[14,21,16,21]]}
[{"$nulls":3},"Kreisrundenwettkampf",{"$nulls":5},"Saison","2019/2020",null,"2. Kreisliga",null,null,"Schützen"]
[]
[null,null,"Wettkampftag:","15.09.","06.10.","20.10.","10.11.","24.11.","08.12.","Hinrunde",null,"19.01.","02.02.","16.02.","01.03.","15.03.","29.03.","Rückrunde",null,"Serie komplett"]
["Pos.","Verein / Gruppe",null,"Breddenb.-Heid.","Ostenwalde","Börgermoor","Lorup","Breddenberg","Werlte","Schnitt","Gesamt ",{"$f":"D4","v":"Breddenb.-Heid."},"Ostenwalde","Börgermoor","Lorup","Breddenberg","Werlte","Schnitt","Gesamt ","Schnitt","Gesamt","Differenz"]
[]
[1,{"$f":"'Übersicht Gruppen'!B2","v":"Ostenwalde II"},null,{"$f":"'Übersicht Gruppen'!C2","v":937.2},{"$f":"'Übersicht Gruppen'!D2","v":942.8},{"$f":"'Übersicht Gruppen'!E2","v":{"v":945.0999999999999,"d":"945.1"}},{"$f":"'Übersicht Gruppen'!F2","v":933.7},{"$f":"'Übersicht Gruppen'!G2","v":{"v":946.5000000000001,"d":"946.5"}},{"$f":"'Übersicht Gruppen'!H2","v":{"v":941,"d":"941.0"}},{"$f":"'Übersicht Gruppen'!I2","v":{"v":941.0500000000001,"d":"941.05"}},{"$f":"SUM(D6:I6)","v":{"v":5646.3,"d":"5,646.3"}},{"$f":"'Übersicht Gruppen'!K2","v":938.8},{"$f":"'Übersicht Gruppen'!L2","v":938.7},{"$f":"'Übersicht Gruppen'!M2","v":943.5},{"$f":"'Übersicht Gruppen'!N2","v":{"v":934.3000000000001,"d":"934.3"}},{"$f":"'Übersicht Gruppen'!O2","v":940.4},{"$f":"'Übersicht Gruppen'!P2","v":{"v":0,"d":"0.0"}},{"$f":"IF(Formelhilfe!O2=0,0,'Übersicht Gruppen'!Q2)","v":939.14},{"$f":"SUM(L6:Q6)","v":{"v":4695.7,"d":"4,695.7"}},{"$f":"'Übersicht Gruppen'!S2","v":{"v":940.181818181818,"d":"940.18"}},{"$f":"SUM(S6+K6)","v":{"v":10342,"d":"10,342.0"}}]
[2,{"$f":"'Übersicht Gruppen'!B3","v":"Werlte III"},null,{"$f":"'Übersicht Gruppen'!C3","v":{"v":938.3000000000001,"d":"938.3"}},{"$f":"'Übersicht Gruppen'!D3","v":{"v":938.0999999999999,"d":"938.1"}},{"$f":"'Übersicht Gruppen'!E3","v":943.1},{"$f":"'Übersicht Gruppen'!F3","v":938.8},{"$f":"'Übersicht Gruppen'!G3","v":{"v":938.9000000000001,"d":"938.9"}},{"$f":"'Übersicht Gruppen'!H3","v":935.6},{"$f":"'Übersicht Gruppen'!I3","v":{"v":938.8000000000002,"d":"938.80"}},{"v":5632.800000000001,"d":"5,632.8"},{"$f":"'Übersicht Gruppen'!K3","v":937.2},{"$f":"'Übersicht Gruppen'!L3","v":{"v":942.0999999999999,"d":"942.1"}},{"$f":"'Übersicht Gruppen'!M3","v":940.5},{"$f":"'Übersicht Gruppen'!N3","v":932.3},{"$f":"'Übersicht Gruppen'!O3","v":936.3},{"$f":"'Übersicht Gruppen'!P3","v":{"v":0,"d":"0.0"}},{"$f":"IF(Formelhilfe!O3=0,0,'Übersicht Gruppen'!Q3)","v":{"v":937.6800000000001,"d":"937.68"}},{"v":4688.400000000001,"d":"4,688.4"},{"$f":"'Übersicht Gruppen'!S3","v":{"v":938.2909090909089,"d":"938.29"}},{"$f":"SUM(S7+K7)","v":{"v":10321.2,"d":"10,321.2"}},{"$f":"(U6-U7)*-1","v":{"v":-20.799999999999272,"d":"-20.8"}}]
[3,{"$f":"'Übersicht Gruppen'!B4","v":"Lorup III"},null,{"$f":"'Übersicht Gruppen'!C4","v":{"v":936.0999999999999,"d":"936.1"}},{"$f":"'Übersicht Gruppen'!D4","v":933.3},{"$f":"'Übersicht Gruppen'!E4","v":938.5},{"$f":"'Übersicht Gruppen'!F4","v":937.2},{"$f":"'Übersicht Gruppen'!G4","v":931.3},{"$f":"'Übersicht Gruppen'!H4","v":932.1},{"$f":"'Übersicht Gruppen'!I4","v":934.75},{"v":5608.5,"d":"5,608.5"},{"$f":"'Übersicht Gruppen'!K4","v":{"v":937,"d":"937.0"}},{"$f":"'Übersicht Gruppen'!L4","v":932.8},{"$f":"'Übersicht Gruppen'!M4","v":{"v":933.8999999999999,"d":"933.9"}},{"$f":"'Übersicht Gruppen'!N4","v":936.7},{"$f":"'Übersicht Gruppen'!O4","v":{"v":936,"d":"936.0"}},{"$f":"'Übersicht Gruppen'!P4","v":{"v":0,"d":"0.0"}},{"$f":"IF(Formelhilfe!O4=0,0,'Übersicht Gruppen'!Q4)","v":935.28},{"v":4676.4,"d":"4,676.4"},{"$f":"'Übersicht Gruppen'!S4","v":{"v":934.9909090909092,"d":"934.99"}},{"v":10284.9,"d":"10,284.9"},{"$f":"(U7-U8)*-1","v":{"v":-36.30000000000109,"d":"-36.3"}}]
[4,{"$f":"'Übersicht Gruppen'!B5","v":"Breddenb.-Heid. III"},null,{"$f":"'Übersicht Gruppen'!C5","v":{"v":924.5999999999999,"d":"924.6"}},{"$f":"'Übersicht Gruppen'!D5","v":933.5},{"$f":"'Übersicht Gruppen'!E5","v":{"v":935.1999999999999,"d":"935.2"}},{"$f":"'Übersicht Gruppen'!F5","v":{"v":930,"d":"930.0"}},{"$f":"'Übersicht Gruppen'!G5","v":932.5},{"$f":"'Übersicht Gruppen'!H5","v":{"v":927.5999999999999,"d":"927.6"}},{"$f":"'Übersicht Gruppen'!I5","v":{"v":930.5666666666666,"d":"930.57"}},{"v":5583.4,"d":"5,583.4"},{"$f":"'Übersicht Gruppen'!K5","v":{"v":938.0000000000001,"d":"938.0"}},{"$f":"'Übersicht Gruppen'!L5","v":{"v":930,"d":"930.0"}},{"$f":"'Übersicht Gruppen'!M5","v":938.2},{"$f":"'Übersicht Gruppen'!N5","v":{"v":924.9000000000001,"d":"924.9"}},{"$f":"'Übersicht Gruppen'!O5","v":934.4},{"$f":"'Übersicht Gruppen'!P5","v":{"v":0,"d":"0.0"}},{"$f":"IF(Formelhilfe!O5=0,0,'Übersicht Gruppen'!Q5)","v":{"v":933.1,"d":"933.10"}},{"v":4665.5,"d":"4,665.5"},{"$f":"'Übersicht Gruppen'!S5","v":{"v":931.7181818181817,"d":"931.72"}},{"v":10248.9,"d":"10,248.9"},{"v":-36,"d":"-36.0"}]
[5,{"$f":"'Übersicht Gruppen'!B6","v":"Börgermoor II"},null,{"$f":"'Übersicht Gruppen'!C6","v":931.7},{"$f":"'Übersicht Gruppen'!D6","v":926.2},{"$f":"'Übersicht Gruppen'!E6","v":{"v":936,"d":"936.0"}},{"$f":"'Übersicht Gruppen'!F6","v":{"v":929.4000000000001,"d":"929.4"}},{"$f":"'Übersicht Gruppen'!G6","v":{"v":927.9000000000001,"d":"927.9"}},{"$f":"'Übersicht Gruppen'!H6","v":{"v":929,"d":"929.0"}},{"$f":"'Übersicht Gruppen'!I6","v":{"v":930.0333333333334,"d":"930.03"}},{"v":5580.200000000001,"d":"5,580.2"},{"$f":"'Übersicht Gruppen'!K6","v":933.2},{"$f":"'Übersicht Gruppen'!L6","v":{"v":927.3000000000001,"d":"927.3"}},{"$f":"'Übersicht Gruppen'!M6","v":934.4},{"$f":"'Übersicht Gruppen'!N6","v":{"v":932.1999999999999,"d":"932.2"}},{"$f":"'Übersicht Gruppen'!O6","v":932.3},{"$f":"'Übersicht Gruppen'!P6","v":{"v":0,"d":"0.0"}},{"$f":"IF(Formelhilfe!O6=0,0,'Übersicht Gruppen'!Q6)","v":{"v":931.8799999999999,"d":"931.88"}},{"v":4659.4,"d":"4,659.4"},{"$f":"'Übersicht Gruppen'!S6","v":{"v":930.8727272727273,"d":"930.87"}},{"v":10239.6,"d":"10,239.6"},{"v":-9.299999999999272,"d":"-9.3"}]
[6,{"$f":"'Übersicht Gruppen'!B7","v":"Breddenb.-Heid. I"},null,{"$f":"'Übersicht Gruppen'!C7","v":926.7},{"$f":"'Übersicht Gruppen'!D7","v":928.4},{"$f":"'Übersicht Gruppen'!E7","v":{"v":927.6999999999999,"d":"927.7"}},{"$f":"'Übersicht Gruppen'!F7","v":929.8},{"$f":"'Übersicht Gruppen'!G7","v":924.8},{"$f":"'Übersicht Gruppen'!H7","v":{"v":929.1999999999999,"d":"929.2"}},{"$f":"'Übersicht Gruppen'!I7","v":{"v":927.7666666666665,"d":"927.77"}},{"v":5566.599999999999,"d":"5,566.6"},{"$f":"'Übersicht Gruppen'!K7","v":931.1},{"$f":"'Übersicht Gruppen'!L7","v":{"v":927.6000000000001,"d":"927.6"}},{"$f":"'Übersicht Gruppen'!M7","v":934.3},{"$f":"'Übersicht Gruppen'!N7","v":{"v":930.6999999999999,"d":"930.7"}},{"$f":"'Übersicht Gruppen'!O7","v":930.9},{"$f":"'Übersicht Gruppen'!P7","v":{"v":0,"d":"0.0"}},{"$f":"IF(Formelhilfe!O7=0,0,'Übersicht Gruppen'!Q7)","v":{"v":930.9199999999998,"d":"930.92"}},{"v":4654.599999999999,"d":"4,654.6"},{"$f":"'Übersicht Gruppen'!S7","v":{"v":929.2,"d":"929.20"}},{"v":10221.199999999999,"d":"10,221.2"},{"v":-18.400000000001455,"d":"-18.4"}]
[]
[null,null,"Schnitt:",{"$f":"AVERAGE(D6:D11)","v":{"v":932.4333333333333,"d":"932.4"}},{"$f":"AVERAGE(E6:E11)","v":{"v":933.7166666666666,"d":"933.7"}},{"v":937.5999999999999,"d":"937.6"},{"v":933.1500000000001,"d":"933.2"},{"v":933.6500000000001,"d":"933.7"},{"v":932.4166666666665,"d":"932.4"},{"v":933.8277777777779,"d":"933.83"},{"$f":"SUM(K6:K11)/6","v":{"v":5602.966666666667,"d":"5,603.0"}},{"v":935.8833333333333,"d":"935.9"},{"v":933.0833333333334,"d":"933.1"},{"v":937.4666666666666,"d":"937.5"},{"v":931.85,"d":"931.9"},{"v":935.0499999999998,"d":"935.1"},{"v":0,"d":"0.0"},{"v":934.6666666666666,"d":"934.67"},{"v":4673.333333333333,"d":"4673.3"},{"v":934.2090909090907,"d":"934.21"},{"v":10276.3,"d":"10,276.3"}]
[]
[{"$nulls":9},"Hinrunde",{"$nulls":7},"Rückrunde",null,"Serie komplett",null,"Differenz"]
["Pos.","Vorname Name","Verein / Gruppe",{"$nulls":6},"Schnitt","Gesamt",{"$nulls":6},"Schnitt","Gesamt","Schnitt","Gesamt"]
[1,{"$f":"'Übersicht Schützen'!A2","v":"Philipp Schmidt"},{"$f":"'Übersicht Schützen'!B2","v":"Ostenwalde II"},{"$f":"'Übersicht Schützen'!C2","v":313.2},{"$f":"'Übersicht Schützen'!D2","v":315.9},{"$f":"'Übersicht Schützen'!E2","v":315.4},{"$f":"'Übersicht Schützen'!F2","v":310.2},{"$f":"'Übersicht Schützen'!G2","v":318.3},{"$f":"'Übersicht Schützen'!H2","v":316.5},{"$f":"'Übersicht Schützen'!I2","v":{"v":314.91666666666663,"d":"314.92"}},{"$f":"SUM(D17:I17)","v":{"v":1889.4999999999998,"d":"1,889.5"}},{"$f":"'Übersicht Schützen'!L2","v":315.8},{"$f":"'Übersicht Schützen'!M2","v":317.1},{"$f":"'Übersicht Schützen'!N2","v":316.9},{"$f":"'Übersicht Schützen'!O2","v":313.6},{"$f":"'Übersicht Schützen'!P2","v":314.1},{"$f":"'Übersicht Schützen'!Q2","v":{"v":0,"d":"0.0"}},{"$f":"IF(Formelhilfe!O9=0,0,'Übersicht Schützen'!R2)","v":{"v":315.5,"d":"315.50"}},{"$f":"SUM(L17:Q17)","v":{"v":1577.5,"d":"1,577.5"}},{"$f":"'Übersicht Schützen'!U2","v":{"v":315.18181818181813,"d":"315.18"}},{"$f":"SUM(K17+S17)","v":{"v":3467,"d":"3,467.0"}}]
[2,{"$f":"'Übersicht Schützen'!A3","v":"Frank Wotte"},{"$f":"'Übersicht Schützen'!B3","v":"Lorup III"},{"$f":"'Übersicht Schützen'!C3","v":{"v":312,"d":"312.0"}},{"$f":"'Übersicht Schützen'!D3","v":{"v":313,"d":"313.0"}},{"$f":"'Übersicht Schützen'!E3","v":314.5},{"$f":"'Übersicht Schützen'!F3","v":314.5},{"$f":"'Übersicht Schützen'!G3","v":314.6},{"$f":"'Übersicht Schützen'!H3","v":311.6},{"$f":"'Übersicht Schützen'!I3","v":{"v":313.3666666666666,"d":"313.37"}},{"$f":"SUM(D18:I18)","v":{"v":1880.1999999999998,"d":"1,880.2"}},{"$f":"'Übersicht Schützen'!L3","v":313.8},{"$f":"'Übersicht Schützen'!M3","v":313.6},{"$f":"'Übersicht Schützen'!N3","v":314.2},{"$f":"'Übersicht Schützen'!O3","v":314.2},{"$f":"'Übersicht Schützen'!P3","v":314.1},{"$f":"'Übersicht Schützen'!Q3","v":{"v":0,"d":"0.0"}},{"$f":"IF(Formelhilfe!O10=0,0,'Übersicht Schützen'!R3)","v":313.98},{"$f":"SUM(L18:Q18)","v":{"v":1569.9,"d":"1,569.9"}},{"$f":"'Übersicht Schützen'!U3","v":{"v":313.64545454545447,"d":"313.65"}},{"$f":"SUM(K18+S18)","v":{"v":3450.1,"d":"3,450.1"}},{"$f":"(U17-U18)*-1","v":{"v":-16.90000000000009,"d":"-16.9"}}]
[3,{"$f":"'Übersicht Schützen'!A4","v":"Bernd Thien"},{"$f":"'Übersicht Schützen'!B4","v":"Werlte III"},{"$f":"'Übersicht Schützen'!C4","v":311.9},{"$f":"'Übersicht Schützen'!D4","v":315.1},{"$f":"'Übersicht Schützen'!E4","v":314.4},{"$f":"'Übersicht Schützen'!F4","v":311.9},{"$f":"'Übersicht Schützen'!G4","v":314.3},{"$f":"'Übersicht Schützen'!H4","v":{"v":309,"d":"309.0"}},{"$f":"'Übersicht Schützen'!I4","v":{"v":312.76666666666665,"d":"312.77"}},{"$f":"SUM(D19:I19)","v":{"v":1876.6,"d":"1,876.6"}},{"$f":"'Übersicht Schützen'!L4","v":310.7},{"$f":"'Übersicht Schützen'!M4","v":313.7},{"$f":"'Übersicht Schützen'!N4","v":317.7},{"$f":"'Übersicht Schützen'!O4","v":313.2},{"$f":"'Übersicht Schützen'!P4","v":313.9},{"$f":"'Übersicht Schützen'!Q4","v":{"v":0,"d":"0.0"}},{"$f":"IF(Formelhilfe!O11=0,0,'Übersicht Schützen'!R4)","v":313.84},{"v":1569.1999999999998,"d":"1,569.2"},{"$f":"'Übersicht Schützen'!U4","v":{"v":313.2545454545454,"d":"313.25"}},{"v":3445.7999999999997,"d":"3,445.8"},{"$f":"(U18-U19)*-1","v":{"v":-4.300000000000182,"d":"-4.3"}}]
[4,{"$f":"'Übersicht Schützen'!A5","v":"Hans Plüster"},{"$f":"'Übersicht Schützen'!B5","v":"Breddenb.-Heid. III"},{"$f":"'Übersicht Schützen'!C5","v":310.9},{"$f":"'Übersicht Schützen'!D5","v":309.6},{"$f":"'Übersicht Schützen'!E5","v":314.8},{"$f":"'Übersicht Schützen'!F5","v":312.2},{"$f":"'Übersicht Schützen'!G5","v":312.8},{"$f":"'Übersicht Schützen'!H5","v":311.4},{"$f":"'Übersicht Schützen'!I5","v":311.95},{"v":1871.6999999999998,"d":"1,871.7"},{"$f":"'Übersicht Schützen'!L5","v":315.6},{"$f":"'Übersicht Schützen'!M5","v":313.4},{"$f":"'Übersicht Schützen'!N5","v":314.3},{"$f":"'Übersicht Schützen'!O5","v":311.4},{"$f":"'Übersicht Schützen'!P5","v":315.2},{"$f":"'Übersicht Schützen'!Q5","v":{"v":0,"d":"0.0"}},{"$f":"IF(Formelhilfe!O12=0,0,'Übersicht Schützen'!R5)","v":{"v":313.97999999999996,"d":"313.98"}},{"v":1569.8999999999999,"d":"1,569.9"},{"$f":"'Übersicht Schützen'!U5","v":{"v":312.8727272727273,"d":"312.87"}},{"v":3441.5999999999995,"d":"3,441.6"},{"v":-4.200000000000273,"d":"-4.2"}]
[5,{"$f":"'Übersicht Schützen'!A6","v":"Philipp Scholübbers "},{"$f":"'Übersicht Schützen'!B6","v":"Ostenwalde II"},{"$f":"'Übersicht Schützen'!C6","v":312.2},{"$f":"'Übersicht Schützen'!D6","v":314.1},{"$f":"'Übersicht Schützen'!E6","v":315.4},{"$f":"'Übersicht Schützen'!F6","v":312.4},{"$f":"'Übersicht Schützen'!G6","v":314.6},{"$f":"'Übersicht Schützen'!H6","v":312.7},{"$f":"'Übersicht Schützen'!I6","v":{"v":313.56666666666666,"d":"313.57"}},{"v":1881.3999999999999,"d":"1,881.4"},{"$f":"'Übersicht Schützen'!L6","v":{"v":314,"d":"314.0"}},{"$f":"'Übersicht Schützen'!M6","v":{"v":311.70000000000005,"d":"311.7"}},{"$f":"'Übersicht Schützen'!N6","v":{"v":316,"d":"316.0"}},{"$f":"'Übersicht Schützen'!O6","v":303.3},{"$f":"'Übersicht Schützen'!P6","v":313.7},{"$f":"'Übersicht Schützen'!Q6","v":{"v":0,"d":"0.0"}},{"$f":"IF(Formelhilfe!O13=0,0,'Übersicht Schützen'!R6)","v":311.74},{"v":1558.7,"d":"1,558.7"},{"$f":"'Übersicht Schützen'!U6","v":{"v":312.7363636363636,"d":"312.74"}},{"v":3440.1,"d":"3,440.1"},{"v":-1.4999999999995453,"d":"-1.5"}]
[6,{"$f":"'Übersicht Schützen'!A7","v":"Andreas Thoben "},{"$f":"'Übersicht Schützen'!B7","v":"Werlte III"},{"$f":"'Übersicht Schützen'!C7","v":314.8},{"$f":"'Übersicht Schützen'!D7","v":311.7},{"$f":"'Übersicht Schützen'!E7","v":313.4},{"$f":"'Übersicht Schützen'!F7","v":313.9},{"$f":"'Übersicht Schützen'!G7","v":314.4},{"$f":"'Übersicht Schützen'!H7","v":312.8},{"$f":"'Übersicht Schützen'!I7","v":{"v":313.49999999999994,"d":"313.50"}},{"v":1880.9999999999998,"d":"1,881.0"},{"$f":"'Übersicht Schützen'!L7","v":{"v":316,"d":"316.0"}},{"$f":"'Übersicht Schützen'!M7","v":312.7},{"$f":"'Übersicht Schützen'!N7","v":307.2},{"$f":"'Übersicht Schützen'!O7","v":309.8},{"$f":"'Übersicht Schützen'!P7","v":310.3},{"$f":"'Übersicht Schützen'!Q7","v":{"v":0,"d":"0.0"}},{"$f":"IF(Formelhilfe!O14=0,0,'Übersicht Schützen'!R7)","v":{"v":311.2,"d":"311.20"}},{"v":1556,"d":"1,556.0"},{"$f":"'Übersicht Schützen'!U7","v":{"v":312.45454545454544,"d":"312.45"}},{"v":3437,"d":"3,437.0"},{"v":-3.099999999999909,"d":"-3.1"}]
[7,{"$f":"'Übersicht Schützen'!A8","v":"Johannes Jansen"},{"$f":"'Übersicht Schützen'!B8","v":"Börgermoor II"},{"$f":"'Übersicht Schützen'!C8","v":312.1},{"$f":"'Übersicht Schützen'!D8","v":308.3},{"$f":"'Übersicht Schützen'!E8","v":313.6},{"$f":"'Übersicht Schützen'!F8","v":{"v":309,"d":"309.0"}},{"$f":"'Übersicht Schützen'!G8","v":310.1},{"$f":"'Übersicht Schützen'!H8","v":311.5},{"$f":"'Übersicht Schützen'!I8","v":{"v":310.76666666666665,"d":"310.77"}},{"v":1864.6,"d":"1,864.6"},{"$f":"'Übersicht Schützen'!L8","v":{"v":313,"d":"313.0"}},{"$f":"'Übersicht Schützen'!M8","v":{"v":314.20000000000005,"d":"314.2"}},{"$f":"'Übersicht Schützen'!N8","v":310.5},{"$f":"'Übersicht Schützen'!O8","v":311.9},{"$f":"'Übersicht Schützen'!P8","v":311.9},{"$f":"'Übersicht Schützen'!Q8","v":{"v":0,"d":"0.0"}},{"$f":"IF(Formelhilfe!O15=0,0,'Übersicht Schützen'!R8)","v":{"v":312.3,"d":"312.30"}},{"v":1561.5,"d":"1,561.5"},{"$f":"'Übersicht Schützen'!U8","v":{"v":311.4636363636364,"d":"311.46"}},{"v":3426.1,"d":"3,426.1"},{"v":-10.900000000000091,"d":"-10.9"}]
[8,{"$f":"'Übersicht Schützen'!A9","v":"Thomas Niermann"},{"$f":"'Übersicht Schützen'!B9","v":"Werlte III"},{"$f":"'Übersicht Schützen'!C9","v":313.1},{"$f":"'Übersicht Schützen'!D9","v":311.2},{"$f":"'Übersicht Schützen'!E9","v":313.6},{"$f":"'Übersicht Schützen'!F9","v":310.1},{"$f":"'Übersicht Schützen'!G9","v":{"v":308,"d":"308.0"}},{"$f":"'Übersicht Schützen'!H9","v":310.5},{"$f":"'Übersicht Schützen'!I9","v":{"v":311.0833333333333,"d":"311.08"}},{"v":1866.5,"d":"1,866.5"},{"$f":"'Übersicht Schützen'!L9","v":312.3},{"$f":"'Übersicht Schützen'!M9","v":315.3},{"$f":"'Übersicht Schützen'!N9","v":{"v":310,"d":"310.0"}},{"$f":"'Übersicht Schützen'!O9","v":307.8},{"$f":"'Übersicht Schützen'!P9","v":312.1},{"$f":"'Übersicht Schützen'!Q9","v":{"v":0,"d":"0.0"}},{"$f":"IF(Formelhilfe!O16=0,0,'Übersicht Schützen'!R9)","v":{"v":311.5,"d":"311.50"}},{"v":1557.5,"d":"1,557.5"},{"$f":"'Übersicht Schützen'!U9","v":{"v":311.2727272727273,"d":"311.27"}},{"v":3424,"d":"3,424.0"},{"v":-2.099999999999909,"d":"-2.1"}]
[9,{"$f":"'Übersicht Schützen'!A10","v":"Norbert Grünloh "},{"$f":"'Übersicht Schützen'!B10","v":"Werlte III"},{"$f":"'Übersicht Schützen'!C10","v":311.6},{"$f":"'Übersicht Schützen'!D10","v":311.3},{"$f":"'Übersicht Schützen'!E10","v":315.1},{"$f":"'Übersicht Schützen'!F10","v":{"v":313,"d":"313.0"}},{"$f":"'Übersicht Schützen'!G10","v":310.2},{"$f":"'Übersicht Schützen'!H10","v":313.8},{"$f":"'Übersicht Schützen'!I10","v":{"v":312.5,"d":"312.50"}},{"v":1875,"d":"1,875.0"},{"$f":"'Übersicht Schützen'!L10","v":307.8},{"$f":"'Übersicht Schützen'!M10","v":309.5},{"$f":"'Übersicht Schützen'!N10","v":311.6},{"$f":"'Übersicht Schützen'!O10","v":309.3},{"$f":"'Übersicht Schützen'!P10","v":309.7},{"$f":"'Übersicht Schützen'!Q10","v":{"v":0,"d":"0.0"}},{"$f":"IF(Formelhilfe!O17=0,0,'Übersicht Schützen'!R10)","v":{"v":309.58000000000004,"d":"309.58"}},{"v":1547.9,"d":"1,547.9"},{"$f":"'Übersicht Schützen'!U10","v":{"v":311.1727272727273,"d":"311.17"}},{"v":3422.9,"d":"3,422.9"},{"v":-1.099999999999909,"d":"-1.1"}]
[10,{"$f":"'Übersicht Schützen'!A11","v":"Patrik Krüßel"},{"$f":"'Übersicht Schützen'!B11","v":"Ostenwalde II"},{"$f":"'Übersicht Schützen'!C11","v":311.8},{"$f":"'Übersicht Schützen'!D11","v":312.8},{"$f":"'Übersicht Schützen'!E11","v":314.3},{"$f":"'Übersicht Schützen'!F11","v":311.1},{"$f":"'Übersicht Schützen'!G11","v":313.6},{"$f":"'Übersicht Schützen'!H11","v":311.8},{"$f":"'Übersicht Schützen'!I11","v":{"v":312.56666666666666,"d":"312.57"}},{"v":1875.3999999999999,"d":"1,875.4"},{"$f":"'Übersicht Schützen'!L11","v":308.8},{"$f":"'Übersicht Schützen'!M11","v":305.4},{"$f":"'Übersicht Schützen'!N11","v":310.6},{"$f":"'Übersicht Schützen'!O11","v":309.9},{"$f":"'Übersicht Schützen'!P11","v":312.6},{"$f":"'Übersicht Schützen'!Q11","v":{"v":0,"d":"0.0"}},{"$f":"IF(Formelhilfe!O18=0,0,'Übersicht Schützen'!R11)","v":{"v":309.46000000000004,"d":"309.46"}},{"v":1547.3000000000002,"d":"1,547.3"},{"$f":"'Übersicht Schützen'!U11","v":{"v":311.1545454545454,"d":"311.15"}},{"v":3422.7,"d":"3,422.7"},{"v":-0.20000000000027285,"d":"-0.2"}]
[11,{"$f":"'Übersicht Schützen'!A12","v":"Johannes Wesseln"},{"$f":"'Übersicht Schützen'!B12","v":"Lorup III"},{"$f":"'Übersicht Schützen'!C12","v":310.2},{"$f":"'Übersicht Schützen'!D12","v":308.8},{"$f":"'Übersicht Schützen'!E12","v":311.5},{"$f":"'Übersicht Schützen'!F12","v":310.2},{"$f":"'Übersicht Schützen'!G12","v":311.5},{"$f":"'Übersicht Schützen'!H12","v":312.1},{"$f":"'Übersicht Schützen'!I12","v":{"v":310.7166666666667,"d":"310.72"}},{"v":1864.3000000000002,"d":"1,864.3"},{"$f":"'Übersicht Schützen'!L12","v":312.9},{"$f":"'Übersicht Schützen'!M12","v":{"v":308.70000000000005,"d":"308.7"}},{"$f":"'Übersicht Schützen'!N12","v":307.9},{"$f":"'Übersicht Schützen'!O12","v":311.5},{"$f":"'Übersicht Schützen'!P12","v":312.4},{"$f":"'Übersicht Schützen'!Q12","v":{"v":0,"d":"0.0"}},{"$f":"IF(Formelhilfe!O19=0,0,'Übersicht Schützen'!R12)","v":310.68},{"v":1553.4,"d":"1,553.4"},{"$f":"'Übersicht Schützen'!U12","v":{"v":310.70000000000005,"d":"310.70"}},{"v":3417.7000000000003,"d":"3,417.7"},{"v":-4.999999999999545,"d":"-5.0"}]
[12,{"$f":"'Übersicht Schützen'!A13","v":"Jürgen Will"},{"$f":"'Übersicht Schützen'!B13","v":"Lorup III"},{"$f":"'Übersicht Schützen'!C13","v":313.9},{"$f":"'Übersicht Schützen'!D13","v":311.5},{"$f":"'Übersicht Schützen'!E13","v":312.5},{"$f":"'Übersicht Schützen'!F13","v":312.5},{"$f":"'Übersicht Schützen'!G13","v":305.2},{"$f":"'Übersicht Schützen'!H13","v":308.4},{"$f":"'Übersicht Schützen'!I13","v":{"v":310.6666666666667,"d":"310.67"}},{"v":1864,"d":"1,864.0"},{"$f":"'Übersicht Schützen'!L13","v":310.3},{"$f":"'Übersicht Schützen'!M13","v":{"v":310,"d":"310.0"}},{"$f":"'Übersicht Schützen'!N13","v":310.9},{"$f":"'Übersicht Schützen'!O13","v":{"v":311,"d":"311.0"}},{"$f":"'Übersicht Schützen'!P13","v":308.9},{"$f":"'Übersicht Schützen'!Q13","v":{"v":0,"d":"0.0"}},{"$f":"IF(Formelhilfe!O20=0,0,'Übersicht Schützen'!R13)","v":{"v":310.21999999999997,"d":"310.22"}},{"v":1551.1,"d":"1,551.1"},{"$f":"'Übersicht Schützen'!U13","v":{"v":310.4636363636364,"d":"310.46"}},{"v":3415.1,"d":"3,415.1"},{"v":-2.600000000000364,"d":"-2.6"}]
[13,{"$f":"'Übersicht Schützen'!A14","v":"Hans Ortmann "},{"$f":"'Übersicht Schützen'!B14","v":"Börgermoor II"},{"$f":"'Übersicht Schützen'!C14","v":{"v":310,"d":"310.0"}},{"$f":"'Übersicht Schützen'!D14","v":311.1},{"$f":"'Übersicht Schützen'!E14","v":310.2},{"$f":"'Übersicht Schützen'!F14","v":311.1},{"$f":"'Übersicht Schützen'!G14","v":310.1},{"$f":"'Übersicht Schützen'!H14","v":309.7},{"$f":"'Übersicht Schützen'!I14","v":{"v":310.3666666666667,"d":"310.37"}},{"v":1862.2,"d":"1,862.2"},{"$f":"'Übersicht Schützen'!L14","v":309.6},{"$f":"'Übersicht Schützen'!M14","v":306.7},{"$f":"'Übersicht Schützen'!N14","v":308.8},{"$f":"'Übersicht Schützen'!O14","v":310.1},{"$f":"'Übersicht Schützen'!P14","v":310.4},{"$f":"'Übersicht Schützen'!Q14","v":{"v":0,"d":"0.0"}},{"$f":"IF(Formelhilfe!O21=0,0,'Übersicht Schützen'!R14)","v":309.12},{"v":1545.6,"d":"1,545.6"},{"$f":"'Übersicht Schützen'!U14","v":{"v":309.8,"d":"309.80"}},{"v":3407.8,"d":"3,407.8"},{"v":-7.299999999999727,"d":"-7.3"}]
[14,{"$f":"'Übersicht Schützen'!A15","v":"Markus Jansen"},{"$f":"'Übersicht Schützen'!B15","v":"Ostenwalde II"},{"$f":"'Übersicht Schützen'!C15","v":{"v":309,"d":"309.0"}},{"$f":"'Übersicht Schützen'!D15","v":311.1},{"$f":"'Übersicht Schützen'!E15","v":310.7},{"$f":"'Übersicht Schützen'!F15","v":308.3},{"$f":"'Übersicht Schützen'!G15","v":311.7},{"$f":"'Übersicht Schützen'!H15","v":308.6},{"$f":"'Übersicht Schützen'!I15","v":{"v":309.90000000000003,"d":"309.90"}},{"v":1859.4,"d":"1,859.4"},{"$f":"'Übersicht Schützen'!L15","v":{"v":309,"d":"309.0"}},{"$f":"'Übersicht Schützen'!M15","v":{"v":308,"d":"308.0"}},{"$f":"'Übersicht Schützen'!N15","v":311.3},{"$f":"'Übersicht Schützen'!O15","v":310.8},{"$f":"'Übersicht Schützen'!P15","v":306.9},{"$f":"'Übersicht Schützen'!Q15","v":{"v":0,"d":"0.0"}},{"$f":"IF(Formelhilfe!O22=0,0,'Übersicht Schützen'!R15)","v":{"v":309.2,"d":"309.20"}},{"v":1546,"d":"1,546.0"},{"$f":"'Übersicht Schützen'!U15","v":{"v":309.5818181818182,"d":"309.58"}},{"v":3405.4,"d":"3,405.4"},{"v":-2.400000000000091,"d":"-2.4"}]
[15,{"$f":"'Übersicht Schützen'!A16","v":"Willi Engbers"},{"$f":"'Übersicht Schützen'!B16","v":"Breddenb.-Heid. I"},{"$f":"'Übersicht Schützen'!C16","v":312.3},{"$f":"'Übersicht Schützen'!D16","v":{"v":308,"d":"308.0"}},{"$f":"'Übersicht Schützen'!E16","v":309.2},{"$f":"'Übersicht Schützen'!F16","v":309.4},{"$f":"'Übersicht Schützen'!G16","v":{"v":309,"d":"309.0"}},{"$f":"'Übersicht Schützen'!H16","v":307.9},{"$f":"'Übersicht Schützen'!I16","v":{"v":309.3,"d":"309.30"}},{"v":1855.8000000000002,"d":"1,855.8"},{"$f":"'Übersicht Schützen'!L16","v":311.1},{"$f":"'Übersicht Schützen'!M16","v":{"v":307.20000000000005,"d":"307.2"}},{"$f":"'Übersicht Schützen'!N16","v":310.6},{"$f":"'Übersicht Schützen'!O16","v":309.7},{"$f":"'Übersicht Schützen'!P16","v":310.1},{"$f":"'Übersicht Schützen'!Q16","v":{"v":0,"d":"0.0"}},{"$f":"IF(Formelhilfe!O23=0,0,'Übersicht Schützen'!R16)","v":{"v":309.74000000000007,"d":"309.74"}},{"v":1548.7000000000003,"d":"1,548.7"},{"$f":"'Übersicht Schützen'!U16","v":{"v":309.5,"d":"309.50"}},{"v":3404.5000000000005,"d":"3,404.5"},{"v":-0.8999999999996362,"d":"-0.9"}]
[16,{"$f":"'Übersicht Schützen'!A17","v":"Karl-Heinz Ortmann"},{"$f":"'Übersicht Schützen'!B17","v":"Börgermoor II"},{"$f":"'Übersicht Schützen'!C17","v":305.9},{"$f":"'Übersicht Schützen'!D17","v":306.9},{"$f":"'Übersicht Schützen'!E17","v":312.2},{"$f":"'Übersicht Schützen'!F17","v":309.3},{"$f":"'Übersicht Schützen'!G17","v":307.7},{"$f":"'Übersicht Schützen'!H17","v":307.7},{"$f":"'Übersicht Schützen'!I17","v":{"v":308.28333333333336,"d":"308.28"}},{"v":1849.7,"d":"1,849.7"},{"$f":"'Übersicht Schützen'!L17","v":310.6},{"$f":"'Übersicht Schützen'!M17","v":306.4},{"$f":"'Übersicht Schützen'!N17","v":{"v":313,"d":"313.0"}},{"$f":"'Übersicht Schützen'!O17","v":310.2},{"$f":"'Übersicht Schützen'!P17","v":{"v":310,"d":"310.0"}},{"$f":"'Übersicht Schützen'!Q17","v":{"v":0,"d":"0.0"}},{"$f":"IF(Formelhilfe!O24=0,0,'Übersicht Schützen'!R17)","v":310.04},{"v":1550.2,"d":"1,550.2"},{"$f":"'Übersicht Schützen'!U17","v":{"v":309.08181818181816,"d":"309.08"}},{"v":3399.9,"d":"3,399.9"},{"v":-4.600000000000364,"d":"-4.6"}]
[17,{"$f":"'Übersicht Schützen'!A18","v":"Norbert Jansen"},{"$f":"'Übersicht Schützen'!B18","v":"Breddenb.-Heid. III"},{"$f":"'Übersicht Schützen'!C18","v":300.5},{"$f":"'Übersicht Schützen'!D18","v":308.3},{"$f":"'Übersicht Schützen'!E18","v":{"v":311,"d":"311.0"}},{"$f":"'Übersicht Schützen'!F18","v":{"v":308,"d":"308.0"}},{"$f":"'Übersicht Schützen'!G18","v":310.3},{"$f":"'Übersicht Schützen'!H18","v":309.5},{"$f":"'Übersicht Schützen'!I18","v":{"v":307.93333333333334,"d":"307.93"}},{"v":1847.6,"d":"1,847.6"},{"$f":"'Übersicht Schützen'!L18","v":312.3},{"$f":"'Übersicht Schützen'!M18","v":310.3},{"$f":"'Übersicht Schützen'!N18","v":311.3},{"$f":"'Übersicht Schützen'!O18","v":303.6},{"$f":"'Übersicht Schützen'!P18","v":309.7},{"$f":"'Übersicht Schützen'!Q18","v":{"v":0,"d":"0.0"}},{"$f":"IF(Formelhilfe!O25=0,0,'Übersicht Schützen'!R18)","v":309.44},{"v":1547.2,"d":"1,547.2"},{"$f":"'Übersicht Schützen'!U18","v":{"v":308.6181818181818,"d":"308.62"}},{"v":3394.8,"d":"3,394.8"},{"v":-5.099999999999909,"d":"-5.1"}]
[18,{"$f":"'Übersicht Schützen'!A19","v":"Joachim Niermann"},{"$f":"'Übersicht Schützen'!B19","v":"Werlte III"},{"$f":"'Übersicht Schützen'!C19","v":{"v":305,"d":"305.0"}},{"$f":"'Übersicht Schützen'!D19","v":307.9},{"$f":"'Übersicht Schützen'!E19","v":305.3},{"$f":"'Übersicht Schützen'!F19","v":313.4},{"$f":"'Übersicht Schützen'!G19","v":312.3},{"$f":"'Übersicht Schützen'!H19","v":307.9},{"$f":"'Übersicht Schützen'!I19","v":{"v":308.63333333333327,"d":"308.63"}},{"v":1851.7999999999997,"d":"1,851.8"},{"$f":"'Übersicht Schützen'!L19","v":310.5},{"$f":"'Übersicht Schützen'!M19","v":306.6},{"$f":"'Übersicht Schützen'!N19","v":306.2},{"$f":"'Übersicht Schützen'!O19","v":308.7},{"$f":"'Übersicht Schützen'!P19","v":309.2},{"$f":"'Übersicht Schützen'!Q19","v":{"v":0,"d":"0.0"}},{"$f":"IF(Formelhilfe!O26=0,0,'Übersicht Schützen'!R19)","v":308.24},{"v":1541.2,"d":"1,541.2"},{"$f":"'Übersicht Schützen'!U19","v":{"v":308.4545454545454,"d":"308.45"}},{"v":3393,"d":"3,393.0"},{"v":-1.800000000000182,"d":"-1.8"}]
[19,{"$f":"'Übersicht Schützen'!A20","v":"Heinz Engbers"},{"$f":"'Übersicht Schützen'!B20","v":"Breddenb.-Heid. I"},{"$f":"'Übersicht Schützen'!C20","v":308.1},{"$f":"'Übersicht Schützen'!D20","v":309.5},{"$f":"'Übersicht Schützen'!E20","v":305.4},{"$f":"'Übersicht Schützen'!F20","v":307.8},{"$f":"'Übersicht Schützen'!G20","v":304.5},{"$f":"'Übersicht Schützen'!H20","v":308.3},{"$f":"'Übersicht Schützen'!I20","v":{"v":307.26666666666665,"d":"307.27"}},{"v":1843.6,"d":"1,843.6"},{"$f":"'Übersicht Schützen'!L20","v":307.9},{"$f":"'Übersicht Schützen'!M20","v":311.8},{"$f":"'Übersicht Schützen'!N20","v":308.8},{"$f":"'Übersicht Schützen'!O20","v":310.4},{"$f":"'Übersicht Schützen'!P20","v":310.1},{"$f":"'Übersicht Schützen'!Q20","v":{"v":0,"d":"0.0"}},{"$f":"IF(Formelhilfe!O27=0,0,'Übersicht Schützen'!R20)","v":{"v":309.8,"d":"309.80"}},{"v":1549,"d":"1,549.0"},{"$f":"'Übersicht Schützen'!U20","v":{"v":308.41818181818184,"d":"308.42"}},{"v":3392.6,"d":"3,392.6"},{"v":-0.40000000000009095,"d":"-0.4"}]
[20,{"$f":"'Übersicht Schützen'!A21","v":"Josef Wübben "},{"$f":"'Übersicht Schützen'!B21","v":"Breddenb.-Heid. III"},{"$f":"'Übersicht Schützen'!C21","v":309.4},{"$f":"'Übersicht Schützen'!D21","v":314.2},{"$f":"'Übersicht Schützen'!E21","v":306.2},{"$f":"'Übersicht Schützen'!F21","v":309.8},{"$f":"'Übersicht Schützen'!G21","v":309.4},{"$f":"'Übersicht Schützen'!H21","v":303.9},{"$f":"'Übersicht Schützen'!I21","v":{"v":308.81666666666666,"d":"308.82"}},{"v":1852.9,"d":"1,852.9"},{"$f":"'Übersicht Schützen'!L21","v":310.1},{"$f":"'Übersicht Schützen'!M21","v":301.5},{"$f":"'Übersicht Schützen'!N21","v":310.6},{"$f":"'Übersicht Schützen'!O21","v":308.8},{"$f":"'Übersicht Schützen'!P21","v":305.8},{"$f":"'Übersicht Schützen'!Q21","v":{"v":0,"d":"0.0"}},{"$f":"IF(Formelhilfe!O28=0,0,'Übersicht Schützen'!R21)","v":307.36},{"v":1536.8,"d":"1,536.8"},{"$f":"'Übersicht Schützen'!U21","v":{"v":308.1545454545455,"d":"308.15"}},{"v":3389.7,"d":"3,389.7"},{"v":-2.900000000000091,"d":"-2.9"}]
[21,{"$f":"'Übersicht Schützen'!A22","v":"Hermann Krone "},{"$f":"'Übersicht Schützen'!B22","v":"Werlte III"},{"$f":"'Übersicht Schützen'!C22","v":306.8},{"$f":"'Übersicht Schützen'!D22","v":307.4},{"$f":"'Übersicht Schützen'!E22","v":311.6},{"$f":"'Übersicht Schützen'!F22","v":304.3},{"$f":"'Übersicht Schützen'!G22","v":312.2},{"$f":"'Übersicht Schützen'!H22","v":310.3},{"$f":"'Übersicht Schützen'!I22","v":{"v":308.7666666666667,"d":"308.77"}},{"v":1852.6000000000001,"d":"1,852.6"},{"$f":"'Übersicht Schützen'!L22","v":307.3},{"$f":"'Übersicht Schützen'!M22","v":306.8},{"$f":"'Übersicht Schützen'!N22","v":{"v":311,"d":"311.0"}},{"$f":"'Übersicht Schützen'!O22","v":307.9},{"$f":"'Übersicht Schützen'!P22","v":303.8},{"$f":"'Übersicht Schützen'!Q22","v":{"v":0,"d":"0.0"}},{"$f":"IF(Formelhilfe!O29=0,0,'Übersicht Schützen'!R22)","v":307.36},{"v":1536.8,"d":"1,536.8"},{"$f":"'Übersicht Schützen'!U22","v":{"v":308.1272727272728,"d":"308.13"}},{"v":3389.4,"d":"3,389.4"},{"v":-0.29999999999972715,"d":"-0.3"}]
[22,{"$f":"'Übersicht Schützen'!A23","v":"Heinz Dirksen"},{"$f":"'Übersicht Schützen'!B23","v":"Börgermoor II"},{"$f":"'Übersicht Schützen'!C23","v":309.6},{"$f":"'Übersicht Schützen'!D23","v":306.8},{"$f":"'Übersicht Schützen'!E23","v":307.1},{"$f":"'Übersicht Schützen'!F23","v":307.7},{"$f":"'Übersicht Schützen'!G23","v":304.4},{"$f":"'Übersicht Schützen'!H23","v":307.8},{"$f":"'Übersicht Schützen'!I23","v":{"v":307.2333333333333,"d":"307.23"}},{"v":1843.3999999999999,"d":"1,843.4"},{"$f":"'Übersicht Schützen'!L23","v":307.5},{"$f":"'Übersicht Schützen'!M23","v":{"v":306.29999999999995,"d":"306.3"}},{"$f":"'Übersicht Schützen'!N23","v":310.9},{"$f":"'Übersicht Schützen'!O23","v":306.9},{"$f":"'Übersicht Schützen'!P23","v":308.5},{"$f":"'Übersicht Schützen'!Q23","v":{"v":0,"d":"0.0"}},308.02,{"v":1540.1,"d":"1,540.1"},{"$f":"'Übersicht Schützen'!U23","v":{"v":307.59090909090907,"d":"307.59"}},{"v":3383.5,"d":"3,383.5"},{"v":-5.900000000000091,"d":"-5.9"}]
[23,{"$f":"'Übersicht Schützen'!A24","v":"Werner Jansen"},{"$f":"'Übersicht Schützen'!B24","v":"Breddenb.-Heid. III"},{"$f":"'Übersicht Schützen'!C24","v":304.3},{"$f":"'Übersicht Schützen'!D24","v":309.7},{"$f":"'Übersicht Schützen'!E24","v":309.4},{"$f":"'Übersicht Schützen'!F24","v":305.8},{"$f":"'Übersicht Schützen'!G24","v":304.8},{"$f":"'Übersicht Schützen'!H24","v":306.7},{"$f":"'Übersicht Schützen'!I24","v":{"v":306.78333333333336,"d":"306.78"}},{"v":1840.7,"d":"1,840.7"},{"$f":"'Übersicht Schützen'!L24","v":308.5},{"$f":"'Übersicht Schützen'!M24","v":{"v":309,"d":"309.0"}},{"$f":"'Übersicht Schützen'!N24","v":312.6},{"$f":"'Übersicht Schützen'!O24","v":301.2},{"$f":"'Übersicht Schützen'!P24","v":309.5},{"$f":"'Übersicht Schützen'!Q24","v":{"v":0,"d":"0.0"}},308.16,{"v":1540.8,"d":"1,540.8"},{"$f":"'Übersicht Schützen'!U24","v":{"v":307.4090909090909,"d":"307.41"}},{"v":3381.5,"d":"3,381.5"},{"v":-2,"d":"-2.0"}]
[24,{"$f":"'Übersicht Schützen'!A25","v":"Gerd Vogel "},{"$f":"'Übersicht Schützen'!B25","v":"Breddenb.-Heid. I"},{"$f":"'Übersicht Schützen'!C25","v":263.8},{"$f":"'Übersicht Schützen'!D25","v":310.9},{"$f":"'Übersicht Schützen'!E25","v":313.1},{"$f":"'Übersicht Schützen'!F25","v":312.6},{"$f":"'Übersicht Schützen'!G25","v":309.1},{"$f":"'Übersicht Schützen'!H25","v":{"v":313,"d":"313.0"}},{"$f":"'Übersicht Schützen'!I25","v":303.75},{"v":1822.5,"d":"1,822.5"},{"$f":"'Übersicht Schützen'!L25","v":312.1},{"$f":"'Übersicht Schützen'!M25","v":308.6},{"$f":"'Übersicht Schützen'!N25","v":313.2},{"$f":"'Übersicht Schützen'!O25","v":310.1},{"$f":"'Übersicht Schützen'!P25","v":310.7},{"$f":"'Übersicht Schützen'!Q25","v":{"v":0,"d":"0.0"}},{"$f":"IF(Formelhilfe!O32=0,0,'Übersicht Schützen'!R25)","v":310.94},{"v":1554.7,"d":"1,554.7"},{"$f":"'Übersicht Schützen'!U25","v":{"v":307.01818181818174,"d":"307.02"}},{"v":3377.2,"d":"3,377.2"},{"v":-4.300000000000182,"d":"-4.3"}]
[25,{"$f":"'Übersicht Schützen'!A26","v":"Helmut Benten "},{"$f":"'Übersicht Schützen'!B26","v":"Ostenwalde II"},{"$f":"'Übersicht Schützen'!C26","v":309.3},{"$f":"'Übersicht Schützen'!D26","v":313.7},{"$f":"'Übersicht Schützen'!E26","v":306.2},{"$f":"'Übersicht Schützen'!F26","v":303.4},{"$f":"'Übersicht Schützen'!G26","v":304.8},{"$f":"'Übersicht Schützen'!H26","v":304.7},{"$f":"'Übersicht Schützen'!I26","v":{"v":307.01666666666665,"d":"307.02"}},{"v":1842.1,"d":"1,842.1"},{"$f":"'Übersicht Schützen'!L26","v":305.2},{"$f":"'Übersicht Schützen'!M26","v":302.3},{"$f":"'Übersicht Schützen'!N26","v":{"v":307,"d":"307.0"}},{"$f":"'Übersicht Schützen'!O26","v":307.1},{"$f":"'Übersicht Schützen'!P26","v":309.8},{"$f":"'Übersicht Schützen'!Q26","v":{"v":0,"d":"0.0"}},{"$f":"IF(Formelhilfe!O33=0,0,'Übersicht Schützen'!R26)","v":306.28},{"v":1531.3999999999999,"d":"1,531.4"},{"$f":"'Übersicht Schützen'!U26","v":{"v":306.6818181818182,"d":"306.68"}},{"v":3373.5,"d":"3,373.5"},{"v":-3.699999999999818,"d":"-3.7"}]
[26,{"$f":"'Übersicht Schützen'!A27","v":"Anton Oldiges"},{"$f":"'Übersicht Schützen'!B27","v":"Lorup III"},{"$f":"'Übersicht Schützen'!C27","v":301.6},{"$f":"'Übersicht Schützen'!D27","v":302.5},{"$f":"'Übersicht Schützen'!E27","v":{"v":311,"d":"311.0"}},{"$f":"'Übersicht Schützen'!F27","v":306.7},{"$f":"'Übersicht Schützen'!G27","v":305.2},{"$f":"'Übersicht Schützen'!H27","v":307.3},{"$f":"'Übersicht Schützen'!I27","v":{"v":305.71666666666664,"d":"305.72"}},{"v":1834.3,"d":"1,834.3"},{"$f":"'Übersicht Schützen'!L27","v":306.3},{"$f":"'Übersicht Schützen'!M27","v":309.2},{"$f":"'Übersicht Schützen'!N27","v":308.8},{"$f":"'Übersicht Schützen'!O27","v":{"v":304,"d":"304.0"}},{"$f":"'Übersicht Schützen'!P27","v":309.5},{"$f":"'Übersicht Schützen'!Q27","v":{"v":0,"d":"0.0"}},{"$f":"IF(Formelhilfe!O34=0,0,'Übersicht Schützen'!R27)","v":307.56},{"v":1537.8,"d":"1,537.8"},{"$f":"'Übersicht Schützen'!U27","v":{"v":306.55454545454546,"d":"306.55"}},{"v":3372.1,"d":"3,372.1"},{"v":-1.400000000000091,"d":"-1.4"}]
[27,{"$f":"'Übersicht Schützen'!A28","v":"Hans Gebken 3"},{"$f":"'Übersicht Schützen'!B28","v":"Breddenb.-Heid. I"},{"$f":"'Übersicht Schützen'!C28","v":306.3},{"$f":"'Übersicht Schützen'!D28","v":300.7},{"$f":"'Übersicht Schützen'!E28","v":304.1},{"$f":"'Übersicht Schützen'!F28","v":304.5},{"$f":"'Übersicht Schützen'!G28","v":306.7},{"$f":"'Übersicht Schützen'!H28","v":307.9},{"$f":"'Übersicht Schützen'!I28","v":{"v":305.0333333333333,"d":"305.03"}},{"v":1830.1999999999998,"d":"1,830.2"},{"$f":"'Übersicht Schützen'!L28","v":303.6},{"$f":"'Übersicht Schützen'!M28","v":306.4},{"$f":"'Übersicht Schützen'!N28","v":310.5},{"$f":"'Übersicht Schützen'!O28","v":310.2},{"$f":"'Übersicht Schützen'!P28","v":308.3},{"$f":"'Übersicht Schützen'!Q28","v":{"v":0,"d":"0.0"}},{"$f":"IF(Formelhilfe!O35=0,0,'Übersicht Schützen'!R28)","v":{"v":307.8,"d":"307.80"}},{"v":1539,"d":"1,539.0"},{"$f":"'Übersicht Schützen'!U28","v":{"v":306.29090909090905,"d":"306.29"}},{"v":3369.2,"d":"3,369.2"},{"v":-2.900000000000091,"d":"-2.9"}]
[28,{"$f":"'Übersicht Schützen'!A29","v":"Johannes Oldiges"},{"$f":"'Übersicht Schützen'!B29","v":"Breddenb.-Heid. III"},{"$f":"'Übersicht Schützen'!C29","v":306.7},{"$f":"'Übersicht Schützen'!D29","v":304.1},{"$f":"'Übersicht Schützen'!E29","v":307.6},{"$f":"'Übersicht Schützen'!F29","v":{"v":305,"d":"305.0"}},{"$f":"'Übersicht Schützen'!G29","v":308.9},{"$f":"'Übersicht Schützen'!H29","v":307.5},{"$f":"'Übersicht Schützen'!I29","v":{"v":306.6333333333334,"d":"306.63"}},{"v":1839.8000000000002,"d":"1,839.8"},{"$f":"'Übersicht Schützen'!L29","v":303.8},{"$f":"'Übersicht Schützen'!M29","v":{"v":305.79999999999995,"d":"305.8"}},{"$f":"'Übersicht Schützen'!N29","v":307.5},{"$f":"'Übersicht Schützen'!O29","v":306.1},{"$f":"'Übersicht Schützen'!P29","v":302.6},{"$f":"'Übersicht Schützen'!Q29","v":{"v":0,"d":"0.0"}},{"$f":"IF(Formelhilfe!O36=0,0,'Übersicht Schützen'!R29)","v":{"v":305.15999999999997,"d":"305.16"}},{"v":1525.7999999999997,"d":"1,525.8"},{"$f":"'Übersicht Schützen'!U29","v":{"v":305.9636363636364,"d":"305.96"}},{"v":3365.6,"d":"3,365.6"},{"v":-3.599999999999909,"d":"-3.6"}]
[29,{"$f":"'Übersicht Schützen'!A30","v":"Alfons Plüster"},{"$f":"'Übersicht Schützen'!B30","v":"Breddenb.-Heid. III"},{"$f":"'Übersicht Schützen'!C30","v":305.9},{"$f":"'Übersicht Schützen'!D30","v":301.5},{"$f":"'Übersicht Schützen'!E30","v":302.1},{"$f":"'Übersicht Schützen'!F30","v":301.6},{"$f":"'Übersicht Schützen'!G30","v":{"v":308,"d":"308.0"}},{"$f":"'Übersicht Schützen'!H30","v":303.6},{"$f":"'Übersicht Schützen'!I30","v":{"v":303.7833333333333,"d":"303.78"}},{"v":1822.6999999999998,"d":"1,822.7"},{"$f":"'Übersicht Schützen'!L30","v":311.8},{"$f":"'Übersicht Schützen'!M30","v":{"v":306.29999999999995,"d":"306.3"}},{"$f":"'Übersicht Schützen'!N30","v":305.1},{"$f":"'Übersicht Schützen'!O30","v":304.7},{"$f":"'Übersicht Schützen'!P30","v":305.1},{"$f":"'Übersicht Schützen'!Q30","v":{"v":0,"d":"0.0"}},{"$f":"IF(Formelhilfe!O37=0,0,'Übersicht Schützen'!R30)","v":{"v":306.6,"d":"306.60"}},{"v":1533,"d":"1,533.0"},{"$f":"'Übersicht Schützen'!U30","v":{"v":305.06363636363636,"d":"305.06"}},{"v":3355.7,"d":"3,355.7"},{"v":-9.900000000000091,"d":"-9.9"}]
[30,{"$f":"'Übersicht Schützen'!A31","v":"Hans Gebken 1"},{"$f":"'Übersicht Schützen'!B31","v":"Breddenb.-Heid. I"},{"$f":"'Übersicht Schützen'!C31","v":298.3},{"$f":"'Übersicht Schützen'!D31","v":{"v":305,"d":"305.0"}},{"$f":"'Übersicht Schützen'!E31","v":297.1},{"$f":"'Übersicht Schützen'!F31","v":303.4},{"$f":"'Übersicht Schützen'!G31","v":303.6},{"$f":"'Übersicht Schützen'!H31","v":299.8},{"$f":"'Übersicht Schützen'!I31","v":{"v":301.2,"d":"301.20"}},{"v":1807.2,"d":"1,807.2"},{"$f":"'Übersicht Schützen'!L31","v":306.8},{"$f":"'Übersicht Schützen'!M31","v":306.4},{"$f":"'Übersicht Schützen'!N31","v":307.7},{"$f":"'Übersicht Schützen'!O31","v":306.2},{"$f":"'Übersicht Schützen'!P31","v":305.7},{"$f":"'Übersicht Schützen'!Q31","v":{"v":0,"d":"0.0"}},{"$f":"IF(Formelhilfe!O38=0,0,'Übersicht Schützen'!R31)","v":{"v":306.56000000000006,"d":"306.56"}},{"v":1532.8000000000002,"d":"1,532.8"},{"$f":"'Übersicht Schützen'!U31","v":{"v":303.63636363636357,"d":"303.64"}},{"v":3340,"d":"3,340.0"},{"v":-15.699999999999818,"d":"-15.7"}]
[31,{"$f":"'Übersicht Schützen'!A32","v":"Michael Freitag "},{"$f":"'Übersicht Schützen'!B32","v":"Werlte III"},{"$f":"'Übersicht Schützen'!C32","v":309.3},{"$f":"'Übersicht Schützen'!D32","v":{"v":311,"d":"311.0"}},{"$f":"'Übersicht Schützen'!E32","v":306.8},{"$f":"'Übersicht Schützen'!F32","v":313.1},{"$f":"'Übersicht Schützen'!G32","v":314.6},{"$f":"'Übersicht Schützen'!H32","v":310.1},{"$f":"'Übersicht Schützen'!I32","v":{"v":310.8166666666666,"d":"310.82"}},{"v":1864.8999999999996,"d":"1,864.9"},{"$f":"'Übersicht Schützen'!L32","v":313.9},{"$f":"'Übersicht Schützen'!M32","v":315.7},{"$f":"'Übersicht Schützen'!N32","v":311.2},{"$f":"'Übersicht Schützen'!O32","v":{"v":0,"d":"0.0"}},{"$f":"'Übersicht Schützen'!P32","v":308.6},{"$f":"'Übersicht Schützen'!Q32","v":{"v":0,"d":"0.0"}},{"$f":"IF(Formelhilfe!O39=0,0,'Übersicht Schützen'!R32)","v":312.35},{"v":1249.4,"d":"1,249.4"},{"$f":"'Übersicht Schützen'!U32","v":{"v":311.42999999999995,"d":"311.43"}},{"v":3114.2999999999997,"d":"3,114.3"},{"$f":"(U46-U47)*-1","v":{"v":-225.70000000000027,"d":"-225.7"}}]
[32,{"$f":"'Übersicht Schützen'!A33","v":"Matthias Brinkmann"},{"$f":"'Übersicht Schützen'!B33","v":"Ostenwalde II"},{"$f":"'Übersicht Schützen'!C33","v":309.6},{"$f":"'Übersicht Schützen'!D33","v":{"v":303,"d":"303.0"}},{"$f":"'Übersicht Schützen'!E33","v":{"v":305,"d":"305.0"}},{"$f":"'Übersicht Schützen'!F33","v":308.1},{"$f":"'Übersicht Schützen'!G33","v":{"v":0,"d":"0.0"}},{"$f":"'Übersicht Schützen'!H33","v":303.3},{"$f":"'Übersicht Schützen'!I33","v":{"v":305.8,"d":"305.80"}},{"v":1529,"d":"1,529.0"},{"$f":"'Übersicht Schützen'!L33","v":310.3},{"$f":"'Übersicht Schützen'!M33","v":309.9},{"$f":"'Übersicht Schützen'!N33","v":{"v":309,"d":"309.0"}},{"$f":"'Übersicht Schützen'!O33","v":309.8},{"$f":"'Übersicht Schützen'!P33","v":304.1},{"$f":"'Übersicht Schützen'!Q33","v":{"v":0,"d":"0.0"}},{"$f":"IF(Formelhilfe!O40=0,0,'Übersicht Schützen'!R33)","v":308.62},{"v":1543.1,"d":"1,543.1"},{"$f":"'Übersicht Schützen'!U33","v":307.21},{"v":3072.1,"d":"3,072.1"},{"v":-42.19999999999982,"d":"-42.2"}]
[33,{"$f":"'Übersicht Schützen'!A34","v":"Kevin Minnert"},{"$f":"'Übersicht Schützen'!B34","v":"Börgermoor II"},{"$f":"'Übersicht Schützen'!C34","v":306.5},{"$f":"'Übersicht Schützen'!D34","v":302.7},{"$f":"'Übersicht Schützen'!E34","v":305.3},{"$f":"'Übersicht Schützen'!F34","v":{"v":294,"d":"294.0"}},{"$f":"'Übersicht Schützen'!G34","v":297.4},{"$f":"'Übersicht Schützen'!H34","v":294.9},{"$f":"'Übersicht Schützen'!I34","v":{"v":300.1333333333334,"d":"300.13"}},{"v":1800.8000000000002,"d":"1,800.8"},{"$f":"'Übersicht Schützen'!L34","v":305.1},{"$f":"'Übersicht Schützen'!M34","v":305.1},{"$f":"'Übersicht Schützen'!N34","v":{"v":0,"d":"0.0"}},{"$f":"'Übersicht Schützen'!O34","v":{"v":0,"d":"0.0"}},{"$f":"'Übersicht Schützen'!P34","v":{"v":0,"d":"0.0"}},{"$f":"'Übersicht Schützen'!Q34","v":{"v":0,"d":"0.0"}},{"$f":"IF(Formelhilfe!O41=0,0,'Übersicht Schützen'!R34)","v":{"v":305.1,"d":"305.10"}},610.2,{"$f":"'Übersicht Schützen'!U34","v":{"v":301.375,"d":"301.38"}},{"v":2411,"d":"2,411.0"},{"v":-661.0999999999999,"d":"-661.1"}]
[34,{"$f":"'Übersicht Schützen'!A35","v":"Daniel Schülke"},{"$f":"'Übersicht Schützen'!B35","v":"Börgermoor II"},{"$f":"'Übersicht Schützen'!C35","v":{"v":0,"d":"0.0"}},{"$f":"'Übersicht Schützen'!D35","v":{"v":0,"d":"0.0"}},{"$f":"'Übersicht Schützen'!E35","v":303.1},{"$f":"'Übersicht Schützen'!F35","v":292.3},{"$f":"'Übersicht Schützen'!G35","v":306.6},{"$f":"'Übersicht Schützen'!H35","v":{"v":0,"d":"0.0"}},{"$f":"'Übersicht Schützen'!I35","v":{"v":300.6666666666667,"d":"300.67"}},{"v":902.0000000000001,"d":"902.0"},{"$f":"'Übersicht Schützen'!L35","v":300.4},{"$f":"'Übersicht Schützen'!M35","v":{"v":0,"d":"0.0"}},{"$f":"'Übersicht Schützen'!N35","v":292.5},{"$f":"'Übersicht Schützen'!O35","v":{"v":301,"d":"301.0"}},{"$f":"'Übersicht Schützen'!P35","v":299.4},{"$f":"'Übersicht Schützen'!Q35","v":{"v":0,"d":"0.0"}},{"$f":"IF(Formelhilfe!O42=0,0,'Übersicht Schützen'!R35)","v":{"v":298.325,"d":"298.33"}},{"v":1193.3,"d":"1,193.3"},{"$f":"'Übersicht Schützen'!U35","v":{"v":299.3285714285715,"d":"299.33"}},{"v":2095.3,"d":"2,095.3"},{"v":-315.6999999999998,"d":"-315.7"}]
[35,{"$f":"'Übersicht Schützen'!A36","v":"Schütze 22"},{"$f":"'Übersicht Schützen'!B36","v":"Lorup III"},{"$f":"'Übersicht Schützen'!C36","v":{"v":0,"d":"0.0"}},{"$f":"'Übersicht Schützen'!D36","v":{"v":0,"d":"0.0"}},{"$f":"'Übersicht Schützen'!E36","v":{"v":0,"d":"0.0"}},{"$f":"'Übersicht Schützen'!F36","v":{"v":0,"d":"0.0"}},{"$f":"'Übersicht Schützen'!G36","v":{"v":0,"d":"0.0"}},{"$f":"'Übersicht Schützen'!H36","v":{"v":0,"d":"0.0"}},{"v":0,"d":"0.00"},{"v":0,"d":"0.0"},{"$f":"'Übersicht Schützen'!L36","v":{"v":0,"d":"0.0"}},{"$f":"'Übersicht Schützen'!M36","v":{"v":0,"d":"0.0"}},{"$f":"'Übersicht Schützen'!N36","v":{"v":0,"d":"0.0"}},{"$f":"'Übersicht Schützen'!O36","v":{"v":0,"d":"0.0"}},{"$f":"'Übersicht Schützen'!P36","v":{"v":0,"d":"0.0"}},{"$f":"'Übersicht Schützen'!Q36","v":{"v":0,"d":"0.0"}},{"v":0,"d":"0.00"},{"v":0,"d":"0.0"},{"v":0,"d":"0.00"},{"v":0,"d":"0.0"},{"v":0,"d":"0.0"}]
[36,{"$f":"'Übersicht Schützen'!A37","v":"Schütze 23"},{"$f":"'Übersicht Schützen'!B37","v":"Lorup III"},{"$f":"'Übersicht Schützen'!C37","v":{"v":0,"d":"0.0"}},{"$f":"'Übersicht Schützen'!D37","v":{"v":0,"d":"0.0"}},{"$f":"'Übersicht Schützen'!E37","v":{"v":0,"d":"0.0"}},{"$f":"'Übersicht Schützen'!F37","v":{"v":0,"d":"0.0"}},{"$f":"'Übersicht Schützen'!G37","v":{"v":0,"d":"0.0"}},{"$f":"'Übersicht Schützen'!H37","v":{"v":0,"d":"0.0"}},{"v":0,"d":"0.00"},{"v":0,"d":"0.0"},{"$f":"'Übersicht Schützen'!L37","v":{"v":0,"d":"0.0"}},{"$f":"'Übersicht Schützen'!M37","v":{"v":0,"d":"0.0"}},{"$f":"'Übersicht Schützen'!N37","v":{"v":0,"d":"0.0"}},{"$f":"'Übersicht Schützen'!O37","v":{"v":0,"d":"0.0"}},{"$f":"'Übersicht Schützen'!P37","v":{"v":0,"d":"0.0"}},{"$f":"'Übersicht Schützen'!Q37","v":{"v":0,"d":"0.0"}},{"v":0,"d":"0.00"},{"v":0,"d":"0.0"},{"v":0,"d":"0.00"},{"v":0,"d":"0.0"},{"$f":"(U51-U52)*-1","v":{"v":0,"d":"0.0"}}]
[]
[null,null,"Schnitt:",{"$f":"SUM(D17:D52)/Formelhilfe!B45","v":{"v":307.45151515151514,"d":"307.5"}},{"$f":"SUM(E17:E52)/Formelhilfe!C45","v":{"v":309.06969696969696,"d":"309.1"}},{"$f":"SUM(F17:F52)/Formelhilfe!D45","v":{"v":309.65294117647056,"d":"309.7"}},{"$f":"SUM(G17:G52)/Formelhilfe!E45","v":{"v":308.25294117647053,"d":"308.3"}},{"$f":"SUM(H17:H52)/Formelhilfe!F45","v":{"v":309.3606060606061,"d":"309.4"}},{"$f":"SUM(I17:I52)/Formelhilfe!G45","v":{"v":308.560606060606,"d":"308.6"}},{"$f":"AVERAGE(J17:J52)","v":{"v":291.44999999999993,"d":"291.45"}},{"$f":"AVERAGE(K17:K52)","v":1715.15},{"$f":"SUM(L17:L52)/Formelhilfe!I45","v":{"v":309.8441176470588,"d":"309.8"}},{"$f":"SUM(M17:M52)/Formelhilfe!J45","v":{"v":309.1393939393939,"d":"309.1"}},{"$f":"SUM(N17:N52)/Formelhilfe!K45","v":{"v":310.16363636363644,"d":"310.2"}},{"$f":"SUM(O17:O52)/Formelhilfe!L45","v":{"v":308.57500000000005,"d":"308.6"}},{"$f":"SUM(P17:P52)/Formelhilfe!M45","v":{"v":309.29393939393947,"d":"309.3"}},{"$f":"SUM(Q17:Q52)/Formelhilfe!N45","v":{"$error":"#DIV/0!"}},{"$f":"AVERAGE(R17:R52)","v":{"v":292.1043055555555,"d":"292.10"}},{"$f":"AVERAGE(S17:S52)","v":{"v":1418.1333333333337,"d":"1418.13"}},{"$f":"AVERAGE(T17:T52)","v":{"v":291.7128264790765,"d":"291.71"}},{"$f":"(K54+S54)","v":{"v":3133.2833333333338,"d":"3,133.28 "}}]

{"sheet":"Wettkampf 1","index":1,"n_rows":47,"n_cols":29,"rows_kept":47,"merged":[[0,24,0,25],[1,24,1,25],[4,24,4,25],[5,24,5,25],[6,24,6,25],[8,22,8,25]]}
[null,"Verein / Gruppe",null,"Ergebnisse",{"$nulls":19},"Austragungsort:",{"$f":"Übersicht!D4","v":"Breddenb.-Heid."}]
[1,"Breddenb.-Heid. I",null,{"$f":"G46","v":926.7},{"$f":"IF(H46>4,\"Es sind zu viele Schützen in Wertung!\",\" \")","v":" "},{"$nulls":18},"Wettkampftag:",{"$f":"Übersicht!D3","v":"15.09."}]
[2,"Ostenwalde II",null,{"$f":"I46","v":937.2},{"$f":"IF(J46>4,\"Es sind zu viele Schützen in Wertung!\",\" \")","v":" "}]
[3,"Börgermoor II",null,{"$f":"K46","v":931.7},{"$f":"IF(L46>4,\"Es sind zu viele Schützen in Wertung!\",\" \")","v":" "},{"$nulls":20},"Ansprechpartner für Rückfragen:"]
[4,"Lorup III",null,{"$f":"M46","v":{"v":936.0999999999999,"d":"936.1"}},{"$f":"IF(N46>4,\"Es sind zu viele Schützen in Wertung!\",\" \")","v":" "},{"$nulls":18},"Name:","Heinz Engbers"]
[5,"Breddenb.-Heid. III",null,{"$f":"O46","v":{"v":924.5999999999999,"d":"924.6"}},{"$f":"IF(P46>4,\"Es sind zu viele Schützen in Wertung!\",\" \")","v":" "},{"$nulls":18},"Tel:","01749514192"]
[6,"Werlte III",null,{"$f":"Q46","v":{"v":938.3000000000001,"d":"938.3"}},{"$f":"IF(R46>4,\"Es sind zu viele Schützen in Wertung!\",\" \")","v":" "},{"$nulls":18},"Standaufsicht:","W. Engbers H.Engbers"]
[]
[null,"Einzelergebnisse:","Verein/Gruppe (per Dropdown-Feld einzutragen)","Ergebnisse","AW? Dann x eintippen",null,"Verein 1",null,"Verein 2",null,"Verein 3",null,"Verein 4",null,"Verein 5",null,"Verein 6",{"$nulls":3},"Geburtsdatum",null,"Proberechnung bei Streifen:"]
[1,"Hans Gebken 3",{"$f":"B2","v":"Breddenb.-Heid. I"},306.3,null,{"$f":"IF(E10=\"x\",\"0\",D10)","v":306.3},{"$f":"IF(C10=$B$2,F10,0)","v":306.3},{"$f":"(IF(AND($E10=\"\",$C10=$B$2),1,0))","v":1},{"$f":"IF($C10=$B$3,F10,0)","v":0},{"$f":"(IF(AND($E10=\"\",$C10=$B$3),1,0))","v":0},{"$f":"IF($C10=$B$4,F10,0)","v":0},{"$f":"(IF(AND($E10=\"\",$C10=$B$4),1,0))","v":0},{"$f":"IF($C10=$B$5,F10,0)","v":0},{"$f":"(IF(AND($E10=\"\",$C10=$B$5),1,0))","v":0},{"$f":"IF($C10=$B$6,F10,0)","v":0},{"$f":"(IF(AND($E10=\"\",$C10=$B$6),1,0))","v":0},{"$f":"IF($C10=$B$7,F10,0)","v":0},{"$f":"(IF(AND($E10=\"\",$C10=$B$7),1,0))","v":0},{"$nulls":7},{"$f":"W10+X10+Y10","v":{"v":0,"d":"0.0"}},{"$f":"IF(Z10=D10,1,0)","v":0},{"$f":"IF(Z10=0,0,1)","v":0},{"$f":"IF(AA10+AB10=2,\"Korrekt\",\"\")","v":""}]
[2,"Gerd Vogel ",{"$f":"B2","v":"Breddenb.-Heid. I"},263.8,"x",{"$f":"IF(E11=\"x\",\"0\",D11)","v":"0"},{"$f":"IF(C11=$B$2,F11,0)","v":"0"},{"$f":"(IF(AND($E11=\"\",$C11=$B$2),1,0))","v":0},{"$f":"IF($C11=$B$3,F11,0)","v":0},{"$f":"(IF(AND($E11=\"\",$C11=$B$3),1,0))","v":0},{"$f":"IF($C11=$B$4,F11,0)","v":0},{"$f":"(IF(AND($E11=\"\",$C11=$B$4),1,0))","v":0},{"$f":"IF($C11=$B$5,F11,0)","v":0},{"$f":"(IF(AND($E11=\"\",$C11=$B$5),1,0))","v":0},{"$f":"IF($C11=$B$6,F11,0)","v":0},{"$f":"(IF(AND($E11=\"\",$C11=$B$6),1,0))","v":0},{"$f":"IF($C11=$B$7,F11,0)","v":0},{"$f":"(IF(AND($E11=\"\",$C11=$B$7),1,0))","v":0},{"$nulls":7},{"$f":"W11+X11+Y11","v":{"v":0,"d":"0.0"}},{"$f":"IF(Z11=D11,1,0)","v":0},{"$f":"IF(Z11=0,0,1)","v":0},{"$f":"IF(AA11+AB11=2,\"Korrekt\",\"\")","v":""}]
[3,"Heinz Engbers",{"$f":"B2","v":"Breddenb.-Heid. I"},308.1," ",308.1,308.1,0,0,0,0,0,0,0,0,0,0,0,{"$nulls":7},{"v":0,"d":"0.0"},0,0,""]
[4,"Willi Engbers",{"$f":"B2","v":"Breddenb.-Heid. I"},312.3,null,312.3,312.3,1,0,0,0,0,0,0,0,0,0,0,{"$nulls":7},{"v":0,"d":"0.0"},0,0,""]
[5,"Hans Gebken 1",{"$f":"B2","v":"Breddenb.-Heid. I"},298.3,"x","0","0",0,0,0,0,0,0,0,0,0,0,0,{"$nulls":7},{"v":0,"d":"0.0"},0,0,""]
[6,"Philipp Schmidt","Ostenwalde II",313.2,null,313.2,0,0,313.2,1,0,0,0,0,0,0,0,0,{"$nulls":7},{"v":0,"d":"0.0"},0,0,""]
[7,"Philipp Scholübbers ",{"$f":"B3","v":"Ostenwalde II"},312.2,null,312.2,0,0,312.2,1,0,0,0,0,0,0,0,0,{"$nulls":7},{"v":0,"d":"0.0"},0,0,""]
[8,"Matthias Brinkmann",{"$f":"B3","v":"Ostenwalde II"},309.6,null,309.6,0,0,309.6,1,0,0,0,0,0,0,0,0,{"$nulls":7},{"v":0,"d":"0.0"},0,0,""]
[9,"Patrik Krüßel",{"$f":"B3","v":"Ostenwalde II"},311.8,null,311.8,0,0,311.8,1,0,0,0,0,0,0,0,0,{"$nulls":7},{"v":0,"d":"0.0"},0,0,""]
[10,"Markus Jansen",{"$f":"B3","v":"Ostenwalde II"},{"v":309,"d":"309.0"},"x","0",0,0,"0",0,0,0,0,0,0,0,0,0,{"$nulls":7},{"v":0,"d":"0.0"},0,0,""]
[11,"Helmut Benten ",{"$f":"B3","v":"Ostenwalde II"},309.3,"x","0",0,0,"0",0,0,0,0,0,0,0,0,0,{"$nulls":7},{"v":0,"d":"0.0"},0,0,""]
[12,"Heinz Dirksen","Börgermoor II",309.6,null,309.6,0,0,0,0,309.6,1,0,0,0,0,0,0,{"$nulls":7},{"v":0,"d":"0.0"},0,0,""]
[13,"Hans Ortmann ",{"$f":"B4","v":"Börgermoor II"},{"v":310,"d":"310.0"},null,310,0,0,0,0,310,1,0,0,0,0,0,0,{"$nulls":7},{"v":0,"d":"0.0"},0,0,""]
[14,"Karl-Heinz Ortmann",{"$f":"B4","v":"Börgermoor II"},305.9,null,305.9,0,0,0,0,305.9,1,0,0,0,0,0,0,{"$nulls":7},{"v":0,"d":"0.0"},0,0,""]
[15,"Johannes Jansen",{"$f":"B4","v":"Börgermoor II"},312.1,null,312.1,0,0,0,0,312.1,1,0,0,0,0,0,0,{"$nulls":7},{"v":0,"d":"0.0"},0,0,""]
[16,"Kevin Minnert",{"$f":"B4","v":"Börgermoor II"},306.5,"x","0",0,0,0,0,"0",0,0,0,0,0,0,0,{"$nulls":7},{"v":0,"d":"0.0"},0,0,""]
[17,"Daniel Schülke",{"$f":"B4","v":"Börgermoor II"},null,"x","0",0,0,0,0,"0",0,0,0,0,0,0,0,{"$nulls":7},{"v":0,"d":"0.0"},1,0,""]
[18,"Frank Wotte","Lorup III",{"v":312,"d":"312.0"},null,312,0,0,0,0,0,0,312,1,0,0,0,0,{"$nulls":7},{"v":0,"d":"0.0"},0,0,""]
[19,"Johannes Wesseln",{"$f":"B5","v":"Lorup III"},310.2,null,310.2,0,0,0,0,0,0,310.2,1,0,0,0,0,{"$nulls":7},{"v":0,"d":"0.0"},0,0,""]
[20,"Anton Oldiges",{"$f":"B5","v":"Lorup III"},301.6,null,301.6,0,0,0,0,0,0,301.6,1,0,0,0,0,{"$nulls":7},{"v":0,"d":"0.0"},0,0,""]
[21,"Jürgen Will",{"$f":"B5","v":"Lorup III"},313.9,null,313.9,0,0,0,0,0,0,313.9,1,0,0,0,0,{"$nulls":7},{"v":0,"d":"0.0"},0,0,""]
[22,"Schütze 22",{"$f":"B5","v":"Lorup III"},null,"x","0",0,0,0,0,0,0,"0",0,0,0,0,0,{"$nulls":7},{"v":0,"d":"0.0"},1,0,""]
[23,"Schütze 23",{"$f":"B5","v":"Lorup III"},null,"x","0",0,0,0,0,0,0,"0",0,0,0,0,0,{"$nulls":7},{"v":0,"d":"0.0"},1,0,""]
[24,"Norbert Jansen","Breddenb.-Heid. III",300.5,"x","0",0,0,0,0,0,0,0,0,"0",0,0,0,{"$nulls":7},{"v":0,"d":"0.0"},0,0,""]
[25,"Werner Jansen",{"$f":"B6","v":"Breddenb.-Heid. III"},304.3,null,304.3,0,0,0,0,0,0,0,0,304.3,1,0,0,{"$nulls":7},{"v":0,"d":"0.0"},0,0,""]
[26,"Alfons Plüster",{"$f":"B6","v":"Breddenb.-Heid. III"},305.9,"x","0",0,0,0,0,0,0,0,0,"0",0,0,0,{"$nulls":7},{"v":0,"d":"0.0"},0,0,""]
[27,"Johannes Oldiges",{"$f":"B6","v":"Breddenb.-Heid. III"},306.7,"x","0",0,0,0,0,0,0,0,0,"0",0,0,0,{"$nulls":7},{"v":0,"d":"0.0"},0,0,""]
[28,"Hans Plüster",{"$f":"B6","v":"Breddenb.-Heid. III"},310.9,null,310.9,0,0,0,0,0,0,0,0,310.9,1,0,0,{"$nulls":7},{"v":0,"d":"0.0"},0,0,""]
[29,"Josef Wübben ",{"$f":"B6","v":"Breddenb.-Heid. III"},309.4," ",309.4,0,0,0,0,0,0,0,0,309.4,0,0,0,{"$nulls":7},{"v":0,"d":"0.0"},0,0,""]
[30,"Thomas Niermann","Werlte III",313.1,"x","0",0,0,0,0,0,0,0,0,0,0,"0",0,{"$nulls":7},{"v":0,"d":"0.0"},0,0,""]
[31,"Bernd Thien",{"$f":"B7","v":"Werlte III"},311.9,null,311.9,0,0,0,0,0,0,0,0,0,0,311.9,1,{"$nulls":7},{"$f":"W40+X40+Y40","v":{"v":0,"d":"0.0"}},{"$f":"IF(Z40=D40,1,0)","v":0},{"$f":"IF(Z40=0,0,1)","v":0},{"$f":"IF(AA40+AB40=2,\"Korrekt\",\"\")","v":""}]
[32,"Norbert Grünloh ",{"$f":"B7","v":"Werlte III"},311.6,null,311.6,0,0,0,0,0,0,0,0,0,0,311.6,1,{"$nulls":7},{"v":0,"d":"0.0"},0,0,""]
[33,"Andreas Thoben ",{"$f":"B7","v":"Werlte III"},314.8,null,314.8,0,0,0,0,0,0,0,0,0,0,314.8,1,{"$nulls":7},{"v":0,"d":"0.0"},0,0,""]
[34,"Hermann Krone ",{"$f":"B7","v":"Werlte III"},306.8,"x","0",0,0,0,0,0,0,0,0,0,0,"0",0,{"$nulls":7},{"v":0,"d":"0.0"},0,0,""]
[35,"Michael Freitag ",{"$f":"B7","v":"Werlte III"},309.3,"x","0",0,0,0,0,0,0,0,0,0,0,"0",0,{"$nulls":7},{"v":0,"d":"0.0"},0,0,""]
[36,"Joachim Niermann",{"$f":"B7","v":"Werlte III"},{"v":305,"d":"305.0"},"x","0",0,0,0,0,0,0,0,0,0,0,"0",0,{"$nulls":7},{"$f":"W45+X45+Y45","v":{"v":0,"d":"0.0"}},{"$f":"IF(Z45=D45,1,0)","v":0},{"$f":"IF(Z45=0,0,1)","v":0},{"$f":"IF(AA45+AB45=2,\"Korrekt\",\"\")","v":""}]
[{"$nulls":6},{"$f":"LARGE(G10:G45,1)+LARGE(G10:G45,2)+LARGE(G10:G45,3)","v":926.7},{"$f":"SUM(H10:H45)","v":2},{"$f":"LARGE(I10:I45,1)+LARGE(I10:I45,2)+LARGE(I10:I45,3)","v":937.2},{"$f":"SUM(J10:J45)","v":4},{"$f":"LARGE(K10:K45,1)+LARGE(K10:K45,2)+LARGE(K10:K45,3)","v":931.7},{"$f":"SUM(L10:L45)","v":4},{"$f":"LARGE(M10:M45,1)+LARGE(M10:M45,2)+LARGE(M10:M45,3)","v":936.0999999999999},{"$f":"SUM(N10:N45)","v":4},{"$f":"LARGE(O10:O45,1)+LARGE(O10:O45,2)+LARGE(O10:O45,3)","v":924.5999999999999},{"$f":"SUM(P10:P45)","v":2},{"$f":"LARGE(Q10:Q45,1)+LARGE(Q10:Q45,2)+LARGE(Q10:Q45,3)","v":938.3000000000001},{"$f":"SUM(R10:S45)","v":3}]
[null,null,"per Email an: sk-huemmling@gmx.de"]

{"sheet":"2","index":2,"n_rows":47,"n_cols":27,"rows_kept":47,"merged":[[0,22,0,23],[1,22,1,23],[4,22,4,23],[5,22,5,23],[6,22,6,23],[8,20,8,23]]}
[null,"Verein / Gruppe",null,"Ergebnisse",{"$nulls":17},"Austragungsort:",{"$f":"Übersicht!E4","v":"Ostenwalde"}]
[1,{"$f":"'Wettkampf 1'!B2","v":"Breddenb.-Heid. I"},null,{"$f":"G46","v":928.4},{"$f":"IF(H46>4,\"Es sind zu viele Schützen in Wertung!\",\" \")","v":" "},{"$nulls":16},"Wettkampftag:",{"$f":"Übersicht!E3","v":"06.10."}]
[2,{"$f":"'Wettkampf 1'!B3","v":"Ostenwalde II"},null,{"$f":"I46","v":942.8},{"$f":"IF(J46>4,\"Es sind zu viele Schützen in Wertung!\",\" \")","v":" "}]
[3,{"$f":"'Wettkampf 1'!B4","v":"Börgermoor II"},null,{"$f":"K46","v":926.2},{"$f":"IF(L46>4,\"Es sind zu viele Schützen in Wertung!\",\" \")","v":" "},{"$nulls":18},"Ansprechpartner für Rückfragen:"]
[4,{"$f":"'Wettkampf 1'!B5","v":"Lorup III"},null,{"$f":"M46","v":933.3},{"$f":"IF(N46>4,\"Es sind zu viele Schützen in Wertung!\",\" \")","v":" "},{"$nulls":16},"Name:","Markus Jansen"]
[5,{"$f":"'Wettkampf 1'!B6","v":"Breddenb.-Heid. III"},null,{"$f":"O46","v":933.5},{"$f":"IF(P46>4,\"Es sind zu viele Schützen in Wertung!\",\" \")","v":" "},{"$nulls":16},"Tel:"]
[6,{"$f":"'Wettkampf 1'!B7","v":"Werlte III"},null,{"$f":"Q46","v":{"v":938.0999999999999,"d":"938.1"}},{"$f":"IF(R46>4,\"Es sind zu viele Schützen in Wertung!\",\" \")","v":" "},{"$nulls":16},"Standaufsicht:","Philipp Schmidt"]
[]
[null,"Einzelergebnisse:","Verein / Gruppe","Ergebnisse (mindestens 0 eintragen)","AW? Dann x eintippen",null,"Verein 1",null,"Verein 2",null,"Verein 3",null,"Verein 4",null,"Verein 5",null,"Verein 6",{"$nulls":3},"Proberechnung bei Streifen:"]
[1,{"$f":"'Wettkampf 1'!B10","v":"Hans Gebken 3"},{"$f":"'Wettkampf 1'!C10","v":"Breddenb.-Heid. I"},300.7,null,{"$f":"IF(E10=\"x\",\"0\",D10)","v":300.7},{"$f":"IF(C10=$B$2,F10,0)","v":300.7},{"$f":"(IF(AND($E10=\"\",$C10=$B$2),1,0))","v":1},{"$f":"IF($C10=$B$3,F10,0)","v":0},{"$f":"(IF(AND($E10=\"\",$C10=$B$3),1,0))","v":0},{"$f":"IF($C10=$B$4,F10,0)","v":0},{"$f":"(IF(AND($E10=\"\",$C10=$B$4),1,0))","v":0},{"$f":"IF($C10=$B$5,F10,0)","v":0},{"$f":"(IF(AND($E10=\"\",$C10=$B$5),1,0))","v":0},{"$f":"IF($C10=$B$6,F10,0)","v":0},{"$f":"(IF(AND($E10=\"\",$C10=$B$6),1,0))","v":0},{"$f":"IF($C10=$B$7,F10,0)","v":0},{"$f":"(IF(AND($E10=\"\",$C10=$B$7),1,0))","v":0},null,null,100.3,100.1,100.3,{"$f":"U10+V10+W10","v":300.7},{"$f":"IF(X10=D10,1,0)","v":1},{"$f":"IF(X10=0,0,1)","v":1},{"$f":"IF(Y10+Z10=2,\"Korrekt\",\"\")","v":"Korrekt"}]
[2,{"$f":"'Wettkampf 1'!B11","v":"Gerd Vogel "},{"$f":"'Wettkampf 1'!C11","v":"Breddenb.-Heid. I"},310.9,null,{"$f":"IF(E11=\"x\",\"0\",D11)","v":310.9},{"$f":"IF(C11=$B$2,F11,0)","v":310.9},{"$f":"(IF(AND($E11=\"\",$C11=$B$2),1,0))","v":1},{"$f":"IF($C11=$B$3,F11,0)","v":0},{"$f":"(IF(AND($E11=\"\",$C11=$B$3),1,0))","v":0},{"$f":"IF($C11=$B$4,F11,0)","v":0},{"$f":"(IF(AND($E11=\"\",$C11=$B$4),1,0))","v":0},{"$f":"IF($C11=$B$5,F11,0)","v":0},{"$f":"(IF(AND($E11=\"\",$C11=$B$5),1,0))","v":0},{"$f":"IF($C11=$B$6,F11,0)","v":0},{"$f":"(IF(AND($E11=\"\",$C11=$B$6),1,0))","v":0},{"$f":"IF($C11=$B$7,F11,0)","v":0},{"$f":"(IF(AND($E11=\"\",$C11=$B$7),1,0))","v":0},null,null,103.5,{"v":105,"d":"105.0"},102.4,{"$f":"U11+V11+W11","v":310.9},{"$f":"IF(X11=D11,1,0)","v":1},{"$f":"IF(X11=0,0,1)","v":1},{"$f":"IF(Y11+Z11=2,\"Korrekt\",\"\")","v":"Korrekt"}]
[3,{"$f":"'Wettkampf 1'!B12","v":"Heinz Engbers"},{"$f":"'Wettkampf 1'!C12","v":"Breddenb.-Heid. I"},309.5,null,309.5,309.5,1,0,0,0,0,0,0,0,0,0,0,null,null,101.9,{"v":103,"d":"103.0"},104.6,309.5,1,1,"Korrekt"]
[4,{"$f":"'Wettkampf 1'!B13","v":"Willi Engbers"},{"$f":"'Wettkampf 1'!C13","v":"Breddenb.-Heid. I"},{"v":308,"d":"308.0"},null,{"v":308,"d":"308.0"},308,1,0,0,0,0,0,0,0,0,0,0,null,null,102.5,103.1,102.4,{"v":308,"d":"308.0"},1,1,"Korrekt"]
[5,{"$f":"'Wettkampf 1'!B14","v":"Hans Gebken 1"},{"$f":"'Wettkampf 1'!C14","v":"Breddenb.-Heid. I"},{"v":305,"d":"305.0"},"x","0","0",0,0,0,0,0,0,0,0,0,0,0,null,null,102.2,101.5,101.3,{"v":305,"d":"305.0"},1,1,"Korrekt"]
[6,{"$f":"'Wettkampf 1'!B15","v":"Philipp Schmidt"},{"$f":"'Wettkampf 1'!C15","v":"Ostenwalde II"},315.9,null,315.9,0,0,315.9,1,0,0,0,0,0,0,0,0,null,null,105.2,105.4,105.3,{"v":315.90000000000003,"d":"315.9"},1,1,"Korrekt"]
[7,{"$f":"'Wettkampf 1'!B16","v":"Philipp Scholübbers "},{"$f":"'Wettkampf 1'!C16","v":"Ostenwalde II"},314.1,null,314.1,0,0,314.1,1,0,0,0,0,0,0,0,0,null,null,104.3,104.5,105.3,314.1,1,1,"Korrekt"]
[8,{"$f":"'Wettkampf 1'!B17","v":"Matthias Brinkmann"},{"$f":"'Wettkampf 1'!C17","v":"Ostenwalde II"},{"v":303,"d":"303.0"},null,{"v":303,"d":"303.0"},0,0,303,1,0,0,0,0,0,0,0,0,null,null,100.1,99.2,103.7,{"v":303,"d":"303.0"},1,1,"Korrekt"]
[9,{"$f":"'Wettkampf 1'!B18","v":"Patrik Krüßel"},{"$f":"'Wettkampf 1'!C18","v":"Ostenwalde II"},312.8,null,312.8,0,0,312.8,1,0,0,0,0,0,0,0,0,null,null,102.6,104.1,106.1,{"v":312.79999999999995,"d":"312.8"},1,1,"Korrekt"]
[10,{"$f":"'Wettkampf 1'!B19","v":"Markus Jansen"},{"$f":"'Wettkampf 1'!C19","v":"Ostenwalde II"},311.1,"x","0",0,0,"0",0,0,0,0,0,0,0,0,0,null,null,103.6,103.7,103.8,311.1,1,1,"Korrekt"]
[11,{"$f":"'Wettkampf 1'!B20","v":"Helmut Benten "},{"$f":"'Wettkampf 1'!C20","v":"Ostenwalde II"},313.7,"x","0",0,0,"0",0,0,0,0,0,0,0,0,0,null,null,105.8,104.3,103.6,313.7,1,1,"Korrekt"]
[12,{"$f":"'Wettkampf 1'!B21","v":"Heinz Dirksen"},{"$f":"'Wettkampf 1'!C21","v":"Börgermoor II"},306.8,null,306.8,0,0,0,0,306.8,1,0,0,0,0,0,0,null,null,{"v":101,"d":"101.0"},103.4,102.4,306.8,1,1,"Korrekt"]
[13,{"$f":"'Wettkampf 1'!B22","v":"Hans Ortmann "},{"$f":"'Wettkampf 1'!C22","v":"Börgermoor II"},311.1,null,311.1,0,0,0,0,311.1,1,0,0,0,0,0,0,null,null,103.4,102.5,105.2,311.1,1,1,"Korrekt"]
[14,{"$f":"'Wettkampf 1'!B23","v":"Karl-Heinz Ortmann"},{"$f":"'Wettkampf 1'!C23","v":"Börgermoor II"},306.9,"x","0",0,0,0,0,"0",0,0,0,0,0,0,0,null,null,103.6,102.6,100.7,306.9,1,1,"Korrekt"]
[15,{"$f":"'Wettkampf 1'!B24","v":"Johannes Jansen"},{"$f":"'Wettkampf 1'!C24","v":"Börgermoor II"},308.3,null,308.3,0,0,0,0,308.3,1,0,0,0,0,0,0,null,null,101.6,102.9,103.8,308.3,1,1,"Korrekt"]
[16,{"$f":"'Wettkampf 1'!B25","v":"Kevin Minnert"},{"$f":"'Wettkampf 1'!C25","v":"Börgermoor II"},302.7,null,302.7,0,0,0,0,302.7,1,0,0,0,0,0,0,null,null,99.8,101.9,{"v":101,"d":"101.0"},302.7,1,1,"Korrekt"]
[17,{"$f":"'Wettkampf 1'!B26","v":"Daniel Schülke"},{"$f":"'Wettkampf 1'!C26","v":"Börgermoor II"},null,"x","0",0,0,0,0,"0",0,0,0,0,0,0,0,{"$nulls":5},{"v":0,"d":"0.0"},1,0,""]
[18,{"$f":"'Wettkampf 1'!B27","v":"Frank Wotte"},{"$f":"'Wettkampf 1'!C27","v":"Lorup III"},{"v":313,"d":"313.0"},null,{"v":313,"d":"313.0"},0,0,0,0,0,0,313,1,0,0,0,0,null,null,103.6,104.1,105.3,{"v":313,"d":"313.0"},1,1,"Korrekt"]
[19,{"$f":"'Wettkampf 1'!B28","v":"Johannes Wesseln"},{"$f":"'Wettkampf 1'!C28","v":"Lorup III"},308.8,null,308.8,0,0,0,0,0,0,308.8,1,0,0,0,0,null,null,103.7,103.2,101.9,308.8,1,1,"Korrekt"]
[20,{"$f":"'Wettkampf 1'!B29","v":"Anton Oldiges"},{"$f":"'Wettkampf 1'!C29","v":"Lorup III"},302.5,null,302.5,0,0,0,0,0,0,302.5,1,0,0,0,0,null,null,99.9,100.4,102.2,302.5,1,1,"Korrekt"]
[21,{"$f":"'Wettkampf 1'!B30","v":"Jürgen Will"},{"$f":"'Wettkampf 1'!C30","v":"Lorup III"},311.5,null,311.5,0,0,0,0,0,0,311.5,1,0,0,0,0,null,null,104.6,102.4,104.5,311.5,1,1,"Korrekt"]
[22,{"$f":"'Wettkampf 1'!B31","v":"Schütze 22"},{"$f":"'Wettkampf 1'!C31","v":"Lorup III"},null,"x","0",0,0,0,0,0,0,"0",0,0,0,0,0,{"$nulls":5},{"v":0,"d":"0.0"},1,0,""]
[23,{"$f":"'Wettkampf 1'!B32","v":"Schütze 23"},{"$f":"'Wettkampf 1'!C32","v":"Lorup III"},null,"x","0",0,0,0,0,0,0,"0",0,0,0,0,0,{"$nulls":5},{"v":0,"d":"0.0"},1,0,""]
[24,{"$f":"'Wettkampf 1'!B33","v":"Norbert Jansen"},{"$f":"'Wettkampf 1'!C33","v":"Breddenb.-Heid. III"},308.3,null,308.3,0,0,0,0,0,0,0,0,308.3,1,0,0,null,null,102.2,{"v":103,"d":"103.0"},103.1,{"v":308.29999999999995,"d":"308.3"},1,1,"Korrekt"]
[25,{"$f":"'Wettkampf 1'!B34","v":"Werner Jansen"},{"$f":"'Wettkampf 1'!C34","v":"Breddenb.-Heid. III"},309.7,null,309.7,0,0,0,0,0,0,0,0,309.7,1,0,0,null,null,102.8,103.4,103.5,309.7,1,1,"Korrekt"]
[26,{"$f":"'Wettkampf 1'!B35","v":"Alfons Plüster"},{"$f":"'Wettkampf 1'!C35","v":"Breddenb.-Heid. III"},301.5,"x","0",0,0,0,0,0,0,0,0,"0",0,0,0,null,null,99.3,100.8,101.4,301.5,1,1,"Korrekt"]
[27,{"$f":"'Wettkampf 1'!B36","v":"Johannes Oldiges"},{"$f":"'Wettkampf 1'!C36","v":"Breddenb.-Heid. III"},304.1,"x","0",0,0,0,0,0,0,0,0,"0",0,0,0,null,null,98.6,103.1,102.4,304.1,1,1,"Korrekt"]
[28,{"$f":"'Wettkampf 1'!B37","v":"Hans Plüster"},{"$f":"'Wettkampf 1'!C37","v":"Breddenb.-Heid. III"},309.6,null,309.6,0,0,0,0,0,0,0,0,309.6,1,0,0,null,null,103.9,102.5,103.2,309.6,1,1,"Korrekt"]
[29,{"$f":"'Wettkampf 1'!B38","v":"Josef Wübben "},{"$f":"'Wettkampf 1'!C38","v":"Breddenb.-Heid. III"},314.2,null,314.2,0,0,0,0,0,0,0,0,314.2,1,0,0,null,null,105.8,104.4,{"v":104,"d":"104.0"},314.2,1,1,"Korrekt"]
[30,{"$f":"'Wettkampf 1'!B39","v":"Thomas Niermann"},{"$f":"'Wettkampf 1'!C39","v":"Werlte III"},311.2,null,311.2,0,0,0,0,0,0,0,0,0,0,311.2,1,null,null,103.6,104.6,{"v":103,"d":"103.0"},311.2,1,1,"Korrekt"]
[31,{"$f":"'Wettkampf 1'!B40","v":"Bernd Thien"},{"$f":"'Wettkampf 1'!C40","v":"Werlte III"},315.1,null,315.1,0,0,0,0,0,0,0,0,0,0,315.1,1,null,null,105.9,104.5,104.7,{"$f":"U40+V40+W40","v":315.1},{"$f":"IF(X40=D40,1,0)","v":1},{"$f":"IF(X40=0,0,1)","v":1},{"$f":"IF(Y40+Z40=2,\"Korrekt\",\"\")","v":"Korrekt"}]
[32,{"$f":"'Wettkampf 1'!B41","v":"Norbert Grünloh "},{"$f":"'Wettkampf 1'!C41","v":"Werlte III"},311.3,null,311.3,0,0,0,0,0,0,0,0,0,0,311.3,1,null,null,103.4,102.6,105.3,311.3,1,1,"Korrekt"]
[33,{"$f":"'Wettkampf 1'!B42","v":"Andreas Thoben "},{"$f":"'Wettkampf 1'!C42","v":"Werlte III"},311.7,null,311.7,0,0,0,0,0,0,0,0,0,0,311.7,1,null,null,104.1,102.6,{"v":105,"d":"105.0"},311.7,1,1,"Korrekt"]
[34,{"$f":"'Wettkampf 1'!B43","v":"Hermann Krone "},{"$f":"'Wettkampf 1'!C43","v":"Werlte III"},307.4,"x","0",0,0,0,0,0,0,0,0,0,0,"0",0,null,null,100.3,103.9,103.2,307.4,1,1,"Korrekt"]
[35,{"$f":"'Wettkampf 1'!B44","v":"Michael Freitag "},{"$f":"'Wettkampf 1'!C44","v":"Werlte III"},{"v":311,"d":"311.0"},"x","0",0,0,0,0,0,0,0,0,0,0,"0",0,null,null,103.2,103.7,104.1,{"v":311,"d":"311.0"},1,1,"Korrekt"]
[36,{"$f":"'Wettkampf 1'!B45","v":"Joachim Niermann"},{"$f":"'Wettkampf 1'!C45","v":"Werlte III"},307.9,"x","0",0,0,0,0,0,0,0,0,0,0,"0",0,null,null,101.9,103.4,102.6,{"$f":"U45+V45+W45","v":307.9},{"$f":"IF(X45=D45,1,0)","v":1},{"$f":"IF(X45=0,0,1)","v":1},{"$f":"IF(Y45+Z45=2,\"Korrekt\",\"\")","v":"Korrekt"}]
[{"$nulls":6},{"$f":"LARGE(G10:G45,1)+LARGE(G10:G45,2)+LARGE(G10:G45,3)","v":928.4},{"$f":"SUM(H10:H45)","v":4},{"$f":"LARGE(I10:I45,1)+LARGE(I10:I45,2)+LARGE(I10:I45,3)","v":942.8},{"$f":"SUM(J10:J45)","v":4},{"$f":"LARGE(K10:K45,1)+LARGE(K10:K45,2)+LARGE(K10:K45,3)","v":926.2},{"$f":"SUM(L10:L45)","v":4},{"$f":"LARGE(M10:M45,1)+LARGE(M10:M45,2)+LARGE(M10:M45,3)","v":933.3},{"$f":"SUM(N10:N45)","v":4},{"$f":"LARGE(O10:O45,1)+LARGE(O10:O45,2)+LARGE(O10:O45,3)","v":933.5},{"$f":"SUM(P10:P45)","v":4},{"$f":"LARGE(Q10:Q45,1)+LARGE(Q10:Q45,2)+LARGE(Q10:Q45,3)","v":938.0999999999999},{"$f":"SUM(R10:S45)","v":4}]
[null,null,"per Email an: sk-huemmling@gmx.de"]

{"sheet":"3","index":3,"n_rows":47,"n_cols":27,"rows_kept":47,"merged":[[0,22,0,23],[1,22,1,23],[4,22,4,23],[5,22,5,23],[6,22,6,23],[8,20,8,23]]}
[null,"Verein / Gruppe",null,"Ergebnisse",{"$nulls":17},"Austragungsort:",{"$f":"Übersicht!F4","v":"Börgermoor"}]
[1,{"$f":"'Wettkampf 1'!B2","v":"Breddenb.-Heid. I"},null,{"$f":"G46","v":{"v":927.6999999999999,"d":"927.7"}},{"$f":"IF(H46>4,\"Es sind zu viele Schützen in Wertung!\",\" \")","v":" "},{"$nulls":16},"Wettkampftag:",{"$f":"Übersicht!F3","v":"20.10."}]
[2,{"$f":"'Wettkampf 1'!B3","v":"Ostenwalde II"},null,{"$f":"I46","v":{"v":945.0999999999999,"d":"945.1"}},{"$f":"IF(J46>4,\"Es sind zu viele Schützen in Wertung!\",\" \")","v":" "}]
[3,{"$f":"'Wettkampf 1'!B4","v":"Börgermoor II"},null,{"$f":"K46","v":{"v":936,"d":"936.0"}},{"$f":"IF(L46>4,\"Es sind zu viele Schützen in Wertung!\",\" \")","v":" "},{"$nulls":18},"Ansprechpartner für Rückfragen:"]
[4,{"$f":"'Wettkampf 1'!B5","v":"Lorup III"},null,{"$f":"M46","v":938.5},{"$f":"IF(N46>4,\"Es sind zu viele Schützen in Wertung!\",\" \")","v":" "},{"$nulls":16},"Name:","Hans Jansen"]
[5,{"$f":"'Wettkampf 1'!B6","v":"Breddenb.-Heid. III"},null,{"$f":"O46","v":{"v":935.1999999999999,"d":"935.2"}},{"$f":"IF(P46>4,\"Es sind zu viele Schützen in Wertung!\",\" \")","v":" "},{"$nulls":16},"Tel:"]
[6,{"$f":"'Wettkampf 1'!B7","v":"Werlte III"},null,{"$f":"Q46","v":943.1},{"$f":"IF(R46>4,\"Es sind zu viele Schützen in Wertung!\",\" \")","v":" "},{"$nulls":16},"Standaufsicht:","Hans Jansen"]
[]
[null,"Einzelergebnisse:","Verein / Gruppe","Ergebnisse (mindestens 0 eintragen)","AW? Dann x eintippen",null,"Verein 1",null,"Verein 2",null,"Verein 3",null,"Verein 4",null,"Verein 5",null,"Verein 6",{"$nulls":3},"Proberechnung bei Streifen:"]
[1,{"$f":"'Wettkampf 1'!B10","v":"Hans Gebken 3"},{"$f":"'Wettkampf 1'!C10","v":"Breddenb.-Heid. I"},304.1,null,{"$f":"IF(E10=\"x\",\"0\",D10)","v":304.1},{"$f":"IF(C10=$B$2,F10,0)","v":304.1},{"$f":"(IF(AND($E10=\"\",$C10=$B$2),1,0))","v":1},{"$f":"IF($C10=$B$3,F10,0)","v":0},{"$f":"(IF(AND($E10=\"\",$C10=$B$3),1,0))","v":0},{"$f":"IF($C10=$B$4,F10,0)","v":0},{"$f":"(IF(AND($E10=\"\",$C10=$B$4),1,0))","v":0},{"$f":"IF($C10=$B$5,F10,0)","v":0},{"$f":"(IF(AND($E10=\"\",$C10=$B$5),1,0))","v":0},{"$f":"IF($C10=$B$6,F10,0)","v":0},{"$f":"(IF(AND($E10=\"\",$C10=$B$6),1,0))","v":0},{"$f":"IF($C10=$B$7,F10,0)","v":0},{"$f":"(IF(AND($E10=\"\",$C10=$B$7),1,0))","v":0},null,null,101.2,102.3,100.6,{"$f":"U10+V10+W10","v":304.1},{"$f":"IF(X10=D10,1,0)","v":1},{"$f":"IF(X10=0,0,1)","v":1},{"$f":"IF(Y10+Z10=2,\"Korrekt\",\"\")","v":"Korrekt"}]
[2,{"$f":"'Wettkampf 1'!B11","v":"Gerd Vogel "},{"$f":"'Wettkampf 1'!C11","v":"Breddenb.-Heid. I"},313.1,null,{"$f":"IF(E11=\"x\",\"0\",D11)","v":313.1},{"$f":"IF(C11=$B$2,F11,0)","v":313.1},{"$f":"(IF(AND($E11=\"\",$C11=$B$2),1,0))","v":1},{"$f":"IF($C11=$B$3,F11,0)","v":0},{"$f":"(IF(AND($E11=\"\",$C11=$B$3),1,0))","v":0},{"$f":"IF($C11=$B$4,F11,0)","v":0},{"$f":"(IF(AND($E11=\"\",$C11=$B$4),1,0))","v":0},{"$f":"IF($C11=$B$5,F11,0)","v":0},{"$f":"(IF(AND($E11=\"\",$C11=$B$5),1,0))","v":0},{"$f":"IF($C11=$B$6,F11,0)","v":0},{"$f":"(IF(AND($E11=\"\",$C11=$B$6),1,0))","v":0},{"$f":"IF($C11=$B$7,F11,0)","v":0},{"$f":"(IF(AND($E11=\"\",$C11=$B$7),1,0))","v":0},null,null,104.5,104.3,104.3,{"$f":"U11+V11+W11","v":313.1},{"$f":"IF(X11=D11,1,0)","v":1},{"$f":"IF(X11=0,0,1)","v":1},{"$f":"IF(Y11+Z11=2,\"Korrekt\",\"\")","v":"Korrekt"}]
[3,{"$f":"'Wettkampf 1'!B12","v":"Heinz Engbers"},{"$f":"'Wettkampf 1'!C12","v":"Breddenb.-Heid. I"},305.4,null,305.4,305.4,1,0,0,0,0,0,0,0,0,0,0,null,null,101.5,104.4,99.5,305.4,1,1,"Korrekt"]
[4,{"$f":"'Wettkampf 1'!B13","v":"Willi Engbers"},{"$f":"'Wettkampf 1'!C13","v":"Breddenb.-Heid. I"},309.2,null,309.2,309.2,1,0,0,0,0,0,0,0,0,0,0,null,null,102.2,103.8,103.2,309.2,1,1,"Korrekt"]
[5,{"$f":"'Wettkampf 1'!B14","v":"Hans Gebken 1"},{"$f":"'Wettkampf 1'!C14","v":"Breddenb.-Heid. I"},297.1,"x","0","0",0,0,0,0,0,0,0,0,0,0,0,null,null,97.4,{"v":97,"d":"97.0"},102.7,297.1,1,1,"Korrekt"]
[6,{"$f":"'Wettkampf 1'!B15","v":"Philipp Schmidt"},{"$f":"'Wettkampf 1'!C15","v":"Ostenwalde II"},315.4,null,315.4,0,0,315.4,1,0,0,0,0,0,0,0,0,null,null,105.8,104.2,105.4,315.4,1,1,"Korrekt"]
[7,{"$f":"'Wettkampf 1'!B16","v":"Philipp Scholübbers "},{"$f":"'Wettkampf 1'!C16","v":"Ostenwalde II"},315.4,null,315.4,0,0,315.4,1,0,0,0,0,0,0,0,0,null,null,104.9,105.2,105.3,{"v":315.40000000000003,"d":"315.4"},1,1,"Korrekt"]
[8,{"$f":"'Wettkampf 1'!B17","v":"Matthias Brinkmann"},{"$f":"'Wettkampf 1'!C17","v":"Ostenwalde II"},{"v":305,"d":"305.0"},"x","0",0,0,"0",0,0,0,0,0,0,0,0,0,null,null,100.7,102.1,102.2,{"v":305,"d":"305.0"},1,1,"Korrekt"]
[9,{"$f":"'Wettkampf 1'!B18","v":"Patrik Krüßel"},{"$f":"'Wettkampf 1'!C18","v":"Ostenwalde II"},314.3,null,314.3,0,0,314.3,1,0,0,0,0,0,0,0,0,null,null,104.3,105.6,104.4,{"v":314.29999999999995,"d":"314.3"},1,1,"Korrekt"]
[10,{"$f":"'Wettkampf 1'!B19","v":"Markus Jansen"},{"$f":"'Wettkampf 1'!C19","v":"Ostenwalde II"},310.7,"x","0",0,0,"0",0,0,0,0,0,0,0,0,0,null,null,{"v":103,"d":"103.0"},104.3,103.4,{"v":310.70000000000005,"d":"310.7"},1,1,"Korrekt"]
[11,{"$f":"'Wettkampf 1'!B20","v":"Helmut Benten "},{"$f":"'Wettkampf 1'!C20","v":"Ostenwalde II"},306.2,null,306.2,0,0,306.2,1,0,0,0,0,0,0,0,0,null,null,{"v":103,"d":"103.0"},100.9,102.3,306.2,1,1,"Korrekt"]
[12,{"$f":"'Wettkampf 1'!B21","v":"Heinz Dirksen"},{"$f":"'Wettkampf 1'!C21","v":"Börgermoor II"},307.1,null,307.1,0,0,0,0,307.1,1,0,0,0,0,0,0,null,null,101.8,102.2,103.1,307.1,1,1,"Korrekt"]
[13,{"$f":"'Wettkampf 1'!B22","v":"Hans Ortmann "},{"$f":"'Wettkampf 1'!C22","v":"Börgermoor II"},310.2,null,310.2,0,0,0,0,310.2,1,0,0,0,0,0,0,null,null,102.8,103.2,104.2,310.2,1,1,"Korrekt"]
[14,{"$f":"'Wettkampf 1'!B23","v":"Karl-Heinz Ortmann"},{"$f":"'Wettkampf 1'!C23","v":"Börgermoor II"},312.2,null,312.2,0,0,0,0,312.2,1,0,0,0,0,0,0,null,null,{"v":102,"d":"102.0"},104.5,105.7,312.2,1,1,"Korrekt"]
[15,{"$f":"'Wettkampf 1'!B24","v":"Johannes Jansen"},{"$f":"'Wettkampf 1'!C24","v":"Börgermoor II"},313.6,null,313.6,0,0,0,0,313.6,1,0,0,0,0,0,0,null,null,{"v":104,"d":"104.0"},105.2,104.4,313.6,1,1,"Korrekt"]
[16,{"$f":"'Wettkampf 1'!B25","v":"Kevin Minnert"},{"$f":"'Wettkampf 1'!C25","v":"Börgermoor II"},305.3,"x","0",0,0,0,0,"0",0,0,0,0,0,0,0,null,null,100.9,103.7,100.7,305.3,1,1,"Korrekt"]
[17,{"$f":"'Wettkampf 1'!B26","v":"Daniel Schülke"},{"$f":"'Wettkampf 1'!C26","v":"Börgermoor II"},303.1,"x","0",0,0,0,0,"0",0,0,0,0,0,0,0,null,null,99.1,101.5,102.5,303.1,1,1,"Korrekt"]
[18,{"$f":"'Wettkampf 1'!B27","v":"Frank Wotte"},{"$f":"'Wettkampf 1'!C27","v":"Lorup III"},314.5,null,314.5,0,0,0,0,0,0,314.5,1,0,0,0,0,null,null,104.8,104.8,104.9,314.5,1,1,"Korrekt"]
[19,{"$f":"'Wettkampf 1'!B28","v":"Johannes Wesseln"},{"$f":"'Wettkampf 1'!C28","v":"Lorup III"},311.5,null,311.5,0,0,0,0,0,0,311.5,1,0,0,0,0,null,null,102.5,104.4,104.6,311.5,1,1,"Korrekt"]
[20,{"$f":"'Wettkampf 1'!B29","v":"Anton Oldiges"},{"$f":"'Wettkampf 1'!C29","v":"Lorup III"},{"v":311,"d":"311.0"},null,{"v":311,"d":"311.0"},0,0,0,0,0,0,311,1,0,0,0,0,null,null,{"v":104,"d":"104.0"},103.9,103.1,{"v":311,"d":"311.0"},1,1,"Korrekt"]
[21,{"$f":"'Wettkampf 1'!B30","v":"Jürgen Will"},{"$f":"'Wettkampf 1'!C30","v":"Lorup III"},312.5,null,312.5,0,0,0,0,0,0,312.5,1,0,0,0,0,null,null,105.6,103.2,103.7,312.5,1,1,"Korrekt"]
[22,{"$f":"'Wettkampf 1'!B31","v":"Schütze 22"},{"$f":"'Wettkampf 1'!C31","v":"Lorup III"},null,"x","0",0,0,0,0,0,0,"0",0,0,0,0,0,{"$nulls":5},{"v":0,"d":"0.0"},1,0,""]
[23,{"$f":"'Wettkampf 1'!B32","v":"Schütze 23"},{"$f":"'Wettkampf 1'!C32","v":"Lorup III"},null,"x","0",0,0,0,0,0,0,"0",0,0,0,0,0,{"$nulls":5},{"v":0,"d":"0.0"},1,0,""]
[24,{"$f":"'Wettkampf 1'!B33","v":"Norbert Jansen"},{"$f":"'Wettkampf 1'!C33","v":"Breddenb.-Heid. III"},{"v":311,"d":"311.0"},null,{"v":311,"d":"311.0"},0,0,0,0,0,0,0,0,311,1,0,0,null,null,103.2,103.2,104.6,{"v":311,"d":"311.0"},1,1,"Korrekt"]
[25,{"$f":"'Wettkampf 1'!B34","v":"Werner Jansen"},{"$f":"'Wettkampf 1'!C34","v":"Breddenb.-Heid. III"},309.4,null,309.4,0,0,0,0,0,0,0,0,309.4,1,0,0,null,null,102.8,103.1,103.5,309.4,1,1,"Korrekt"]
[26,{"$f":"'Wettkampf 1'!B35","v":"Alfons Plüster"},{"$f":"'Wettkampf 1'!C35","v":"Breddenb.-Heid. III"},302.1,"x","0",0,0,0,0,0,0,0,0,"0",0,0,0,null,null,98.4,101.3,102.4,302.1,1,1,"Korrekt"]
[27,{"$f":"'Wettkampf 1'!B36","v":"Johannes Oldiges"},{"$f":"'Wettkampf 1'!C36","v":"Breddenb.-Heid. III"},307.6,"x","0",0,0,0,0,0,0,0,0,"0",0,0,0,null,null,102.3,101.8,103.5,307.6,1,1,"Korrekt"]
[28,{"$f":"'Wettkampf 1'!B37","v":"Hans Plüster"},{"$f":"'Wettkampf 1'!C37","v":"Breddenb.-Heid. III"},314.8,null,314.8,0,0,0,0,0,0,0,0,314.8,1,0,0,null,null,104.7,{"v":104,"d":"104.0"},106.1,{"v":314.79999999999995,"d":"314.8"},1,1,"Korrekt"]
[29,{"$f":"'Wettkampf 1'!B38","v":"Josef Wübben "},{"$f":"'Wettkampf 1'!C38","v":"Breddenb.-Heid. III"},306.2,null,306.2,0,0,0,0,0,0,0,0,306.2,1,0,0,null,null,102.3,102.8,101.1,306.2,1,1,"Korrekt"]
[30,{"$f":"'Wettkampf 1'!B39","v":"Thomas Niermann"},{"$f":"'Wettkampf 1'!C39","v":"Werlte III"},313.6,null,313.6,0,0,0,0,0,0,0,0,0,0,313.6,1,null,null,103.7,104.3,105.6,313.6,1,1,"Korrekt"]
[31,{"$f":"'Wettkampf 1'!B40","v":"Bernd Thien"},{"$f":"'Wettkampf 1'!C40","v":"Werlte III"},314.4,null,314.4,0,0,0,0,0,0,0,0,0,0,314.4,1,null,null,105.5,105.1,103.8,314.4,1,1,"Korrekt"]
[32,{"$f":"'Wettkampf 1'!B41","v":"Norbert Grünloh "},{"$f":"'Wettkampf 1'!C41","v":"Werlte III"},315.1,null,315.1,0,0,0,0,0,0,0,0,0,0,315.1,1,null,null,104.9,104.7,105.5,315.1,1,1,"Korrekt"]
[33,{"$f":"'Wettkampf 1'!B42","v":"Andreas Thoben "},{"$f":"'Wettkampf 1'!C42","v":"Werlte III"},313.4,"x","0",0,0,0,0,0,0,0,0,0,0,"0",0,null,null,103.9,105.4,104.1,313.4,1,1,"Korrekt"]
[34,{"$f":"'Wettkampf 1'!B43","v":"Hermann Krone "},{"$f":"'Wettkampf 1'!C43","v":"Werlte III"},311.6,"x","0",0,0,0,0,0,0,0,0,0,0,"0",0,null,null,105.4,103.9,102.3,311.6,1,1,"Korrekt"]
[35,{"$f":"'Wettkampf 1'!B44","v":"Michael Freitag "},{"$f":"'Wettkampf 1'!C44","v":"Werlte III"},306.8,"x","0",0,0,0,0,0,0,0,0,0,0,"0",0,null,null,99.9,102.9,{"v":104,"d":"104.0"},306.8,1,1,"Korrekt"]
[36,{"$f":"'Wettkampf 1'!B45","v":"Joachim Niermann"},{"$f":"'Wettkampf 1'!C45","v":"Werlte III"},305.3,"x","0",0,0,0,0,0,0,0,0,0,0,"0",0,null,null,101.4,101.2,102.7,305.3,1,1,"Korrekt"]
[{"$nulls":6},{"$f":"LARGE(G10:G45,1)+LARGE(G10:G45,2)+LARGE(G10:G45,3)","v":927.6999999999999},{"$f":"SUM(H10:H45)","v":4},{"$f":"LARGE(I10:I45,1)+LARGE(I10:I45,2)+LARGE(I10:I45,3)","v":945.0999999999999},{"$f":"SUM(J10:J45)","v":4},{"$f":"LARGE(K10:K45,1)+LARGE(K10:K45,2)+LARGE(K10:K45,3)","v":936},{"$f":"SUM(L10:L45)","v":4},{"$f":"LARGE(M10:M45,1)+LARGE(M10:M45,2)+LARGE(M10:M45,3)","v":938.5},{"$f":"SUM(N10:N45)","v":4},{"$f":"LARGE(O10:O45,1)+LARGE(O10:O45,2)+LARGE(O10:O45,3)","v":935.1999999999999},{"$f":"SUM(P10:P45)","v":4},{"$f":"LARGE(Q10:Q45,1)+LARGE(Q10:Q45,2)+LARGE(Q10:Q45,3)","v":943.1},{"$f":"SUM(R10:S45)","v":3}]
[null,null,"per Email an: sk-huemmling@gmx.de"]

{"sheet":"4","index":4,"n_rows":47,"n_cols":27,"rows_kept":47,"merged":[[0,22,0,23],[1,22,1,23],[4,22,4,23],[5,22,5,23],[6,22,6,23],[8,20,8,23]]}
[null,"Verein / Gruppe",null,"Ergebnisse",{"$nulls":17},"Austragungsort:",{"$f":"Übersicht!G4","v":"Lorup"}]
[1,{"$f":"'Wettkampf 1'!B2","v":"Breddenb.-Heid. I"},null,{"$f":"G46","v":929.8},{"$f":"IF(H46>4,\"Es sind zu viele Schützen in Wertung!\",\" \")","v":" "},{"$nulls":16},"Wettkampftag:",{"$f":"Übersicht!G3","v":"10.11."}]
[2,{"$f":"'Wettkampf 1'!B3","v":"Ostenwalde II"},null,{"$f":"I46","v":933.7},{"$f":"IF(J46>4,\"Es sind zu viele Schützen in Wertung!\",\" \")","v":" "}]
[3,{"$f":"'Wettkampf 1'!B4","v":"Börgermoor II"},null,{"$f":"K46","v":{"v":929.4000000000001,"d":"929.4"}},{"$f":"IF(L46>4,\"Es sind zu viele Schützen in Wertung!\",\" \")","v":" "},{"$nulls":18},"Ansprechpartner für Rückfragen:"]
[4,{"$f":"'Wettkampf 1'!B5","v":"Lorup III"},null,{"$f":"M46","v":937.2},{"$f":"IF(N46>4,\"Es sind zu viele Schützen in Wertung!\",\" \")","v":" "},{"$nulls":16},"Name:"]
[5,{"$f":"'Wettkampf 1'!B6","v":"Breddenb.-Heid. III"},null,{"$f":"O46","v":{"v":930,"d":"930.0"}},{"$f":"IF(P46>4,\"Es sind zu viele Schützen in Wertung!\",\" \")","v":" "},{"$nulls":16},"Tel:"]
[6,{"$f":"'Wettkampf 1'!B7","v":"Werlte III"},null,{"$f":"Q46","v":938.8},{"$f":"IF(R46>4,\"Es sind zu viele Schützen in Wertung!\",\" \")","v":" "},{"$nulls":16},"Standaufsicht:","Wesseln Johannes"]
[]
[null,"Einzelergebnisse:","Verein / Gruppe","Ergebnisse (mindestens 0 eintragen)","AW? Dann x eintippen",null,"Verein 1",null,"Verein 2",null,"Verein 3",null,"Verein 4",null,"Verein 5",null,"Verein 6",{"$nulls":3},"Proberechnung bei Streifen:"]
[1,{"$f":"'Wettkampf 1'!B10","v":"Hans Gebken 3"},{"$f":"'Wettkampf 1'!C10","v":"Breddenb.-Heid. I"},304.5,null,{"$f":"IF(E10=\"x\",\"0\",D10)","v":304.5},{"$f":"IF(C10=$B$2,F10,0)","v":304.5},{"$f":"(IF(AND($E10=\"\",$C10=$B$2),1,0))","v":1},{"$f":"IF($C10=$B$3,F10,0)","v":0},{"$f":"(IF(AND($E10=\"\",$C10=$B$3),1,0))","v":0},{"$f":"IF($C10=$B$4,F10,0)","v":0},{"$f":"(IF(AND($E10=\"\",$C10=$B$4),1,0))","v":0},{"$f":"IF($C10=$B$5,F10,0)","v":0},{"$f":"(IF(AND($E10=\"\",$C10=$B$5),1,0))","v":0},{"$f":"IF($C10=$B$6,F10,0)","v":0},{"$f":"(IF(AND($E10=\"\",$C10=$B$6),1,0))","v":0},{"$f":"IF($C10=$B$7,F10,0)","v":0},{"$f":"(IF(AND($E10=\"\",$C10=$B$7),1,0))","v":0},{"$nulls":5},{"$f":"U10+V10+W10","v":{"v":0,"d":"0.0"}},{"$f":"IF(X10=D10,1,0)","v":0},{"$f":"IF(X10=0,0,1)","v":0},{"$f":"IF(Y10+Z10=2,\"Korrekt\",\"\")","v":""}]
[2,{"$f":"'Wettkampf 1'!B11","v":"Gerd Vogel "},{"$f":"'Wettkampf 1'!C11","v":"Breddenb.-Heid. I"},312.6,null,{"$f":"IF(E11=\"x\",\"0\",D11)","v":312.6},{"$f":"IF(C11=$B$2,F11,0)","v":312.6},{"$f":"(IF(AND($E11=\"\",$C11=$B$2),1,0))","v":1},{"$f":"IF($C11=$B$3,F11,0)","v":0},{"$f":"(IF(AND($E11=\"\",$C11=$B$3),1,0))","v":0},{"$f":"IF($C11=$B$4,F11,0)","v":0},{"$f":"(IF(AND($E11=\"\",$C11=$B$4),1,0))","v":0},{"$f":"IF($C11=$B$5,F11,0)","v":0},{"$f":"(IF(AND($E11=\"\",$C11=$B$5),1,0))","v":0},{"$f":"IF($C11=$B$6,F11,0)","v":0},{"$f":"(IF(AND($E11=\"\",$C11=$B$6),1,0))","v":0},{"$f":"IF($C11=$B$7,F11,0)","v":0},{"$f":"(IF(AND($E11=\"\",$C11=$B$7),1,0))","v":0},{"$nulls":5},{"$f":"U11+V11+W11","v":{"v":0,"d":"0.0"}},{"$f":"IF(X11=D11,1,0)","v":0},{"$f":"IF(X11=0,0,1)","v":0},{"$f":"IF(Y11+Z11=2,\"Korrekt\",\"\")","v":""}]
[3,{"$f":"'Wettkampf 1'!B12","v":"Heinz Engbers"},{"$f":"'Wettkampf 1'!C12","v":"Breddenb.-Heid. I"},307.8,null,307.8,307.8,1,0,0,0,0,0,0,0,0,0,0,{"$nulls":5},{"v":0,"d":"0.0"},0,0,""]
[4,{"$f":"'Wettkampf 1'!B13","v":"Willi Engbers"},{"$f":"'Wettkampf 1'!C13","v":"Breddenb.-Heid. I"},309.4,null,309.4,309.4,1,0,0,0,0,0,0,0,0,0,0,{"$nulls":5},{"v":0,"d":"0.0"},0,0,""]
[5,{"$f":"'Wettkampf 1'!B14","v":"Hans Gebken 1"},{"$f":"'Wettkampf 1'!C14","v":"Breddenb.-Heid. I"},303.4,"x","0","0",0,0,0,0,0,0,0,0,0,0,0,{"$nulls":5},{"v":0,"d":"0.0"},0,0,""]
[6,{"$f":"'Wettkampf 1'!B15","v":"Philipp Schmidt"},{"$f":"'Wettkampf 1'!C15","v":"Ostenwalde II"},310.2,null,310.2,0,0,310.2,1,0,0,0,0,0,0,0,0,{"$nulls":5},{"v":0,"d":"0.0"},0,0,""]
[7,{"$f":"'Wettkampf 1'!B16","v":"Philipp Scholübbers "},{"$f":"'Wettkampf 1'!C16","v":"Ostenwalde II"},312.4,null,312.4,0,0,312.4,1,0,0,0,0,0,0,0,0,{"$nulls":5},{"v":0,"d":"0.0"},0,0,""]
[8,{"$f":"'Wettkampf 1'!B17","v":"Matthias Brinkmann"},{"$f":"'Wettkampf 1'!C17","v":"Ostenwalde II"},308.1,"x","0",0,0,"0",0,0,0,0,0,0,0,0,0,{"$nulls":5},{"v":0,"d":"0.0"},0,0,""]
[9,{"$f":"'Wettkampf 1'!B18","v":"Patrik Krüßel"},{"$f":"'Wettkampf 1'!C18","v":"Ostenwalde II"},311.1,null,311.1,0,0,311.1,1,0,0,0,0,0,0,0,0,{"$nulls":5},{"v":0,"d":"0.0"},0,0,""]
[10,{"$f":"'Wettkampf 1'!B19","v":"Markus Jansen"},{"$f":"'Wettkampf 1'!C19","v":"Ostenwalde II"},308.3,null,308.3,0,0,308.3,1,0,0,0,0,0,0,0,0,{"$nulls":5},{"v":0,"d":"0.0"},0,0,""]
[11,{"$f":"'Wettkampf 1'!B20","v":"Helmut Benten "},{"$f":"'Wettkampf 1'!C20","v":"Ostenwalde II"},303.4,"x","0",0,0,"0",0,0,0,0,0,0,0,0,0,{"$nulls":5},{"v":0,"d":"0.0"},0,0,""]
[12,{"$f":"'Wettkampf 1'!B21","v":"Heinz Dirksen"},{"$f":"'Wettkampf 1'!C21","v":"Börgermoor II"},307.7,null,307.7,0,0,0,0,307.7,1,0,0,0,0,0,0,{"$nulls":5},{"v":0,"d":"0.0"},0,0,""]
[13,{"$f":"'Wettkampf 1'!B22","v":"Hans Ortmann "},{"$f":"'Wettkampf 1'!C22","v":"Börgermoor II"},311.1,null,311.1,0,0,0,0,311.1,1,0,0,0,0,0,0,{"$nulls":5},{"v":0,"d":"0.0"},0,0,""]
[14,{"$f":"'Wettkampf 1'!B23","v":"Karl-Heinz Ortmann"},{"$f":"'Wettkampf 1'!C23","v":"Börgermoor II"},309.3,null,309.3,0,0,0,0,309.3,1,0,0,0,0,0,0,{"$nulls":5},{"v":0,"d":"0.0"},0,0,""]
[15,{"$f":"'Wettkampf 1'!B24","v":"Johannes Jansen"},{"$f":"'Wettkampf 1'!C24","v":"Börgermoor II"},{"v":309,"d":"309.0"},null,{"v":309,"d":"309.0"},0,0,0,0,309,1,0,0,0,0,0,0,{"$nulls":5},{"v":0,"d":"0.0"},0,0,""]
[16,{"$f":"'Wettkampf 1'!B25","v":"Kevin Minnert"},{"$f":"'Wettkampf 1'!C25","v":"Börgermoor II"},{"v":294,"d":"294.0"},"x","0",0,0,0,0,"0",0,0,0,0,0,0,0,{"$nulls":5},{"v":0,"d":"0.0"},0,0,""]
[17,{"$f":"'Wettkampf 1'!B26","v":"Daniel Schülke"},{"$f":"'Wettkampf 1'!C26","v":"Börgermoor II"},292.3,"x","0",0,0,0,0,"0",0,0,0,0,0,0,0,{"$nulls":5},{"v":0,"d":"0.0"},0,0,""]
[18,{"$f":"'Wettkampf 1'!B27","v":"Frank Wotte"},{"$f":"'Wettkampf 1'!C27","v":"Lorup III"},314.5,null,314.5,0,0,0,0,0,0,314.5,1,0,0,0,0,{"$nulls":5},{"v":0,"d":"0.0"},0,0,""]
[19,{"$f":"'Wettkampf 1'!B28","v":"Johannes Wesseln"},{"$f":"'Wettkampf 1'!C28","v":"Lorup III"},310.2,null,310.2,0,0,0,0,0,0,310.2,1,0,0,0,0,{"$nulls":5},{"v":0,"d":"0.0"},0,0,""]
[20,{"$f":"'Wettkampf 1'!B29","v":"Anton Oldiges"},{"$f":"'Wettkampf 1'!C29","v":"Lorup III"},306.7,null,306.7,0,0,0,0,0,0,306.7,1,0,0,0,0,{"$nulls":5},{"v":0,"d":"0.0"},0,0,""]
[21,{"$f":"'Wettkampf 1'!B30","v":"Jürgen Will"},{"$f":"'Wettkampf 1'!C30","v":"Lorup III"},312.5,null,312.5,0,0,0,0,0,0,312.5,1,0,0,0,0,{"$nulls":5},{"v":0,"d":"0.0"},0,0,""]
[22,{"$f":"'Wettkampf 1'!B31","v":"Schütze 22"},{"$f":"'Wettkampf 1'!C31","v":"Lorup III"},null,"x","0",0,0,0,0,0,0,"0",0,0,0,0,0,{"$nulls":5},{"v":0,"d":"0.0"},1,0,""]
[23,{"$f":"'Wettkampf 1'!B32","v":"Schütze 23"},{"$f":"'Wettkampf 1'!C32","v":"Lorup III"},null,"x","0",0,0,0,0,0,0,"0",0,0,0,0,0,{"$nulls":5},{"v":0,"d":"0.0"},1,0,""]
[24,{"$f":"'Wettkampf 1'!B33","v":"Norbert Jansen"},{"$f":"'Wettkampf 1'!C33","v":"Breddenb.-Heid. III"},{"v":308,"d":"308.0"},null,{"v":308,"d":"308.0"},0,0,0,0,0,0,0,0,308,1,0,0,{"$nulls":5},{"v":0,"d":"0.0"},0,0,""]
[25,{"$f":"'Wettkampf 1'!B34","v":"Werner Jansen"},{"$f":"'Wettkampf 1'!C34","v":"Breddenb.-Heid. III"},305.8,null,305.8,0,0,0,0,0,0,0,0,305.8,1,0,0,{"$nulls":5},{"v":0,"d":"0.0"},0,0,""]
[26,{"$f":"'Wettkampf 1'!B35","v":"Alfons Plüster"},{"$f":"'Wettkampf 1'!C35","v":"Breddenb.-Heid. III"},301.6,"x","0",0,0,0,0,0,0,0,0,"0",0,0,0,{"$nulls":5},{"v":0,"d":"0.0"},0,0,""]
[27,{"$f":"'Wettkampf 1'!B36","v":"Johannes Oldiges"},{"$f":"'Wettkampf 1'!C36","v":"Breddenb.-Heid. III"},{"v":305,"d":"305.0"},"x","0",0,0,0,0,0,0,0,0,"0",0,0,0,{"$nulls":5},{"v":0,"d":"0.0"},0,0,""]
[28,{"$f":"'Wettkampf 1'!B37","v":"Hans Plüster"},{"$f":"'Wettkampf 1'!C37","v":"Breddenb.-Heid. III"},312.2,null,312.2,0,0,0,0,0,0,0,0,312.2,1,0,0,{"$nulls":5},{"v":0,"d":"0.0"},0,0,""]
[29,{"$f":"'Wettkampf 1'!B38","v":"Josef Wübben "},{"$f":"'Wettkampf 1'!C38","v":"Breddenb.-Heid. III"},309.8,null,309.8,0,0,0,0,0,0,0,0,309.8,1,0,0,{"$nulls":5},{"v":0,"d":"0.0"},0,0,""]
[30,{"$f":"'Wettkampf 1'!B39","v":"Thomas Niermann"},{"$f":"'Wettkampf 1'!C39","v":"Werlte III"},310.1,"x","0",0,0,0,0,0,0,0,0,0,0,"0",0,{"$nulls":5},{"v":0,"d":"0.0"},0,0,""]
[31,{"$f":"'Wettkampf 1'!B40","v":"Bernd Thien"},{"$f":"'Wettkampf 1'!C40","v":"Werlte III"},311.9,null,311.9,0,0,0,0,0,0,0,0,0,0,311.9,1,{"$nulls":5},{"v":0,"d":"0.0"},0,0,""]
[32,{"$f":"'Wettkampf 1'!B41","v":"Norbert Grünloh "},{"$f":"'Wettkampf 1'!C41","v":"Werlte III"},{"v":313,"d":"313.0"},null,{"v":313,"d":"313.0"},0,0,0,0,0,0,0,0,0,0,313,1,{"$nulls":5},{"v":0,"d":"0.0"},0,0,""]
[33,{"$f":"'Wettkampf 1'!B42","v":"Andreas Thoben "},{"$f":"'Wettkampf 1'!C42","v":"Werlte III"},313.9,null,313.9,0,0,0,0,0,0,0,0,0,0,313.9,1,{"$nulls":5},{"v":0,"d":"0.0"},0,0,""]
[34,{"$f":"'Wettkampf 1'!B43","v":"Hermann Krone "},{"$f":"'Wettkampf 1'!C43","v":"Werlte III"},304.3,null,304.3,0,0,0,0,0,0,0,0,0,0,304.3,1,{"$nulls":5},{"v":0,"d":"0.0"},0,0,""]
[35,{"$f":"'Wettkampf 1'!B44","v":"Michael Freitag "},{"$f":"'Wettkampf 1'!C44","v":"Werlte III"},313.1,"x","0",0,0,0,0,0,0,0,0,0,0,"0",0,{"$nulls":5},{"v":0,"d":"0.0"},0,0,""]
[36,{"$f":"'Wettkampf 1'!B45","v":"Joachim Niermann"},{"$f":"'Wettkampf 1'!C45","v":"Werlte III"},313.4,"x","0",0,0,0,0,0,0,0,0,0,0,"0",0,{"$nulls":5},{"v":0,"d":"0.0"},0,0,""]
[{"$nulls":6},{"$f":"LARGE(G10:G45,1)+LARGE(G10:G45,2)+LARGE(G10:G45,3)","v":929.8},{"$f":"SUM(H10:H45)","v":4},{"$f":"LARGE(I10:I45,1)+LARGE(I10:I45,2)+LARGE(I10:I45,3)","v":933.7},{"$f":"SUM(J10:J45)","v":4},{"$f":"LARGE(K10:K45,1)+LARGE(K10:K45,2)+LARGE(K10:K45,3)","v":929.4000000000001},{"$f":"SUM(L10:L45)","v":4},{"$f":"LARGE(M10:M45,1)+LARGE(M10:M45,2)+LARGE(M10:M45,3)","v":937.2},{"$f":"SUM(N10:N45)","v":4},{"$f":"LARGE(O10:O45,1)+LARGE(O10:O45,2)+LARGE(O10:O45,3)","v":930},{"$f":"SUM(P10:P45)","v":4},{"$f":"LARGE(Q10:Q45,1)+LARGE(Q10:Q45,2)+LARGE(Q10:Q45,3)","v":938.8},{"$f":"SUM(R10:S45)","v":4}]
[null,null,"per Email an: sk-huemmling@gmx.de"]

{"sheet":" 5","index":5,"n_rows":47,"n_cols":27,"rows_kept":47,"merged":[[0,22,0,23],[1,22,1,23],[4,22,4,23],[5,22,5,23],[6,22,6,23],[8,20,8,23]]}
[null,"Verein / Gruppe",null,"Ergebnisse",{"$nulls":17},"Austragungsort:",{"$f":"Übersicht!H4","v":"Breddenberg"}]
[1,{"$f":"'Wettkampf 1'!B2","v":"Breddenb.-Heid. I"},null,{"$f":"G46","v":924.8},{"$f":"IF(H46>4,\"Es sind zu viele Schützen in Wertung!\",\" \")","v":" "},{"$nulls":16},"Wettkampftag:",{"$f":"Übersicht!H3","v":"24.11."}]
[2,{"$f":"'Wettkampf 1'!B3","v":"Ostenwalde II"},null,{"$f":"I46","v":{"v":946.5000000000001,"d":"946.5"}},{"$f":"IF(J46>4,\"Es sind zu viele Schützen in Wertung!\",\" \")","v":" "}]
[3,{"$f":"'Wettkampf 1'!B4","v":"Börgermoor II"},null,{"$f":"K46","v":{"v":927.9000000000001,"d":"927.9"}},{"$f":"IF(L46>4,\"Es sind zu viele Schützen in Wertung!\",\" \")","v":" "},{"$nulls":18},"Ansprechpartner für Rückfragen:"]
[4,{"$f":"'Wettkampf 1'!B5","v":"Lorup III"},null,{"$f":"M46","v":931.3},{"$f":"IF(N46>4,\"Es sind zu viele Schützen in Wertung!\",\" \")","v":" "},{"$nulls":16},"Name:","Oldiges Johannes"]
[5,{"$f":"'Wettkampf 1'!B6","v":"Breddenb.-Heid. III"},null,{"$f":"O46","v":932.5},{"$f":"IF(P46>4,\"Es sind zu viele Schützen in Wertung!\",\" \")","v":" "},{"$nulls":16},"Tel:","015209409594"]
[6,{"$f":"'Wettkampf 1'!B7","v":"Werlte III"},null,{"$f":"Q46","v":{"v":938.9000000000001,"d":"938.9"}},{"$f":"IF(R46>4,\"Es sind zu viele Schützen in Wertung!\",\" \")","v":" "},{"$nulls":16},"Standaufsicht:","Jansen"]
[]
[null,"Einzelergebnisse:","Verein / Gruppe","Ergebnisse (mindestens 0 eintragen)","AW? Dann x eintippen",null,"Verein 1",null,"Verein 2",null,"Verein 3",null,"Verein 4",null,"Verein 5",null,"Verein 6",{"$nulls":3},"Proberechnung bei Streifen:"]
[1,{"$f":"'Wettkampf 1'!B10","v":"Hans Gebken 3"},{"$f":"'Wettkampf 1'!C10","v":"Breddenb.-Heid. I"},306.7,null,{"$f":"IF(E10=\"x\",\"0\",D10)","v":306.7},{"$f":"IF(C10=$B$2,F10,0)","v":306.7},{"$f":"(IF(AND($E10=\"\",$C10=$B$2),1,0))","v":1},{"$f":"IF($C10=$B$3,F10,0)","v":0},{"$f":"(IF(AND($E10=\"\",$C10=$B$3),1,0))","v":0},{"$f":"IF($C10=$B$4,F10,0)","v":0},{"$f":"(IF(AND($E10=\"\",$C10=$B$4),1,0))","v":0},{"$f":"IF($C10=$B$5,F10,0)","v":0},{"$f":"(IF(AND($E10=\"\",$C10=$B$5),1,0))","v":0},{"$f":"IF($C10=$B$6,F10,0)","v":0},{"$f":"(IF(AND($E10=\"\",$C10=$B$6),1,0))","v":0},{"$f":"IF($C10=$B$7,F10,0)","v":0},{"$f":"(IF(AND($E10=\"\",$C10=$B$7),1,0))","v":0},{"$nulls":5},{"$f":"U10+V10+W10","v":{"v":0,"d":"0.0"}},{"$f":"IF(X10=D10,1,0)","v":0},{"$f":"IF(X10=0,0,1)","v":0},{"$f":"IF(Y10+Z10=2,\"Korrekt\",\"\")","v":""}]
[2,{"$f":"'Wettkampf 1'!B11","v":"Gerd Vogel "},{"$f":"'Wettkampf 1'!C11","v":"Breddenb.-Heid. I"},309.1,null,{"$f":"IF(E11=\"x\",\"0\",D11)","v":309.1},{"$f":"IF(C11=$B$2,F11,0)","v":309.1},{"$f":"(IF(AND($E11=\"\",$C11=$B$2),1,0))","v":1},{"$f":"IF($C11=$B$3,F11,0)","v":0},{"$f":"(IF(AND($E11=\"\",$C11=$B$3),1,0))","v":0},{"$f":"IF($C11=$B$4,F11,0)","v":0},{"$f":"(IF(AND($E11=\"\",$C11=$B$4),1,0))","v":0},{"$f":"IF($C11=$B$5,F11,0)","v":0},{"$f":"(IF(AND($E11=\"\",$C11=$B$5),1,0))","v":0},{"$f":"IF($C11=$B$6,F11,0)","v":0},{"$f":"(IF(AND($E11=\"\",$C11=$B$6),1,0))","v":0},{"$f":"IF($C11=$B$7,F11,0)","v":0},{"$f":"(IF(AND($E11=\"\",$C11=$B$7),1,0))","v":0},{"$nulls":5},{"$f":"U11+V11+W11","v":{"v":0,"d":"0.0"}},{"$f":"IF(X11=D11,1,0)","v":0},{"$f":"IF(X11=0,0,1)","v":0},{"$f":"IF(Y11+Z11=2,\"Korrekt\",\"\")","v":""}]
[3,{"$f":"'Wettkampf 1'!B12","v":"Heinz Engbers"},{"$f":"'Wettkampf 1'!C12","v":"Breddenb.-Heid. I"},304.5,null,304.5,304.5,1,0,0,0,0,0,0,0,0,0,0,{"$nulls":5},{"v":0,"d":"0.0"},0,0,""]
[4,{"$f":"'Wettkampf 1'!B13","v":"Willi Engbers"},{"$f":"'Wettkampf 1'!C13","v":"Breddenb.-Heid. I"},{"v":309,"d":"309.0"},null,{"v":309,"d":"309.0"},309,1,0,0,0,0,0,0,0,0,0,0,{"$nulls":5},{"v":0,"d":"0.0"},0,0,""]
[5,{"$f":"'Wettkampf 1'!B14","v":"Hans Gebken 1"},{"$f":"'Wettkampf 1'!C14","v":"Breddenb.-Heid. I"},303.6,"x","0","0",0,0,0,0,0,0,0,0,0,0,0,{"$nulls":5},{"v":0,"d":"0.0"},0,0,""]
[6,{"$f":"'Wettkampf 1'!B15","v":"Philipp Schmidt"},{"$f":"'Wettkampf 1'!C15","v":"Ostenwalde II"},318.3,null,318.3,0,0,318.3,1,0,0,0,0,0,0,0,0,{"$nulls":5},{"v":0,"d":"0.0"},0,0,""]
[7,{"$f":"'Wettkampf 1'!B16","v":"Philipp Scholübbers "},{"$f":"'Wettkampf 1'!C16","v":"Ostenwalde II"},314.6,null,314.6,0,0,314.6,1,0,0,0,0,0,0,0,0,{"$nulls":5},{"v":0,"d":"0.0"},0,0,""]
[8,{"$f":"'Wettkampf 1'!B17","v":"Matthias Brinkmann"},{"$f":"'Wettkampf 1'!C17","v":"Ostenwalde II"},null,"x","0",0,0,"0",0,0,0,0,0,0,0,0,0,{"$nulls":5},{"v":0,"d":"0.0"},1,0,""]
[9,{"$f":"'Wettkampf 1'!B18","v":"Patrik Krüßel"},{"$f":"'Wettkampf 1'!C18","v":"Ostenwalde II"},313.6,null,313.6,0,0,313.6,1,0,0,0,0,0,0,0,0,{"$nulls":5},{"v":0,"d":"0.0"},0,0,""]
[10,{"$f":"'Wettkampf 1'!B19","v":"Markus Jansen"},{"$f":"'Wettkampf 1'!C19","v":"Ostenwalde II"},311.7,null,311.7,0,0,311.7,1,0,0,0,0,0,0,0,0,{"$nulls":5},{"v":0,"d":"0.0"},0,0,""]
[11,{"$f":"'Wettkampf 1'!B20","v":"Helmut Benten "},{"$f":"'Wettkampf 1'!C20","v":"Ostenwalde II"},304.8,"x","0",0,0,"0",0,0,0,0,0,0,0,0,0,{"$nulls":5},{"v":0,"d":"0.0"},0,0,""]
[12,{"$f":"'Wettkampf 1'!B21","v":"Heinz Dirksen"},{"$f":"'Wettkampf 1'!C21","v":"Börgermoor II"},304.4,null,304.4,0,0,0,0,304.4,1,0,0,0,0,0,0,{"$nulls":5},{"v":0,"d":"0.0"},0,0,""]
[13,{"$f":"'Wettkampf 1'!B22","v":"Hans Ortmann "},{"$f":"'Wettkampf 1'!C22","v":"Börgermoor II"},310.1,null,310.1,0,0,0,0,310.1,1,0,0,0,0,0,0,{"$nulls":5},{"v":0,"d":"0.0"},0,0,""]
[14,{"$f":"'Wettkampf 1'!B23","v":"Karl-Heinz Ortmann"},{"$f":"'Wettkampf 1'!C23","v":"Börgermoor II"},307.7,null,307.7,0,0,0,0,307.7,1,0,0,0,0,0,0,{"$nulls":5},{"v":0,"d":"0.0"},0,0,""]
[15,{"$f":"'Wettkampf 1'!B24","v":"Johannes Jansen"},{"$f":"'Wettkampf 1'!C24","v":"Börgermoor II"},310.1,null,310.1,0,0,0,0,310.1,1,0,0,0,0,0,0,{"$nulls":5},{"v":0,"d":"0.0"},0,0,""]
[16,{"$f":"'Wettkampf 1'!B25","v":"Kevin Minnert"},{"$f":"'Wettkampf 1'!C25","v":"Börgermoor II"},297.4,"x","0",0,0,0,0,"0",0,0,0,0,0,0,0,{"$nulls":5},{"v":0,"d":"0.0"},0,0,""]
[17,{"$f":"'Wettkampf 1'!B26","v":"Daniel Schülke"},{"$f":"'Wettkampf 1'!C26","v":"Börgermoor II"},306.6,"x","0",0,0,0,0,"0",0,0,0,0,0,0,0,{"$nulls":5},{"v":0,"d":"0.0"},0,0,""]
[18,{"$f":"'Wettkampf 1'!B27","v":"Frank Wotte"},{"$f":"'Wettkampf 1'!C27","v":"Lorup III"},314.6,null,314.6,0,0,0,0,0,0,314.6,1,0,0,0,0,{"$nulls":5},{"v":0,"d":"0.0"},0,0,""]
[19,{"$f":"'Wettkampf 1'!B28","v":"Johannes Wesseln"},{"$f":"'Wettkampf 1'!C28","v":"Lorup III"},311.5,null,311.5,0,0,0,0,0,0,311.5,1,0,0,0,0,{"$nulls":5},{"v":0,"d":"0.0"},0,0,""]
[20,{"$f":"'Wettkampf 1'!B29","v":"Anton Oldiges"},{"$f":"'Wettkampf 1'!C29","v":"Lorup III"},305.2,null,305.2,0,0,0,0,0,0,305.2,1,0,0,0,0,{"$nulls":5},{"v":0,"d":"0.0"},0,0,""]
[21,{"$f":"'Wettkampf 1'!B30","v":"Jürgen Will"},{"$f":"'Wettkampf 1'!C30","v":"Lorup III"},305.2,null,305.2,0,0,0,0,0,0,305.2,1,0,0,0,0,{"$nulls":5},{"v":0,"d":"0.0"},0,0,""]
[22,{"$f":"'Wettkampf 1'!B31","v":"Schütze 22"},{"$f":"'Wettkampf 1'!C31","v":"Lorup III"},null,"x","0",0,0,0,0,0,0,"0",0,0,0,0,0,{"$nulls":5},{"v":0,"d":"0.0"},1,0,""]
[23,{"$f":"'Wettkampf 1'!B32","v":"Schütze 23"},{"$f":"'Wettkampf 1'!C32","v":"Lorup III"},null,"x","0",0,0,0,0,0,0,"0",0,0,0,0,0,{"$nulls":5},{"v":0,"d":"0.0"},1,0,""]
[24,{"$f":"'Wettkampf 1'!B33","v":"Norbert Jansen"},{"$f":"'Wettkampf 1'!C33","v":"Breddenb.-Heid. III"},310.3,null,310.3,0,0,0,0,0,0,0,0,310.3,1,0,0,{"$nulls":5},{"v":0,"d":"0.0"},0,0,""]
[25,{"$f":"'Wettkampf 1'!B34","v":"Werner Jansen"},{"$f":"'Wettkampf 1'!C34","v":"Breddenb.-Heid. III"},304.8,null,304.8,0,0,0,0,0,0,0,0,304.8,1,0,0,{"$nulls":5},{"v":0,"d":"0.0"},0,0,""]
[26,{"$f":"'Wettkampf 1'!B35","v":"Alfons Plüster"},{"$f":"'Wettkampf 1'!C35","v":"Breddenb.-Heid. III"},{"v":308,"d":"308.0"},"x","0",0,0,0,0,0,0,0,0,"0",0,0,0,{"$nulls":5},{"v":0,"d":"0.0"},0,0,""]
[27,{"$f":"'Wettkampf 1'!B36","v":"Johannes Oldiges"},{"$f":"'Wettkampf 1'!C36","v":"Breddenb.-Heid. III"},308.9,"x","0",0,0,0,0,0,0,0,0,"0",0,0,0,{"$nulls":5},{"v":0,"d":"0.0"},0,0,""]
[28,{"$f":"'Wettkampf 1'!B37","v":"Hans Plüster"},{"$f":"'Wettkampf 1'!C37","v":"Breddenb.-Heid. III"},312.8,null,312.8,0,0,0,0,0,0,0,0,312.8,1,0,0,{"$nulls":5},{"v":0,"d":"0.0"},0,0,""]
[29,{"$f":"'Wettkampf 1'!B38","v":"Josef Wübben "},{"$f":"'Wettkampf 1'!C38","v":"Breddenb.-Heid. III"},309.4,null,309.4,0,0,0,0,0,0,0,0,309.4,1,0,0,{"$nulls":5},{"v":0,"d":"0.0"},0,0,""]
[30,{"$f":"'Wettkampf 1'!B39","v":"Thomas Niermann"},{"$f":"'Wettkampf 1'!C39","v":"Werlte III"},{"v":308,"d":"308.0"},null,{"v":308,"d":"308.0"},0,0,0,0,0,0,0,0,0,0,308,1,{"$nulls":5},{"v":0,"d":"0.0"},0,0,""]
[31,{"$f":"'Wettkampf 1'!B40","v":"Bernd Thien"},{"$f":"'Wettkampf 1'!C40","v":"Werlte III"},314.3,null,314.3,0,0,0,0,0,0,0,0,0,0,314.3,1,{"$nulls":5},{"v":0,"d":"0.0"},0,0,""]
[32,{"$f":"'Wettkampf 1'!B41","v":"Norbert Grünloh "},{"$f":"'Wettkampf 1'!C41","v":"Werlte III"},310.2,null,310.2,0,0,0,0,0,0,0,0,0,0,310.2,1,{"$nulls":5},{"v":0,"d":"0.0"},0,0,""]
[33,{"$f":"'Wettkampf 1'!B42","v":"Andreas Thoben "},{"$f":"'Wettkampf 1'!C42","v":"Werlte III"},314.4,null,314.4,0,0,0,0,0,0,0,0,0,0,314.4,1,{"$nulls":5},{"v":0,"d":"0.0"},0,0,""]
[34,{"$f":"'Wettkampf 1'!B43","v":"Hermann Krone "},{"$f":"'Wettkampf 1'!C43","v":"Werlte III"},312.2,"x","0",0,0,0,0,0,0,0,0,0,0,"0",0,{"$nulls":5},{"v":0,"d":"0.0"},0,0,""]
[35,{"$f":"'Wettkampf 1'!B44","v":"Michael Freitag "},{"$f":"'Wettkampf 1'!C44","v":"Werlte III"},314.6,"x","0",0,0,0,0,0,0,0,0,0,0,"0",0,{"$nulls":5},{"v":0,"d":"0.0"},0,0,""]
[36,{"$f":"'Wettkampf 1'!B45","v":"Joachim Niermann"},{"$f":"'Wettkampf 1'!C45","v":"Werlte III"},312.3,"x","0",0,0,0,0,0,0,0,0,0,0,"0",0,{"$nulls":5},{"v":0,"d":"0.0"},0,0,""]
[{"$nulls":6},{"$f":"LARGE(G10:G45,1)+LARGE(G10:G45,2)+LARGE(G10:G45,3)","v":924.8},{"$f":"SUM(H10:H45)","v":4},{"$f":"LARGE(I10:I45,1)+LARGE(I10:I45,2)+LARGE(I10:I45,3)","v":946.5000000000001},{"$f":"SUM(J10:J45)","v":4},{"$f":"LARGE(K10:K45,1)+LARGE(K10:K45,2)+LARGE(K10:K45,3)","v":927.9000000000001},{"$f":"SUM(L10:L45)","v":4},{"$f":"LARGE(M10:M45,1)+LARGE(M10:M45,2)+LARGE(M10:M45,3)","v":931.3},{"$f":"SUM(N10:N45)","v":4},{"$f":"LARGE(O10:O45,1)+LARGE(O10:O45,2)+LARGE(O10:O45,3)","v":932.5},{"$f":"SUM(P10:P45)","v":4},{"$f":"LARGE(Q10:Q45,1)+LARGE(Q10:Q45,2)+LARGE(Q10:Q45,3)","v":938.9000000000001},{"$f":"SUM(R10:S45)","v":4}]
[null,null,"per Email an: sk-huemmling@gmx.de"]

{"sheet":" 6","index":6,"n_rows":47,"n_cols":27,"rows_kept":47,"merged":[[0,22,0,23],[1,22,1,23],[4,22,4,23],[5,22,5,23],[6,22,6,23],[8,20,8,23]]}
[null,"Verein / Gruppe",null,"Ergebnisse",{"$nulls":17},"Austragungsort:",{"$f":"Übersicht!I4","v":"Werlte"}]
[1,{"$f":"'Wettkampf 1'!B2","v":"Breddenb.-Heid. I"},null,{"$f":"G46","v":{"v":929.1999999999999,"d":"929.2"}},{"$f":"IF(H46>4,\"Es sind zu viele Schützen in Wertung!\",\" \")","v":" "},{"$nulls":16},"Wettkampftag:",{"$f":"Übersicht!I3","v":"08.12."}]
[2,{"$f":"'Wettkampf 1'!B3","v":"Ostenwalde II"},null,{"$f":"I46","v":{"v":941,"d":"941.0"}},{"$f":"IF(J46>4,\"Es sind zu viele Schützen in Wertung!\",\" \")","v":" "}]
[3,{"$f":"'Wettkampf 1'!B4","v":"Börgermoor II"},null,{"$f":"K46","v":{"v":929,"d":"929.0"}},{"$f":"IF(L46>4,\"Es sind zu viele Schützen in Wertung!\",\" \")","v":" "},{"$nulls":18},"Ansprechpartner für Rückfragen:"]
[4,{"$f":"'Wettkampf 1'!B5","v":"Lorup III"},null,{"$f":"M46","v":932.1},{"$f":"IF(N46>4,\"Es sind zu viele Schützen in Wertung!\",\" \")","v":" "},{"$nulls":16},"Name:","Bernd Thien"]
[5,{"$f":"'Wettkampf 1'!B6","v":"Breddenb.-Heid. III"},null,{"$f":"O46","v":{"v":927.5999999999999,"d":"927.6"}},{"$f":"IF(P46>4,\"Es sind zu viele Schützen in Wertung!\",\" \")","v":" "},{"$nulls":16},"Tel:","05951/995774"]
[6,{"$f":"'Wettkampf 1'!B7","v":"Werlte III"},null,{"$f":"Q46","v":935.6},{"$f":"IF(R46>4,\"Es sind zu viele Schützen in Wertung!\",\" \")","v":" "},{"$nulls":16},"Standaufsicht:","Bernd Thien"]
[]
[null,"Einzelergebnisse:","Verein / Gruppe","Ergebnisse (mindestens 0 eintragen)","AW? Dann x eintippen",null,"Verein 1",null,"Verein 2",null,"Verein 3",null,"Verein 4",null,"Verein 5",null,"Verein 6",{"$nulls":3},"Proberechnung bei Streifen:"]
[1,{"$f":"'Wettkampf 1'!B10","v":"Hans Gebken 3"},{"$f":"'Wettkampf 1'!C10","v":"Breddenb.-Heid. I"},307.9,null,{"$f":"IF(E10=\"x\",\"0\",D10)","v":307.9},{"$f":"IF(C10=$B$2,F10,0)","v":307.9},{"$f":"(IF(AND($E10=\"\",$C10=$B$2),1,0))","v":1},{"$f":"IF($C10=$B$3,F10,0)","v":0},{"$f":"(IF(AND($E10=\"\",$C10=$B$3),1,0))","v":0},{"$f":"IF($C10=$B$4,F10,0)","v":0},{"$f":"(IF(AND($E10=\"\",$C10=$B$4),1,0))","v":0},{"$f":"IF($C10=$B$5,F10,0)","v":0},{"$f":"(IF(AND($E10=\"\",$C10=$B$5),1,0))","v":0},{"$f":"IF($C10=$B$6,F10,0)","v":0},{"$f":"(IF(AND($E10=\"\",$C10=$B$6),1,0))","v":0},{"$f":"IF($C10=$B$7,F10,0)","v":0},{"$f":"(IF(AND($E10=\"\",$C10=$B$7),1,0))","v":0},null,null,103.9,103.9,100.1,{"$f":"U10+V10+W10","v":307.9},{"$f":"IF(X10=D10,1,0)","v":1},{"$f":"IF(X10=0,0,1)","v":1},{"$f":"IF(Y10+Z10=2,\"Korrekt\",\"\")","v":"Korrekt"}]
[2,{"$f":"'Wettkampf 1'!B11","v":"Gerd Vogel "},{"$f":"'Wettkampf 1'!C11","v":"Breddenb.-Heid. I"},{"v":313,"d":"313.0"},null,{"$f":"IF(E11=\"x\",\"0\",D11)","v":{"v":313,"d":"313.0"}},{"$f":"IF(C11=$B$2,F11,0)","v":313},{"$f":"(IF(AND($E11=\"\",$C11=$B$2),1,0))","v":1},{"$f":"IF($C11=$B$3,F11,0)","v":0},{"$f":"(IF(AND($E11=\"\",$C11=$B$3),1,0))","v":0},{"$f":"IF($C11=$B$4,F11,0)","v":0},{"$f":"(IF(AND($E11=\"\",$C11=$B$4),1,0))","v":0},{"$f":"IF($C11=$B$5,F11,0)","v":0},{"$f":"(IF(AND($E11=\"\",$C11=$B$5),1,0))","v":0},{"$f":"IF($C11=$B$6,F11,0)","v":0},{"$f":"(IF(AND($E11=\"\",$C11=$B$6),1,0))","v":0},{"$f":"IF($C11=$B$7,F11,0)","v":0},{"$f":"(IF(AND($E11=\"\",$C11=$B$7),1,0))","v":0},null,null,103.5,104.9,104.6,{"$f":"U11+V11+W11","v":{"v":313,"d":"313.0"}},{"$f":"IF(X11=D11,1,0)","v":1},{"$f":"IF(X11=0,0,1)","v":1},{"$f":"IF(Y11+Z11=2,\"Korrekt\",\"\")","v":"Korrekt"}]
[3,{"$f":"'Wettkampf 1'!B12","v":"Heinz Engbers"},{"$f":"'Wettkampf 1'!C12","v":"Breddenb.-Heid. I"},308.3,null,308.3,308.3,1,0,0,0,0,0,0,0,0,0,0,null,null,103.5,102.9,101.9,308.3,1,1,"Korrekt"]
[4,{"$f":"'Wettkampf 1'!B13","v":"Willi Engbers"},{"$f":"'Wettkampf 1'!C13","v":"Breddenb.-Heid. I"},307.9,null,307.9,307.9,1,0,0,0,0,0,0,0,0,0,0,null,null,100.3,103.4,104.2,307.9,1,1,"Korrekt"]
[5,{"$f":"'Wettkampf 1'!B14","v":"Hans Gebken 1"},{"$f":"'Wettkampf 1'!C14","v":"Breddenb.-Heid. I"},299.8,"x","0","0",0,0,0,0,0,0,0,0,0,0,0,null,null,97.1,101.2,101.5,299.8,1,1,"Korrekt"]
[6,{"$f":"'Wettkampf 1'!B15","v":"Philipp Schmidt"},{"$f":"'Wettkampf 1'!C15","v":"Ostenwalde II"},316.5,null,316.5,0,0,316.5,1,0,0,0,0,0,0,0,0,null,null,104.3,106.2,{"v":106,"d":"106.0"},316.5,1,1,"Korrekt"]
[7,{"$f":"'Wettkampf 1'!B16","v":"Philipp Scholübbers "},{"$f":"'Wettkampf 1'!C16","v":"Ostenwalde II"},312.7,null,312.7,0,0,312.7,1,0,0,0,0,0,0,0,0,null,null,104.1,104.1,104.5,312.7,1,1,"Korrekt"]
[8,{"$f":"'Wettkampf 1'!B17","v":"Matthias Brinkmann"},{"$f":"'Wettkampf 1'!C17","v":"Ostenwalde II"},303.3,"x","0",0,0,"0",0,0,0,0,0,0,0,0,0,null,null,101.4,100.9,{"v":101,"d":"101.0"},303.3,1,1,"Korrekt"]
[9,{"$f":"'Wettkampf 1'!B18","v":"Patrik Krüßel"},{"$f":"'Wettkampf 1'!C18","v":"Ostenwalde II"},311.8,null,311.8,0,0,311.8,1,0,0,0,0,0,0,0,0,null,null,104.3,102.2,105.3,311.8,1,1,"Korrekt"]
[10,{"$f":"'Wettkampf 1'!B19","v":"Markus Jansen"},{"$f":"'Wettkampf 1'!C19","v":"Ostenwalde II"},308.6,null,308.6,0,0,308.6,1,0,0,0,0,0,0,0,0,null,null,102.8,104.9,100.9,308.6,1,1,"Korrekt"]
[11,{"$f":"'Wettkampf 1'!B20","v":"Helmut Benten "},{"$f":"'Wettkampf 1'!C20","v":"Ostenwalde II"},304.7,"x","0",0,0,"0",0,0,0,0,0,0,0,0,0,null,null,{"v":102,"d":"102.0"},{"v":102,"d":"102.0"},100.7,304.7,1,1,"Korrekt"]
[12,{"$f":"'Wettkampf 1'!B21","v":"Heinz Dirksen"},{"$f":"'Wettkampf 1'!C21","v":"Börgermoor II"},307.8,null,307.8,0,0,0,0,307.8,1,0,0,0,0,0,0,null,null,105.3,103.3,99.2,307.8,1,1,"Korrekt"]
[13,{"$f":"'Wettkampf 1'!B22","v":"Hans Ortmann "},{"$f":"'Wettkampf 1'!C22","v":"Börgermoor II"},309.7,null,309.7,0,0,0,0,309.7,1,0,0,0,0,0,0,null,null,103.6,{"v":102,"d":"102.0"},104.1,309.7,1,1,"Korrekt"]
[14,{"$f":"'Wettkampf 1'!B23","v":"Karl-Heinz Ortmann"},{"$f":"'Wettkampf 1'!C23","v":"Börgermoor II"},307.7,null,307.7,0,0,0,0,307.7,1,0,0,0,0,0,0,null,null,100.8,104.1,102.8,307.7,1,1,"Korrekt"]
[15,{"$f":"'Wettkampf 1'!B24","v":"Johannes Jansen"},{"$f":"'Wettkampf 1'!C24","v":"Börgermoor II"},311.5,null,311.5,0,0,0,0,311.5,1,0,0,0,0,0,0,null,null,105.4,104.1,{"v":102,"d":"102.0"},311.5,1,1,"Korrekt"]
[16,{"$f":"'Wettkampf 1'!B25","v":"Kevin Minnert"},{"$f":"'Wettkampf 1'!C25","v":"Börgermoor II"},294.9,"x","0",0,0,0,0,"0",0,0,0,0,0,0,0,null,null,{"v":98,"d":"98.0"},98.2,98.7,294.9,1,1,"Korrekt"]
[17,{"$f":"'Wettkampf 1'!B26","v":"Daniel Schülke"},{"$f":"'Wettkampf 1'!C26","v":"Börgermoor II"},null,"x","0",0,0,0,0,"0",0,0,0,0,0,0,0,{"$nulls":5},{"v":0,"d":"0.0"},1,0,""]
[18,{"$f":"'Wettkampf 1'!B27","v":"Frank Wotte"},{"$f":"'Wettkampf 1'!C27","v":"Lorup III"},311.6,null,311.6,0,0,0,0,0,0,311.6,1,0,0,0,0,null,null,104.5,101.9,105.2,311.6,1,1,"Korrekt"]
[19,{"$f":"'Wettkampf 1'!B28","v":"Johannes Wesseln"},{"$f":"'Wettkampf 1'!C28","v":"Lorup III"},312.1,null,312.1,0,0,0,0,0,0,312.1,1,0,0,0,0,null,null,103.5,105.1,103.5,312.1,1,1,"Korrekt"]
[20,{"$f":"'Wettkampf 1'!B29","v":"Anton Oldiges"},{"$f":"'Wettkampf 1'!C29","v":"Lorup III"},307.3,null,307.3,0,0,0,0,0,0,307.3,1,0,0,0,0,null,null,101.6,102.6,103.1,{"v":307.29999999999995,"d":"307.3"},1,1,"Korrekt"]
[21,{"$f":"'Wettkampf 1'!B30","v":"Jürgen Will"},{"$f":"'Wettkampf 1'!C30","v":"Lorup III"},308.4,null,308.4,0,0,0,0,0,0,308.4,1,0,0,0,0,null,null,103.8,101.7,102.9,308.4,1,1,"Korrekt"]
[22,{"$f":"'Wettkampf 1'!B31","v":"Schütze 22"},{"$f":"'Wettkampf 1'!C31","v":"Lorup III"},null,"x","0",0,0,0,0,0,0,"0",0,0,0,0,0,{"$nulls":5},{"v":0,"d":"0.0"},1,0,""]
[23,{"$f":"'Wettkampf 1'!B32","v":"Schütze 23"},{"$f":"'Wettkampf 1'!C32","v":"Lorup III"},null,"x","0",0,0,0,0,0,0,"0",0,0,0,0,0,{"$nulls":5},{"v":0,"d":"0.0"},1,0,""]
[24,{"$f":"'Wettkampf 1'!B33","v":"Norbert Jansen"},{"$f":"'Wettkampf 1'!C33","v":"Breddenb.-Heid. III"},309.5,null,309.5,0,0,0,0,0,0,0,0,309.5,1,0,0,null,null,103.9,102.9,102.7,309.5,1,1,"Korrekt"]
[25,{"$f":"'Wettkampf 1'!B34","v":"Werner Jansen"},{"$f":"'Wettkampf 1'!C34","v":"Breddenb.-Heid. III"},306.7,null,306.7,0,0,0,0,0,0,0,0,306.7,1,0,0,null,null,104.7,99.7,102.3,306.7,1,1,"Korrekt"]
[26,{"$f":"'Wettkampf 1'!B35","v":"Alfons Plüster"},{"$f":"'Wettkampf 1'!C35","v":"Breddenb.-Heid. III"},303.6,"x","0",0,0,0,0,0,0,0,0,"0",0,0,0,null,null,101.4,101.4,100.8,303.6,1,1,"Korrekt"]
[27,{"$f":"'Wettkampf 1'!B36","v":"Johannes Oldiges"},{"$f":"'Wettkampf 1'!C36","v":"Breddenb.-Heid. III"},307.5,"x","0",0,0,0,0,0,0,0,0,"0",0,0,0,null,null,102.3,101.4,103.8,307.5,1,1,"Korrekt"]
[28,{"$f":"'Wettkampf 1'!B37","v":"Hans Plüster"},{"$f":"'Wettkampf 1'!C37","v":"Breddenb.-Heid. III"},311.4,null,311.4,0,0,0,0,0,0,0,0,311.4,1,0,0,null,null,{"v":104,"d":"104.0"},103.6,103.8,311.4,1,1,"Korrekt"]
[29,{"$f":"'Wettkampf 1'!B38","v":"Josef Wübben "},{"$f":"'Wettkampf 1'!C38","v":"Breddenb.-Heid. III"},303.9,null,303.9,0,0,0,0,0,0,0,0,303.9,1,0,0,null,null,99.8,101.8,102.3,303.9,1,1,"Korrekt"]
[30,{"$f":"'Wettkampf 1'!B39","v":"Thomas Niermann"},{"$f":"'Wettkampf 1'!C39","v":"Werlte III"},310.5,"x","0",0,0,0,0,0,0,0,0,0,0,"0",0,null,null,104.9,103.1,102.5,310.5,1,1,"Korrekt"]
[31,{"$f":"'Wettkampf 1'!B40","v":"Bernd Thien"},{"$f":"'Wettkampf 1'!C40","v":"Werlte III"},{"v":309,"d":"309.0"},null,{"v":309,"d":"309.0"},0,0,0,0,0,0,0,0,0,0,309,1,null,null,103.6,104.4,{"v":101,"d":"101.0"},{"v":309,"d":"309.0"},1,1,"Korrekt"]
[32,{"$f":"'Wettkampf 1'!B41","v":"Norbert Grünloh "},{"$f":"'Wettkampf 1'!C41","v":"Werlte III"},313.8,null,313.8,0,0,0,0,0,0,0,0,0,0,313.8,1,null,null,104.9,103.7,105.2,313.8,1,1,"Korrekt"]
[33,{"$f":"'Wettkampf 1'!B42","v":"Andreas Thoben "},{"$f":"'Wettkampf 1'!C42","v":"Werlte III"},312.8,null,312.8,0,0,0,0,0,0,0,0,0,0,312.8,1,null,null,{"v":105,"d":"105.0"},103.7,104.1,{"v":312.79999999999995,"d":"312.8"},1,1,"Korrekt"]
[34,{"$f":"'Wettkampf 1'!B43","v":"Hermann Krone "},{"$f":"'Wettkampf 1'!C43","v":"Werlte III"},310.3,"x","0",0,0,0,0,0,0,0,0,0,0,"0",0,null,null,{"v":102,"d":"102.0"},102.4,105.9,310.3,1,1,"Korrekt"]
[35,{"$f":"'Wettkampf 1'!B44","v":"Michael Freitag "},{"$f":"'Wettkampf 1'!C44","v":"Werlte III"},310.1,"x","0",0,0,0,0,0,0,0,0,0,0,"0",0,null,null,106.5,103.4,100.2,310.1,1,1,"Korrekt"]
[36,{"$f":"'Wettkampf 1'!B45","v":"Joachim Niermann"},{"$f":"'Wettkampf 1'!C45","v":"Werlte III"},307.9,null,307.9,0,0,0,0,0,0,0,0,0,0,307.9,1,null,null,101.4,103.6,102.9,307.9,1,1,"Korrekt"]
[{"$nulls":6},{"$f":"LARGE(G10:G45,1)+LARGE(G10:G45,2)+LARGE(G10:G45,3)","v":929.1999999999999},{"$f":"SUM(H10:H45)","v":4},{"$f":"LARGE(I10:I45,1)+LARGE(I10:I45,2)+LARGE(I10:I45,3)","v":941},{"$f":"SUM(J10:J45)","v":4},{"$f":"LARGE(K10:K45,1)+LARGE(K10:K45,2)+LARGE(K10:K45,3)","v":929},{"$f":"SUM(L10:L45)","v":4},{"$f":"LARGE(M10:M45,1)+LARGE(M10:M45,2)+LARGE(M10:M45,3)","v":932.1},{"$f":"SUM(N10:N45)","v":4},{"$f":"LARGE(O10:O45,1)+LARGE(O10:O45,2)+LARGE(O10:O45,3)","v":927.5999999999999},{"$f":"SUM(P10:P45)","v":4},{"$f":"LARGE(Q10:Q45,1)+LARGE(Q10:Q45,2)+LARGE(Q10:Q45,3)","v":935.6},{"$f":"SUM(R10:S45)","v":4}]
[null,null,"per Email an: sk-huemmling@gmx.de"]

{"sheet":"7","index":7,"n_rows":47,"n_cols":27,"rows_kept":47,"merged":[[0,22,0,23],[1,22,1,23],[4,22,4,23],[5,22,5,23],[6,22,6,23],[8,20,8,23]]}
[null,"Verein / Gruppe",null,"Ergebnisse",{"$nulls":17},"Austragungsort:",{"$f":"Übersicht!L4","v":"Breddenb.-Heid."}]
[1,{"$f":"'Wettkampf 1'!B2","v":"Breddenb.-Heid. I"},null,{"$f":"G46","v":931.1},{"$f":"IF(H46>4,\"Es sind zu viele Schützen in Wertung!\",\" \")","v":" "},{"$nulls":16},"Wettkampftag:",{"$f":"Übersicht!L3","v":"19.01."}]
[2,{"$f":"'Wettkampf 1'!B3","v":"Ostenwalde II"},null,{"$f":"I46","v":938.8},{"$f":"IF(J46>4,\"Es sind zu viele Schützen in Wertung!\",\" \")","v":" "}]
[3,{"$f":"'Wettkampf 1'!B4","v":"Börgermoor II"},null,{"$f":"K46","v":933.2},{"$f":"IF(L46>4,\"Es sind zu viele Schützen in Wertung!\",\" \")","v":" "},{"$nulls":18},"Ansprechpartner für Rückfragen:"]
[4,{"$f":"'Wettkampf 1'!B5","v":"Lorup III"},null,{"$f":"M46","v":{"v":937,"d":"937.0"}},{"$f":"IF(N46>4,\"Es sind zu viele Schützen in Wertung!\",\" \")","v":" "},{"$nulls":16},"Name:","heinz engbers"]
[5,{"$f":"'Wettkampf 1'!B6","v":"Breddenb.-Heid. III"},null,{"$f":"O46","v":{"v":938.0000000000001,"d":"938.0"}},{"$f":"IF(P46>4,\"Es sind zu viele Schützen in Wertung!\",\" \")","v":" "},{"$nulls":16},"Tel:","01749514192"]
[6,{"$f":"'Wettkampf 1'!B7","v":"Werlte III"},null,{"$f":"Q46","v":937.2},{"$f":"IF(R46>4,\"Es sind zu viele Schützen in Wertung!\",\" \")","v":" "},{"$nulls":16},"Standaufsicht:","willi engbers"]
[]
[null,"Einzelergebnisse:","Verein / Gruppe","Ergebnisse (mindestens 0 eintragen)","AW? Dann x eintippen",null,"Verein 1",null,"Verein 2",null,"Verein 3",null,"Verein 4",null,"Verein 5",null,"Verein 6",{"$nulls":3},"Proberechnung bei Streifen:"]
[1,{"$f":"'Wettkampf 1'!B10","v":"Hans Gebken 3"},{"$f":"'Wettkampf 1'!C10","v":"Breddenb.-Heid. I"},303.6," ",{"$f":"IF(E10=\"x\",\"0\",D10)","v":303.6},{"$f":"IF(C10=$B$2,F10,0)","v":303.6},{"$f":"(IF(AND($E10=\"\",$C10=$B$2),1,0))","v":0},{"$f":"IF($C10=$B$3,F10,0)","v":0},{"$f":"(IF(AND($E10=\"\",$C10=$B$3),1,0))","v":0},{"$f":"IF($C10=$B$4,F10,0)","v":0},{"$f":"(IF(AND($E10=\"\",$C10=$B$4),1,0))","v":0},{"$f":"IF($C10=$B$5,F10,0)","v":0},{"$f":"(IF(AND($E10=\"\",$C10=$B$5),1,0))","v":0},{"$f":"IF($C10=$B$6,F10,0)","v":0},{"$f":"(IF(AND($E10=\"\",$C10=$B$6),1,0))","v":0},{"$f":"IF($C10=$B$7,F10,0)","v":0},{"$f":"(IF(AND($E10=\"\",$C10=$B$7),1,0))","v":0},{"$nulls":5},{"$f":"U10+V10+W10","v":{"v":0,"d":"0.0"}},{"$f":"IF(X10=D10,1,0)","v":0},{"$f":"IF(X10=0,0,1)","v":0},{"$f":"IF(Y10+Z10=2,\"Korrekt\",\"\")","v":""}]
[2,{"$f":"'Wettkampf 1'!B11","v":"Gerd Vogel "},{"$f":"'Wettkampf 1'!C11","v":"Breddenb.-Heid. I"},312.1,null,{"$f":"IF(E11=\"x\",\"0\",D11)","v":312.1},{"$f":"IF(C11=$B$2,F11,0)","v":312.1},{"$f":"(IF(AND($E11=\"\",$C11=$B$2),1,0))","v":1},{"$f":"IF($C11=$B$3,F11,0)","v":0},{"$f":"(IF(AND($E11=\"\",$C11=$B$3),1,0))","v":0},{"$f":"IF($C11=$B$4,F11,0)","v":0},{"$f":"(IF(AND($E11=\"\",$C11=$B$4),1,0))","v":0},{"$f":"IF($C11=$B$5,F11,0)","v":0},{"$f":"(IF(AND($E11=\"\",$C11=$B$5),1,0))","v":0},{"$f":"IF($C11=$B$6,F11,0)","v":0},{"$f":"(IF(AND($E11=\"\",$C11=$B$6),1,0))","v":0},{"$f":"IF($C11=$B$7,F11,0)","v":0},{"$f":"(IF(AND($E11=\"\",$C11=$B$7),1,0))","v":0},{"$nulls":5},{"$f":"U11+V11+W11","v":{"v":0,"d":"0.0"}},{"$f":"IF(X11=D11,1,0)","v":0},{"$f":"IF(X11=0,0,1)","v":0},{"$f":"IF(Y11+Z11=2,\"Korrekt\",\"\")","v":""}]
[3,{"$f":"'Wettkampf 1'!B12","v":"Heinz Engbers"},{"$f":"'Wettkampf 1'!C12","v":"Breddenb.-Heid. I"},307.9,null,307.9,307.9,1,0,0,0,0,0,0,0,0,0,0,{"$nulls":5},{"v":0,"d":"0.0"},0,0,""]
[4,{"$f":"'Wettkampf 1'!B13","v":"Willi Engbers"},{"$f":"'Wettkampf 1'!C13","v":"Breddenb.-Heid. I"},311.1,null,311.1,311.1,1,0,0,0,0,0,0,0,0,0,0,{"$nulls":5},{"v":0,"d":"0.0"},0,0,""]
[5,{"$f":"'Wettkampf 1'!B14","v":"Hans Gebken 1"},{"$f":"'Wettkampf 1'!C14","v":"Breddenb.-Heid. I"},306.8,"x","0","0",0,0,0,0,0,0,0,0,0,0,0,{"$nulls":5},{"v":0,"d":"0.0"},0,0,""]
[6,{"$f":"'Wettkampf 1'!B15","v":"Philipp Schmidt"},{"$f":"'Wettkampf 1'!C15","v":"Ostenwalde II"},315.8," ",315.8,0,0,315.8,0,0,0,0,0,0,0,0,0,{"$nulls":5},{"v":0,"d":"0.0"},0,0,""]
[7,{"$f":"'Wettkampf 1'!B16","v":"Philipp Scholübbers "},{"$f":"'Wettkampf 1'!C16","v":"Ostenwalde II"},{"v":314,"d":"314.0"},null,{"v":314,"d":"314.0"},0,0,314,1,0,0,0,0,0,0,0,0,{"$nulls":5},{"v":0,"d":"0.0"},0,0,""]
[8,{"$f":"'Wettkampf 1'!B17","v":"Matthias Brinkmann"},{"$f":"'Wettkampf 1'!C17","v":"Ostenwalde II"},310.3,"x","0",0,0,"0",0,0,0,0,0,0,0,0,0,{"$nulls":5},{"v":0,"d":"0.0"},0,0,""]
[9,{"$f":"'Wettkampf 1'!B18","v":"Patrik Krüßel"},{"$f":"'Wettkampf 1'!C18","v":"Ostenwalde II"},308.8,null,308.8,0,0,308.8,1,0,0,0,0,0,0,0,0,{"$nulls":5},{"v":0,"d":"0.0"},0,0,""]
[10,{"$f":"'Wettkampf 1'!B19","v":"Markus Jansen"},{"$f":"'Wettkampf 1'!C19","v":"Ostenwalde II"},{"v":309,"d":"309.0"},null,{"v":309,"d":"309.0"},0,0,309,1,0,0,0,0,0,0,0,0,{"$nulls":5},{"v":0,"d":"0.0"},0,0,""]
[11,{"$f":"'Wettkampf 1'!B20","v":"Helmut Benten "},{"$f":"'Wettkampf 1'!C20","v":"Ostenwalde II"},305.2,"x","0",0,0,"0",0,0,0,0,0,0,0,0,0,{"$nulls":5},{"v":0,"d":"0.0"},0,0,""]
[12,{"$f":"'Wettkampf 1'!B21","v":"Heinz Dirksen"},{"$f":"'Wettkampf 1'!C21","v":"Börgermoor II"},307.5," ",307.5,0,0,0,0,307.5,0,0,0,0,0,0,0,{"$nulls":5},{"v":0,"d":"0.0"},0,0,""]
[13,{"$f":"'Wettkampf 1'!B22","v":"Hans Ortmann "},{"$f":"'Wettkampf 1'!C22","v":"Börgermoor II"},309.6,null,309.6,0,0,0,0,309.6,1,0,0,0,0,0,0,{"$nulls":5},{"v":0,"d":"0.0"},0,0,""]
[14,{"$f":"'Wettkampf 1'!B23","v":"Karl-Heinz Ortmann"},{"$f":"'Wettkampf 1'!C23","v":"Börgermoor II"},310.6,null,310.6,0,0,0,0,310.6,1,0,0,0,0,0,0,{"$nulls":5},{"v":0,"d":"0.0"},0,0,""]
[15,{"$f":"'Wettkampf 1'!B24","v":"Johannes Jansen"},{"$f":"'Wettkampf 1'!C24","v":"Börgermoor II"},{"v":313,"d":"313.0"},null,{"v":313,"d":"313.0"},0,0,0,0,313,1,0,0,0,0,0,0,{"$nulls":5},{"v":0,"d":"0.0"},0,0,""]
[16,{"$f":"'Wettkampf 1'!B25","v":"Kevin Minnert"},{"$f":"'Wettkampf 1'!C25","v":"Börgermoor II"},305.1,"x","0",0,0,0,0,"0",0,0,0,0,0,0,0,{"$nulls":5},{"v":0,"d":"0.0"},0,0,""]
[17,{"$f":"'Wettkampf 1'!B26","v":"Daniel Schülke"},{"$f":"'Wettkampf 1'!C26","v":"Börgermoor II"},300.4,"x","0",0,0,0,0,"0",0,0,0,0,0,0,0,{"$nulls":5},{"v":0,"d":"0.0"},0,0,""]
[18,{"$f":"'Wettkampf 1'!B27","v":"Frank Wotte"},{"$f":"'Wettkampf 1'!C27","v":"Lorup III"},313.8," ",313.8,0,0,0,0,0,0,313.8,0,0,0,0,0,{"$nulls":5},{"v":0,"d":"0.0"},0,0,""]
[19,{"$f":"'Wettkampf 1'!B28","v":"Johannes Wesseln"},{"$f":"'Wettkampf 1'!C28","v":"Lorup III"},312.9,null,312.9,0,0,0,0,0,0,312.9,1,0,0,0,0,{"$nulls":5},{"v":0,"d":"0.0"},0,0,""]
[20,{"$f":"'Wettkampf 1'!B29","v":"Anton Oldiges"},{"$f":"'Wettkampf 1'!C29","v":"Lorup III"},306.3,null,306.3,0,0,0,0,0,0,306.3,1,0,0,0,0,{"$nulls":5},{"v":0,"d":"0.0"},0,0,""]
[21,{"$f":"'Wettkampf 1'!B30","v":"Jürgen Will"},{"$f":"'Wettkampf 1'!C30","v":"Lorup III"},310.3,null,310.3,0,0,0,0,0,0,310.3,1,0,0,0,0,{"$nulls":5},{"v":0,"d":"0.0"},0,0,""]
[22,{"$f":"'Wettkampf 1'!B31","v":"Schütze 22"},{"$f":"'Wettkampf 1'!C31","v":"Lorup III"},null,"x","0",0,0,0,0,0,0,"0",0,0,0,0,0,{"$nulls":5},{"v":0,"d":"0.0"},1,0,""]
[23,{"$f":"'Wettkampf 1'!B32","v":"Schütze 23"},{"$f":"'Wettkampf 1'!C32","v":"Lorup III"},null,"x","0",0,0,0,0,0,0,"0",0,0,0,0,0,{"$nulls":5},{"v":0,"d":"0.0"},1,0,""]
[24,{"$f":"'Wettkampf 1'!B33","v":"Norbert Jansen"},{"$f":"'Wettkampf 1'!C33","v":"Breddenb.-Heid. III"},312.3," ",312.3,0,0,0,0,0,0,0,0,312.3,0,0,0,{"$nulls":5},{"v":0,"d":"0.0"},0,0,""]
[25,{"$f":"'Wettkampf 1'!B34","v":"Werner Jansen"},{"$f":"'Wettkampf 1'!C34","v":"Breddenb.-Heid. III"},308.5," ",308.5,0,0,0,0,0,0,0,0,308.5,0,0,0,{"$nulls":5},{"v":0,"d":"0.0"},0,0,""]
[26,{"$f":"'Wettkampf 1'!B35","v":"Alfons Plüster"},{"$f":"'Wettkampf 1'!C35","v":"Breddenb.-Heid. III"},311.8,"x","0",0,0,0,0,0,0,0,0,"0",0,0,0,{"$nulls":5},{"v":0,"d":"0.0"},0,0,""]
[27,{"$f":"'Wettkampf 1'!B36","v":"Johannes Oldiges"},{"$f":"'Wettkampf 1'!C36","v":"Breddenb.-Heid. III"},303.8,"x","0",0,0,0,0,0,0,0,0,"0",0,0,0,{"$nulls":5},{"v":0,"d":"0.0"},0,0,""]
[28,{"$f":"'Wettkampf 1'!B37","v":"Hans Plüster"},{"$f":"'Wettkampf 1'!C37","v":"Breddenb.-Heid. III"},315.6,null,315.6,0,0,0,0,0,0,0,0,315.6,1,0,0,{"$nulls":5},{"v":0,"d":"0.0"},0,0,""]
[29,{"$f":"'Wettkampf 1'!B38","v":"Josef Wübben "},{"$f":"'Wettkampf 1'!C38","v":"Breddenb.-Heid. III"},310.1," ",310.1,0,0,0,0,0,0,0,0,310.1,0,0,0,{"$nulls":5},{"v":0,"d":"0.0"},0,0,""]
[30,{"$f":"'Wettkampf 1'!B39","v":"Thomas Niermann"},{"$f":"'Wettkampf 1'!C39","v":"Werlte III"},312.3,"x","0",0,0,0,0,0,0,0,0,0,0,"0",0,{"$nulls":5},{"v":0,"d":"0.0"},0,0,""]
[31,{"$f":"'Wettkampf 1'!B40","v":"Bernd Thien"},{"$f":"'Wettkampf 1'!C40","v":"Werlte III"},310.7,null,310.7,0,0,0,0,0,0,0,0,0,0,310.7,1,{"$nulls":5},{"v":0,"d":"0.0"},0,0,""]
[32,{"$f":"'Wettkampf 1'!B41","v":"Norbert Grünloh "},{"$f":"'Wettkampf 1'!C41","v":"Werlte III"},307.8,null,307.8,0,0,0,0,0,0,0,0,0,0,307.8,1,{"$nulls":5},{"v":0,"d":"0.0"},0,0,""]
[33,{"$f":"'Wettkampf 1'!B42","v":"Andreas Thoben "},{"$f":"'Wettkampf 1'!C42","v":"Werlte III"},{"v":316,"d":"316.0"},null,{"v":316,"d":"316.0"},0,0,0,0,0,0,0,0,0,0,316,1,{"$nulls":5},{"v":0,"d":"0.0"},0,0,""]
[34,{"$f":"'Wettkampf 1'!B43","v":"Hermann Krone "},{"$f":"'Wettkampf 1'!C43","v":"Werlte III"},307.3,"x","0",0,0,0,0,0,0,0,0,0,0,"0",0,{"$nulls":5},{"v":0,"d":"0.0"},0,0,""]
[35,{"$f":"'Wettkampf 1'!B44","v":"Michael Freitag "},{"$f":"'Wettkampf 1'!C44","v":"Werlte III"},313.9,"x","0",0,0,0,0,0,0,0,0,0,0,"0",0,{"$nulls":5},{"v":0,"d":"0.0"},0,0,""]
[36,{"$f":"'Wettkampf 1'!B45","v":"Joachim Niermann"},{"$f":"'Wettkampf 1'!C45","v":"Werlte III"},310.5," ",310.5,0,0,0,0,0,0,0,0,0,0,310.5,0,{"$nulls":5},{"v":0,"d":"0.0"},0,0,""]
[{"$nulls":6},{"$f":"LARGE(G10:G45,1)+LARGE(G10:G45,2)+LARGE(G10:G45,3)","v":931.1},{"$f":"SUM(H10:H45)","v":3},{"$f":"LARGE(I10:I45,1)+LARGE(I10:I45,2)+LARGE(I10:I45,3)","v":938.8},{"$f":"SUM(J10:J45)","v":3},{"$f":"LARGE(K10:K45,1)+LARGE(K10:K45,2)+LARGE(K10:K45,3)","v":933.2},{"$f":"SUM(L10:L45)","v":3},{"$f":"LARGE(M10:M45,1)+LARGE(M10:M45,2)+LARGE(M10:M45,3)","v":937},{"$f":"SUM(N10:N45)","v":3},{"$f":"LARGE(O10:O45,1)+LARGE(O10:O45,2)+LARGE(O10:O45,3)","v":938.0000000000001},{"$f":"SUM(P10:P45)","v":1},{"$f":"LARGE(Q10:Q45,1)+LARGE(Q10:Q45,2)+LARGE(Q10:Q45,3)","v":937.2},{"$f":"SUM(R10:S45)","v":3}]
[null,null,"per Email an: sk-huemmling@gmx.de"]

{"sheet":"8","index":8,"n_rows":47,"n_cols":27,"rows_kept":47,"merged":[[0,22,0,23],[1,22,1,23],[4,22,4,23],[5,22,5,23],[6,22,6,23],[8,20,8,23]]}
[null,"Verein / Gruppe",null,"Ergebnisse",{"$nulls":17},"Austragungsort:",{"$f":"Übersicht!M4","v":"Ostenwalde"}]
[1,{"$f":"'Wettkampf 1'!B2","v":"Breddenb.-Heid. I"},null,{"$f":"G46","v":{"v":927.6000000000001,"d":"927.6"}},{"$f":"IF(H46>4,\"Es sind zu viele Schützen in Wertung!\",\" \")","v":" "},{"$nulls":16},"Wettkampftag:",{"$f":"Übersicht!M3","v":"02.02."}]
[2,{"$f":"'Wettkampf 1'!B3","v":"Ostenwalde II"},null,{"$f":"I46","v":938.7},{"$f":"IF(J46>4,\"Es sind zu viele Schützen in Wertung!\",\" \")","v":" "}]
[3,{"$f":"'Wettkampf 1'!B4","v":"Börgermoor II"},null,{"$f":"K46","v":{"v":927.3000000000001,"d":"927.3"}},{"$f":"IF(L46>4,\"Es sind zu viele Schützen in Wertung!\",\" \")","v":" "},{"$nulls":18},"Ansprechpartner für Rückfragen:"]
[4,{"$f":"'Wettkampf 1'!B5","v":"Lorup III"},null,{"$f":"M46","v":932.8},{"$f":"IF(N46>4,\"Es sind zu viele Schützen in Wertung!\",\" \")","v":" "},{"$nulls":16},"Name:","Markus Jansen"]
[5,{"$f":"'Wettkampf 1'!B6","v":"Breddenb.-Heid. III"},null,{"$f":"O46","v":{"v":930,"d":"930.0"}},{"$f":"IF(P46>4,\"Es sind zu viele Schützen in Wertung!\",\" \")","v":" "},{"$nulls":16},"Tel:"]
[6,{"$f":"'Wettkampf 1'!B7","v":"Werlte III"},null,{"$f":"Q46","v":{"v":942.0999999999999,"d":"942.1"}},{"$f":"IF(R46>4,\"Es sind zu viele Schützen in Wertung!\",\" \")","v":" "},{"$nulls":16},"Standaufsicht:","Philipp Schmidt"]
[]
[null,"Einzelergebnisse:","Verein / Gruppe","Ergebnisse (mindestens 0 eintragen)","AW? Dann x eintippen",null,"Verein 1",null,"Verein 2",null,"Verein 3",null,"Verein 4",null,"Verein 5",null,"Verein 6",{"$nulls":3},"Proberechnung bei Streifen:"]
[1,{"$f":"'Wettkampf 1'!B10","v":"Hans Gebken 3"},{"$f":"'Wettkampf 1'!C10","v":"Breddenb.-Heid. I"},{"$f":"X10","v":306.4},null,{"$f":"IF(E10=\"x\",\"0\",D10)","v":306.4},{"$f":"IF(C10=$B$2,F10,0)","v":306.4},{"$f":"(IF(AND($E10=\"\",$C10=$B$2),1,0))","v":1},{"$f":"IF($C10=$B$3,F10,0)","v":0},{"$f":"(IF(AND($E10=\"\",$C10=$B$3),1,0))","v":0},{"$f":"IF($C10=$B$4,F10,0)","v":0},{"$f":"(IF(AND($E10=\"\",$C10=$B$4),1,0))","v":0},{"$f":"IF($C10=$B$5,F10,0)","v":0},{"$f":"(IF(AND($E10=\"\",$C10=$B$5),1,0))","v":0},{"$f":"IF($C10=$B$6,F10,0)","v":0},{"$f":"(IF(AND($E10=\"\",$C10=$B$6),1,0))","v":0},{"$f":"IF($C10=$B$7,F10,0)","v":0},{"$f":"(IF(AND($E10=\"\",$C10=$B$7),1,0))","v":0},null,null,102.5,101.9,{"v":102,"d":"102.0"},{"$f":"U10+V10+W10","v":306.4},{"$f":"IF(X10=D10,1,0)","v":1},{"$f":"IF(X10=0,0,1)","v":1},{"$f":"IF(Y10+Z10=2,\"Korrekt\",\"\")","v":"Korrekt"}]
[2,{"$f":"'Wettkampf 1'!B11","v":"Gerd Vogel "},{"$f":"'Wettkampf 1'!C11","v":"Breddenb.-Heid. I"},{"$f":"X11","v":308.6},null,{"$f":"IF(E11=\"x\",\"0\",D11)","v":308.6},{"$f":"IF(C11=$B$2,F11,0)","v":308.6},{"$f":"(IF(AND($E11=\"\",$C11=$B$2),1,0))","v":1},{"$f":"IF($C11=$B$3,F11,0)","v":0},{"$f":"(IF(AND($E11=\"\",$C11=$B$3),1,0))","v":0},{"$f":"IF($C11=$B$4,F11,0)","v":0},{"$f":"(IF(AND($E11=\"\",$C11=$B$4),1,0))","v":0},{"$f":"IF($C11=$B$5,F11,0)","v":0},{"$f":"(IF(AND($E11=\"\",$C11=$B$5),1,0))","v":0},{"$f":"IF($C11=$B$6,F11,0)","v":0},{"$f":"(IF(AND($E11=\"\",$C11=$B$6),1,0))","v":0},{"$f":"IF($C11=$B$7,F11,0)","v":0},{"$f":"(IF(AND($E11=\"\",$C11=$B$7),1,0))","v":0},null,null,101.8,103.3,103.5,{"$f":"U11+V11+W11","v":308.6},{"$f":"IF(X11=D11,1,0)","v":1},{"$f":"IF(X11=0,0,1)","v":1},{"$f":"IF(Y11+Z11=2,\"Korrekt\",\"\")","v":"Korrekt"}]
[3,{"$f":"'Wettkampf 1'!B12","v":"Heinz Engbers"},{"$f":"'Wettkampf 1'!C12","v":"Breddenb.-Heid. I"},311.8,null,311.8,311.8,1,0,0,0,0,0,0,0,0,0,0,null,null,104.4,102.7,104.7,311.8,1,1,"Korrekt"]
[4,{"$f":"'Wettkampf 1'!B13","v":"Willi Engbers"},{"$f":"'Wettkampf 1'!C13","v":"Breddenb.-Heid. I"},{"v":307.20000000000005,"d":"307.2"},null,{"v":307.20000000000005,"d":"307.2"},307.20000000000005,1,0,0,0,0,0,0,0,0,0,0,null,null,103.4,101.4,102.4,{"v":307.20000000000005,"d":"307.2"},1,1,"Korrekt"]
[5,{"$f":"'Wettkampf 1'!B14","v":"Hans Gebken 1"},{"$f":"'Wettkampf 1'!C14","v":"Breddenb.-Heid. I"},306.4,"x","0","0",0,0,0,0,0,0,0,0,0,0,0,null,null,101.4,102.4,102.6,306.4,1,1,"Korrekt"]
[6,{"$f":"'Wettkampf 1'!B15","v":"Philipp Schmidt"},{"$f":"'Wettkampf 1'!C15","v":"Ostenwalde II"},317.1,null,317.1,0,0,317.1,1,0,0,0,0,0,0,0,0,null,null,105.4,105.5,106.2,317.1,1,1,"Korrekt"]
[7,{"$f":"'Wettkampf 1'!B16","v":"Philipp Scholübbers "},{"$f":"'Wettkampf 1'!C16","v":"Ostenwalde II"},{"v":311.70000000000005,"d":"311.7"},null,{"v":311.70000000000005,"d":"311.7"},0,0,311.70000000000005,1,0,0,0,0,0,0,0,0,null,null,102.2,105.1,104.4,{"v":311.70000000000005,"d":"311.7"},1,1,"Korrekt"]
[8,{"$f":"'Wettkampf 1'!B17","v":"Matthias Brinkmann"},{"$f":"'Wettkampf 1'!C17","v":"Ostenwalde II"},309.9,null,309.9,0,0,309.9,1,0,0,0,0,0,0,0,0,null,null,104.3,103.8,101.8,309.9,1,1,"Korrekt"]
[9,{"$f":"'Wettkampf 1'!B18","v":"Patrik Krüßel"},{"$f":"'Wettkampf 1'!C18","v":"Ostenwalde II"},305.4,"x","0",0,0,"0",0,0,0,0,0,0,0,0,0,null,null,101.5,102.5,101.4,305.4,1,1,"Korrekt"]
[10,{"$f":"'Wettkampf 1'!B19","v":"Markus Jansen"},{"$f":"'Wettkampf 1'!C19","v":"Ostenwalde II"},{"v":308,"d":"308.0"},null,{"v":308,"d":"308.0"},0,0,308,1,0,0,0,0,0,0,0,0,null,null,101.5,103.3,103.2,{"v":308,"d":"308.0"},1,1,"Korrekt"]
[11,{"$f":"'Wettkampf 1'!B20","v":"Helmut Benten "},{"$f":"'Wettkampf 1'!C20","v":"Ostenwalde II"},302.3,"x","0",0,0,"0",0,0,0,0,0,0,0,0,0,null,null,98.7,99.9,103.7,302.3,1,1,"Korrekt"]
[12,{"$f":"'Wettkampf 1'!B21","v":"Heinz Dirksen"},{"$f":"'Wettkampf 1'!C21","v":"Börgermoor II"},{"v":306.29999999999995,"d":"306.3"},null,{"v":306.29999999999995,"d":"306.3"},0,0,0,0,306.29999999999995,1,0,0,0,0,0,0,null,null,100.7,101.5,104.1,{"v":306.29999999999995,"d":"306.3"},1,1,"Korrekt"]
[13,{"$f":"'Wettkampf 1'!B22","v":"Hans Ortmann "},{"$f":"'Wettkampf 1'!C22","v":"Börgermoor II"},306.7,null,306.7,0,0,0,0,306.7,1,0,0,0,0,0,0,null,null,102.7,{"v":102,"d":"102.0"},{"v":102,"d":"102.0"},306.7,1,1,"Korrekt"]
[14,{"$f":"'Wettkampf 1'!B23","v":"Karl-Heinz Ortmann"},{"$f":"'Wettkampf 1'!C23","v":"Börgermoor II"},306.4,null,306.4,0,0,0,0,306.4,1,0,0,0,0,0,0,null,null,100.4,102.8,103.2,306.4,1,1,"Korrekt"]
[15,{"$f":"'Wettkampf 1'!B24","v":"Johannes Jansen"},{"$f":"'Wettkampf 1'!C24","v":"Börgermoor II"},{"v":314.20000000000005,"d":"314.2"},null,{"v":314.20000000000005,"d":"314.2"},0,0,0,0,314.20000000000005,1,0,0,0,0,0,0,null,null,103.6,104.7,105.9,{"v":314.20000000000005,"d":"314.2"},1,1,"Korrekt"]
[16,{"$f":"'Wettkampf 1'!B25","v":"Kevin Minnert"},{"$f":"'Wettkampf 1'!C25","v":"Börgermoor II"},305.1,"x","0",0,0,0,0,"0",0,0,0,0,0,0,0,null,null,101.4,103.1,100.6,305.1,1,1,"Korrekt"]
[17,{"$f":"'Wettkampf 1'!B26","v":"Daniel Schülke"},{"$f":"'Wettkampf 1'!C26","v":"Börgermoor II"},{"v":0,"d":"0.0"},"x","0",0,0,0,0,"0",0,0,0,0,0,0,0,{"$nulls":5},{"v":0,"d":"0.0"},1,0,""]
[18,{"$f":"'Wettkampf 1'!B27","v":"Frank Wotte"},{"$f":"'Wettkampf 1'!C27","v":"Lorup III"},313.6,null,313.6,0,0,0,0,0,0,313.6,1,0,0,0,0,null,null,104.6,{"v":104,"d":"104.0"},{"v":105,"d":"105.0"},313.6,1,1,"Korrekt"]
[19,{"$f":"'Wettkampf 1'!B28","v":"Johannes Wesseln"},{"$f":"'Wettkampf 1'!C28","v":"Lorup III"},{"v":308.70000000000005,"d":"308.7"},null,{"v":308.70000000000005,"d":"308.7"},0,0,0,0,0,0,308.70000000000005,1,0,0,0,0,null,null,103.3,{"v":104,"d":"104.0"},101.4,{"v":308.70000000000005,"d":"308.7"},1,1,"Korrekt"]
[20,{"$f":"'Wettkampf 1'!B29","v":"Anton Oldiges"},{"$f":"'Wettkampf 1'!C29","v":"Lorup III"},309.2,null,309.2,0,0,0,0,0,0,309.2,1,0,0,0,0,null,null,103.2,103.8,102.2,309.2,1,1,"Korrekt"]
[21,{"$f":"'Wettkampf 1'!B30","v":"Jürgen Will"},{"$f":"'Wettkampf 1'!C30","v":"Lorup III"},{"v":310,"d":"310.0"},null,{"v":310,"d":"310.0"},0,0,0,0,0,0,310,1,0,0,0,0,null,null,103.7,103.5,102.8,{"v":310,"d":"310.0"},1,1,"Korrekt"]
[22,{"$f":"'Wettkampf 1'!B31","v":"Schütze 22"},{"$f":"'Wettkampf 1'!C31","v":"Lorup III"},{"v":0,"d":"0.0"},"x","0",0,0,0,0,0,0,"0",0,0,0,0,0,{"$nulls":5},{"v":0,"d":"0.0"},1,0,""]
[23,{"$f":"'Wettkampf 1'!B32","v":"Schütze 23"},{"$f":"'Wettkampf 1'!C32","v":"Lorup III"},{"v":0,"d":"0.0"},"x","0",0,0,0,0,0,0,"0",0,0,0,0,0,{"$nulls":5},{"v":0,"d":"0.0"},1,0,""]
[24,{"$f":"'Wettkampf 1'!B33","v":"Norbert Jansen"},{"$f":"'Wettkampf 1'!C33","v":"Breddenb.-Heid. III"},310.3,null,310.3,0,0,0,0,0,0,0,0,310.3,1,0,0,null,null,103.4,102.7,104.2,310.3,1,1,"Korrekt"]
[25,{"$f":"'Wettkampf 1'!B34","v":"Werner Jansen"},{"$f":"'Wettkampf 1'!C34","v":"Breddenb.-Heid. III"},{"v":309,"d":"309.0"},"x","0",0,0,0,0,0,0,0,0,"0",0,0,0,null,null,103.7,103.3,{"v":102,"d":"102.0"},{"v":309,"d":"309.0"},1,1,"Korrekt"]
[26,{"$f":"'Wettkampf 1'!B35","v":"Alfons Plüster"},{"$f":"'Wettkampf 1'!C35","v":"Breddenb.-Heid. III"},{"v":306.29999999999995,"d":"306.3"},null,{"v":306.29999999999995,"d":"306.3"},0,0,0,0,0,0,0,0,306.29999999999995,1,0,0,null,null,101.2,102.5,102.6,{"v":306.29999999999995,"d":"306.3"},1,1,"Korrekt"]
[27,{"$f":"'Wettkampf 1'!B36","v":"Johannes Oldiges"},{"$f":"'Wettkampf 1'!C36","v":"Breddenb.-Heid. III"},{"v":305.79999999999995,"d":"305.8"},"x","0",0,0,0,0,0,0,0,0,"0",0,0,0,null,null,101.8,100.4,103.6,{"v":305.79999999999995,"d":"305.8"},1,1,"Korrekt"]
[28,{"$f":"'Wettkampf 1'!B37","v":"Hans Plüster"},{"$f":"'Wettkampf 1'!C37","v":"Breddenb.-Heid. III"},313.4,null,313.4,0,0,0,0,0,0,0,0,313.4,1,0,0,null,null,103.6,105.7,104.1,313.4,1,1,"Korrekt"]
[29,{"$f":"'Wettkampf 1'!B38","v":"Josef Wübben "},{"$f":"'Wettkampf 1'!C38","v":"Breddenb.-Heid. III"},301.5,null,301.5,0,0,0,0,0,0,0,0,301.5,1,0,0,null,null,102.3,99.6,99.6,301.5,1,1,"Korrekt"]
[30,{"$f":"'Wettkampf 1'!B39","v":"Thomas Niermann"},{"$f":"'Wettkampf 1'!C39","v":"Werlte III"},315.3,"x","0",0,0,0,0,0,0,0,0,0,0,"0",0,null,null,105.1,104.9,105.3,315.3,1,1,"Korrekt"]
[31,{"$f":"'Wettkampf 1'!B40","v":"Bernd Thien"},{"$f":"'Wettkampf 1'!C40","v":"Werlte III"},313.7,null,313.7,0,0,0,0,0,0,0,0,0,0,313.7,1,null,null,105.2,103.8,104.7,313.7,1,1,"Korrekt"]
[32,{"$f":"'Wettkampf 1'!B41","v":"Norbert Grünloh "},{"$f":"'Wettkampf 1'!C41","v":"Werlte III"},309.5,null,309.5,0,0,0,0,0,0,0,0,0,0,309.5,1,null,null,104.2,101.8,103.5,309.5,1,1,"Korrekt"]
[33,{"$f":"'Wettkampf 1'!B42","v":"Andreas Thoben "},{"$f":"'Wettkampf 1'!C42","v":"Werlte III"},312.7,null,312.7,0,0,0,0,0,0,0,0,0,0,312.7,1,null,null,105.4,102.5,104.8,312.7,1,1,"Korrekt"]
[34,{"$f":"'Wettkampf 1'!B43","v":"Hermann Krone "},{"$f":"'Wettkampf 1'!C43","v":"Werlte III"},306.8,"x","0",0,0,0,0,0,0,0,0,0,0,"0",0,null,null,102.9,100.6,103.3,306.8,1,1,"Korrekt"]
[35,{"$f":"'Wettkampf 1'!B44","v":"Michael Freitag "},{"$f":"'Wettkampf 1'!C44","v":"Werlte III"},315.7,null,315.7,0,0,0,0,0,0,0,0,0,0,315.7,1,null,null,106.7,{"v":105,"d":"105.0"},{"v":104,"d":"104.0"},315.7,1,1,"Korrekt"]
[36,{"$f":"'Wettkampf 1'!B45","v":"Joachim Niermann"},{"$f":"'Wettkampf 1'!C45","v":"Werlte III"},306.6,"x","0",0,0,0,0,0,0,0,0,0,0,"0",0,null,null,102.1,102.2,102.3,306.6,1,1,"Korrekt"]
[{"$nulls":6},{"$f":"LARGE(G10:G45,1)+LARGE(G10:G45,2)+LARGE(G10:G45,3)","v":927.6000000000001},{"$f":"SUM(H10:H45)","v":4},{"$f":"LARGE(I10:I45,1)+LARGE(I10:I45,2)+LARGE(I10:I45,3)","v":938.7},{"$f":"SUM(J10:J45)","v":4},{"$f":"LARGE(K10:K45,1)+LARGE(K10:K45,2)+LARGE(K10:K45,3)","v":927.3000000000001},{"$f":"SUM(L10:L45)","v":4},{"$f":"LARGE(M10:M45,1)+LARGE(M10:M45,2)+LARGE(M10:M45,3)","v":932.8},{"$f":"SUM(N10:N45)","v":4},{"$f":"LARGE(O10:O45,1)+LARGE(O10:O45,2)+LARGE(O10:O45,3)","v":930},{"$f":"SUM(P10:P45)","v":4},{"$f":"LARGE(Q10:Q45,1)+LARGE(Q10:Q45,2)+LARGE(Q10:Q45,3)","v":942.0999999999999},{"$f":"SUM(R10:S45)","v":4}]
[null,null,"per Email an: sk-huemmling@gmx.de"]

{"sheet":"9","index":9,"n_rows":47,"n_cols":27,"rows_kept":47,"merged":[[0,22,0,23],[1,22,1,23],[4,22,4,23],[5,22,5,23],[6,22,6,23],[8,20,8,23]]}
[null,"Verein / Gruppe",null,"Ergebnisse",{"$nulls":17},"Austragungsort:",{"$f":"Übersicht!N4","v":"Börgermoor"}]
[1,{"$f":"'Wettkampf 1'!B2","v":"Breddenb.-Heid. I"},null,{"$f":"G46","v":934.3},{"$f":"IF(H46>4,\"Es sind zu viele Schützen in Wertung!\",\" \")","v":" "},{"$nulls":16},"Wettkampftag:",{"$f":"Übersicht!N3","v":"16.02."}]
[2,{"$f":"'Wettkampf 1'!B3","v":"Ostenwalde II"},null,{"$f":"I46","v":943.5},{"$f":"IF(J46>4,\"Es sind zu viele Schützen in Wertung!\",\" \")","v":" "}]
[3,{"$f":"'Wettkampf 1'!B4","v":"Börgermoor II"},null,{"$f":"K46","v":934.4},{"$f":"IF(L46>4,\"Es sind zu viele Schützen in Wertung!\",\" \")","v":" "},{"$nulls":18},"Ansprechpartner für Rückfragen:"]
[4,{"$f":"'Wettkampf 1'!B5","v":"Lorup III"},null,{"$f":"M46","v":{"v":933.8999999999999,"d":"933.9"}},{"$f":"IF(N46>4,\"Es sind zu viele Schützen in Wertung!\",\" \")","v":" "},{"$nulls":16},"Name:","Joh. Jansen"]
[5,{"$f":"'Wettkampf 1'!B6","v":"Breddenb.-Heid. III"},null,{"$f":"O46","v":938.2},{"$f":"IF(P46>4,\"Es sind zu viele Schützen in Wertung!\",\" \")","v":" "},{"$nulls":16},"Tel:","0496171298"]
[6,{"$f":"'Wettkampf 1'!B7","v":"Werlte III"},null,{"$f":"Q46","v":940.5},{"$f":"IF(R46>4,\"Es sind zu viele Schützen in Wertung!\",\" \")","v":" "},{"$nulls":16},"Standaufsicht:","H. Dirksen"]
[]
[null,"Einzelergebnisse:","Verein / Gruppe","Ergebnisse (mindestens 0 eintragen)","AW? Dann x eintippen",null,"Verein 1",null,"Verein 2",null,"Verein 3",null,"Verein 4",null,"Verein 5",null,"Verein 6",{"$nulls":3},"Proberechnung bei Streifen:"]
[1,{"$f":"'Wettkampf 1'!B10","v":"Hans Gebken 3"},{"$f":"'Wettkampf 1'!C10","v":"Breddenb.-Heid. I"},310.5,null,{"$f":"IF(E10=\"x\",\"0\",D10)","v":310.5},{"$f":"IF(C10=$B$2,F10,0)","v":310.5},{"$f":"(IF(AND($E10=\"\",$C10=$B$2),1,0))","v":1},{"$f":"IF($C10=$B$3,F10,0)","v":0},{"$f":"(IF(AND($E10=\"\",$C10=$B$3),1,0))","v":0},{"$f":"IF($C10=$B$4,F10,0)","v":0},{"$f":"(IF(AND($E10=\"\",$C10=$B$4),1,0))","v":0},{"$f":"IF($C10=$B$5,F10,0)","v":0},{"$f":"(IF(AND($E10=\"\",$C10=$B$5),1,0))","v":0},{"$f":"IF($C10=$B$6,F10,0)","v":0},{"$f":"(IF(AND($E10=\"\",$C10=$B$6),1,0))","v":0},{"$f":"IF($C10=$B$7,F10,0)","v":0},{"$f":"(IF(AND($E10=\"\",$C10=$B$7),1,0))","v":0},null,null,104.3,103.4,102.8,{"$f":"U10+V10+W10","v":310.5},{"$f":"IF(X10=D10,1,0)","v":1},{"$f":"IF(X10=0,0,1)","v":1},{"$f":"IF(Y10+Z10=2,\"Korrekt\",\"\")","v":"Korrekt"}]
[2,{"$f":"'Wettkampf 1'!B11","v":"Gerd Vogel "},{"$f":"'Wettkampf 1'!C11","v":"Breddenb.-Heid. I"},313.2,null,{"$f":"IF(E11=\"x\",\"0\",D11)","v":313.2},{"$f":"IF(C11=$B$2,F11,0)","v":313.2},{"$f":"(IF(AND($E11=\"\",$C11=$B$2),1,0))","v":1},{"$f":"IF($C11=$B$3,F11,0)","v":0},{"$f":"(IF(AND($E11=\"\",$C11=$B$3),1,0))","v":0},{"$f":"IF($C11=$B$4,F11,0)","v":0},{"$f":"(IF(AND($E11=\"\",$C11=$B$4),1,0))","v":0},{"$f":"IF($C11=$B$5,F11,0)","v":0},{"$f":"(IF(AND($E11=\"\",$C11=$B$5),1,0))","v":0},{"$f":"IF($C11=$B$6,F11,0)","v":0},{"$f":"(IF(AND($E11=\"\",$C11=$B$6),1,0))","v":0},{"$f":"IF($C11=$B$7,F11,0)","v":0},{"$f":"(IF(AND($E11=\"\",$C11=$B$7),1,0))","v":0},null,null,104.1,104.1,{"v":105,"d":"105.0"},{"$f":"U11+V11+W11","v":313.2},{"$f":"IF(X11=D11,1,0)","v":1},{"$f":"IF(X11=0,0,1)","v":1},{"$f":"IF(Y11+Z11=2,\"Korrekt\",\"\")","v":"Korrekt"}]
[3,{"$f":"'Wettkampf 1'!B12","v":"Heinz Engbers"},{"$f":"'Wettkampf 1'!C12","v":"Breddenb.-Heid. I"},308.8,"x","0","0",0,0,0,0,0,0,0,0,0,0,0,null,null,103.3,102.1,103.4,{"v":308.79999999999995,"d":"308.8"},1,1,"Korrekt"]
[4,{"$f":"'Wettkampf 1'!B13","v":"Willi Engbers"},{"$f":"'Wettkampf 1'!C13","v":"Breddenb.-Heid. I"},310.6,null,310.6,310.6,1,0,0,0,0,0,0,0,0,0,0,null,null,{"v":105,"d":"105.0"},102.2,103.4,310.6,1,1,"Korrekt"]
[5,{"$f":"'Wettkampf 1'!B14","v":"Hans Gebken 1"},{"$f":"'Wettkampf 1'!C14","v":"Breddenb.-Heid. I"},307.7,"x","0","0",0,0,0,0,0,0,0,0,0,0,0,null,null,{"v":102,"d":"102.0"},103.4,102.3,307.7,1,1,"Korrekt"]
[6,{"$f":"'Wettkampf 1'!B15","v":"Philipp Schmidt"},{"$f":"'Wettkampf 1'!C15","v":"Ostenwalde II"},316.9,null,316.9,0,0,316.9,1,0,0,0,0,0,0,0,0,null,null,105.8,{"v":106,"d":"106.0"},105.1,316.9,1,1,"Korrekt"]
[7,{"$f":"'Wettkampf 1'!B16","v":"Philipp Scholübbers "},{"$f":"'Wettkampf 1'!C16","v":"Ostenwalde II"},{"v":316,"d":"316.0"},null,{"v":316,"d":"316.0"},0,0,316,1,0,0,0,0,0,0,0,0,null,null,104.6,104.9,106.5,{"v":316,"d":"316.0"},1,1,"Korrekt"]
[8,{"$f":"'Wettkampf 1'!B17","v":"Matthias Brinkmann"},{"$f":"'Wettkampf 1'!C17","v":"Ostenwalde II"},{"v":309,"d":"309.0"},null,{"v":309,"d":"309.0"},0,0,309,1,0,0,0,0,0,0,0,0,null,null,103.8,102.3,102.9,{"v":309,"d":"309.0"},1,1,"Korrekt"]
[9,{"$f":"'Wettkampf 1'!B18","v":"Patrik Krüßel"},{"$f":"'Wettkampf 1'!C18","v":"Ostenwalde II"},310.6,null,310.6,0,0,310.6,1,0,0,0,0,0,0,0,0,null,null,103.9,103.1,103.6,310.6,1,1,"Korrekt"]
[10,{"$f":"'Wettkampf 1'!B19","v":"Markus Jansen"},{"$f":"'Wettkampf 1'!C19","v":"Ostenwalde II"},311.3,"x","0",0,0,"0",0,0,0,0,0,0,0,0,0,null,null,102.6,103.8,104.9,{"v":311.29999999999995,"d":"311.3"},1,1,"Korrekt"]
[11,{"$f":"'Wettkampf 1'!B20","v":"Helmut Benten "},{"$f":"'Wettkampf 1'!C20","v":"Ostenwalde II"},{"v":307,"d":"307.0"},"x","0",0,0,"0",0,0,0,0,0,0,0,0,0,null,null,103.5,102.4,101.1,{"v":307,"d":"307.0"},1,1,"Korrekt"]
[12,{"$f":"'Wettkampf 1'!B21","v":"Heinz Dirksen"},{"$f":"'Wettkampf 1'!C21","v":"Börgermoor II"},310.9,null,310.9,0,0,0,0,310.9,1,0,0,0,0,0,0,null,null,104.6,102.8,103.5,310.9,1,1,"Korrekt"]
[13,{"$f":"'Wettkampf 1'!B22","v":"Hans Ortmann "},{"$f":"'Wettkampf 1'!C22","v":"Börgermoor II"},308.8,null,308.8,0,0,0,0,308.8,1,0,0,0,0,0,0,null,null,{"v":104,"d":"104.0"},101.9,102.9,308.8,1,1,"Korrekt"]
[14,{"$f":"'Wettkampf 1'!B23","v":"Karl-Heinz Ortmann"},{"$f":"'Wettkampf 1'!C23","v":"Börgermoor II"},{"v":313,"d":"313.0"},null,{"v":313,"d":"313.0"},0,0,0,0,313,1,0,0,0,0,0,0,null,null,104.5,103.2,105.3,{"v":313,"d":"313.0"},1,1,"Korrekt"]
[15,{"$f":"'Wettkampf 1'!B24","v":"Johannes Jansen"},{"$f":"'Wettkampf 1'!C24","v":"Börgermoor II"},310.5,null,310.5,0,0,0,0,310.5,1,0,0,0,0,0,0,null,null,{"v":103,"d":"103.0"},102.2,105.3,310.5,1,1,"Korrekt"]
[16,{"$f":"'Wettkampf 1'!B25","v":"Kevin Minnert"},{"$f":"'Wettkampf 1'!C25","v":"Börgermoor II"},null,"x","0",0,0,0,0,"0",0,0,0,0,0,0,0,{"$nulls":5},{"v":0,"d":"0.0"},1,0,""]
[17,{"$f":"'Wettkampf 1'!B26","v":"Daniel Schülke"},{"$f":"'Wettkampf 1'!C26","v":"Börgermoor II"},292.5,"x","0",0,0,0,0,"0",0,0,0,0,0,0,0,null,null,98.2,96.2,98.1,292.5,1,1,"Korrekt"]
[18,{"$f":"'Wettkampf 1'!B27","v":"Frank Wotte"},{"$f":"'Wettkampf 1'!C27","v":"Lorup III"},314.2,null,314.2,0,0,0,0,0,0,314.2,1,0,0,0,0,null,null,104.9,{"v":105,"d":"105.0"},104.3,314.2,1,1,"Korrekt"]
[19,{"$f":"'Wettkampf 1'!B28","v":"Johannes Wesseln"},{"$f":"'Wettkampf 1'!C28","v":"Lorup III"},307.9,"x","0",0,0,0,0,0,0,"0",0,0,0,0,0,null,null,102.9,102.4,102.6,307.9,1,1,"Korrekt"]
[20,{"$f":"'Wettkampf 1'!B29","v":"Anton Oldiges"},{"$f":"'Wettkampf 1'!C29","v":"Lorup III"},308.8,null,308.8,0,0,0,0,0,0,308.8,1,0,0,0,0,null,null,101.7,102.6,104.5,308.8,1,1,"Korrekt"]
[21,{"$f":"'Wettkampf 1'!B30","v":"Jürgen Will"},{"$f":"'Wettkampf 1'!C30","v":"Lorup III"},310.9,null,310.9,0,0,0,0,0,0,310.9,1,0,0,0,0,null,null,104.5,103.4,{"v":103,"d":"103.0"},310.9,1,1,"Korrekt"]
[22,{"$f":"'Wettkampf 1'!B31","v":"Schütze 22"},{"$f":"'Wettkampf 1'!C31","v":"Lorup III"},null,"x","0",0,0,0,0,0,0,"0",0,0,0,0,0,{"$nulls":5},{"v":0,"d":"0.0"},1,0,""]
[23,{"$f":"'Wettkampf 1'!B32","v":"Schütze 23"},{"$f":"'Wettkampf 1'!C32","v":"Lorup III"},null,"x","0",0,0,0,0,0,0,"0",0,0,0,0,0,{"$nulls":5},{"v":0,"d":"0.0"},1,0,""]
[24,{"$f":"'Wettkampf 1'!B33","v":"Norbert Jansen"},{"$f":"'Wettkampf 1'!C33","v":"Breddenb.-Heid. III"},311.3,null,311.3,0,0,0,0,0,0,0,0,311.3,1,0,0,null,null,104.2,104.1,{"v":103,"d":"103.0"},311.3,1,1,"Korrekt"]
[25,{"$f":"'Wettkampf 1'!B34","v":"Werner Jansen"},{"$f":"'Wettkampf 1'!C34","v":"Breddenb.-Heid. III"},312.6,null,312.6,0,0,0,0,0,0,0,0,312.6,1,0,0,null,null,{"v":104,"d":"104.0"},104.3,104.3,312.6,1,1,"Korrekt"]
[26,{"$f":"'Wettkampf 1'!B35","v":"Alfons Plüster"},{"$f":"'Wettkampf 1'!C35","v":"Breddenb.-Heid. III"},305.1,"x","0",0,0,0,0,0,0,0,0,"0",0,0,0,null,null,{"v":103,"d":"103.0"},98.5,103.6,305.1,1,1,"Korrekt"]
[27,{"$f":"'Wettkampf 1'!B36","v":"Johannes Oldiges"},{"$f":"'Wettkampf 1'!C36","v":"Breddenb.-Heid. III"},307.5,"x","0",0,0,0,0,0,0,0,0,"0",0,0,0,null,null,{"v":102,"d":"102.0"},102.3,103.2,307.5,1,1,"Korrekt"]
[28,{"$f":"'Wettkampf 1'!B37","v":"Hans Plüster"},{"$f":"'Wettkampf 1'!C37","v":"Breddenb.-Heid. III"},314.3,null,314.3,0,0,0,0,0,0,0,0,314.3,1,0,0,null,null,103.7,{"v":105,"d":"105.0"},105.6,{"v":314.29999999999995,"d":"314.3"},1,1,"Korrekt"]
[29,{"$f":"'Wettkampf 1'!B38","v":"Josef Wübben "},{"$f":"'Wettkampf 1'!C38","v":"Breddenb.-Heid. III"},310.6,null,310.6,0,0,0,0,0,0,0,0,310.6,1,0,0,null,null,103.6,105.8,101.2,{"v":310.59999999999997,"d":"310.6"},1,1,"Korrekt"]
[30,{"$f":"'Wettkampf 1'!B39","v":"Thomas Niermann"},{"$f":"'Wettkampf 1'!C39","v":"Werlte III"},{"v":310,"d":"310.0"},"x","0",0,0,0,0,0,0,0,0,0,0,"0",0,null,null,{"v":105,"d":"105.0"},104.1,100.9,{"v":310,"d":"310.0"},1,1,"Korrekt"]
[31,{"$f":"'Wettkampf 1'!B40","v":"Bernd Thien"},{"$f":"'Wettkampf 1'!C40","v":"Werlte III"},317.7,null,317.7,0,0,0,0,0,0,0,0,0,0,317.7,1,null,null,105.1,107.2,105.4,{"v":317.70000000000005,"d":"317.7"},1,1,"Korrekt"]
[32,{"$f":"'Wettkampf 1'!B41","v":"Norbert Grünloh "},{"$f":"'Wettkampf 1'!C41","v":"Werlte III"},311.6,null,311.6,0,0,0,0,0,0,0,0,0,0,311.6,1,null,null,104.2,104.8,102.6,311.6,1,1,"Korrekt"]
[33,{"$f":"'Wettkampf 1'!B42","v":"Andreas Thoben "},{"$f":"'Wettkampf 1'!C42","v":"Werlte III"},307.2,"x","0",0,0,0,0,0,0,0,0,0,0,"0",0,null,null,101.8,102.7,102.7,307.2,1,1,"Korrekt"]
[34,{"$f":"'Wettkampf 1'!B43","v":"Hermann Krone "},{"$f":"'Wettkampf 1'!C43","v":"Werlte III"},{"v":311,"d":"311.0"},null,{"v":311,"d":"311.0"},0,0,0,0,0,0,0,0,0,0,311,1,null,null,102.6,103.5,104.9,{"v":311,"d":"311.0"},1,1,"Korrekt"]
[35,{"$f":"'Wettkampf 1'!B44","v":"Michael Freitag "},{"$f":"'Wettkampf 1'!C44","v":"Werlte III"},311.2,null,311.2,0,0,0,0,0,0,0,0,0,0,311.2,1,null,null,103.1,103.3,104.8,311.2,1,1,"Korrekt"]
[36,{"$f":"'Wettkampf 1'!B45","v":"Joachim Niermann"},{"$f":"'Wettkampf 1'!C45","v":"Werlte III"},306.2,"x","0",0,0,0,0,0,0,0,0,0,0,"0",0,null,null,103.2,101.3,101.7,306.2,1,1,"Korrekt"]
[{"$nulls":6},{"$f":"LARGE(G10:G45,1)+LARGE(G10:G45,2)+LARGE(G10:G45,3)","v":934.3},{"$f":"SUM(H10:H45)","v":3},{"$f":"LARGE(I10:I45,1)+LARGE(I10:I45,2)+LARGE(I10:I45,3)","v":943.5},{"$f":"SUM(J10:J45)","v":4},{"$f":"LARGE(K10:K45,1)+LARGE(K10:K45,2)+LARGE(K10:K45,3)","v":934.4},{"$f":"SUM(L10:L45)","v":4},{"$f":"LARGE(M10:M45,1)+LARGE(M10:M45,2)+LARGE(M10:M45,3)","v":933.8999999999999},{"$f":"SUM(N10:N45)","v":3},{"$f":"LARGE(O10:O45,1)+LARGE(O10:O45,2)+LARGE(O10:O45,3)","v":938.2},{"$f":"SUM(P10:P45)","v":4},{"$f":"LARGE(Q10:Q45,1)+LARGE(Q10:Q45,2)+LARGE(Q10:Q45,3)","v":940.5},{"$f":"SUM(R10:S45)","v":4}]
[null,null,"per Email an: sk-huemmling@gmx.de"]

{"sheet":" 10","index":10,"n_rows":47,"n_cols":27,"rows_kept":47,"merged":[[0,22,0,23],[1,22,1,23],[4,22,4,23],[5,22,5,23],[6,22,6,23],[8,20,8,23]]}
[null,"Verein / Gruppe",null,"Ergebnisse",{"$nulls":17},"Austragungsort:",{"$f":"Übersicht!O4","v":"Lorup"}]
[1,{"$f":"'Wettkampf 1'!B2","v":"Breddenb.-Heid. I"},null,{"$f":"G46","v":{"v":930.6999999999999,"d":"930.7"}},{"$f":"IF(H46>4,\"Es sind zu viele Schützen in Wertung!\",\" \")","v":" "},{"$nulls":16},"Wettkampftag:",{"$f":"Übersicht!O3","v":"01.03."}]
[2,{"$f":"'Wettkampf 1'!B3","v":"Ostenwalde II"},null,{"$f":"I46","v":{"v":934.3000000000001,"d":"934.3"}},{"$f":"IF(J46>4,\"Es sind zu viele Schützen in Wertung!\",\" \")","v":" "}]
[3,{"$f":"'Wettkampf 1'!B4","v":"Börgermoor II"},null,{"$f":"K46","v":{"v":932.1999999999999,"d":"932.2"}},{"$f":"IF(L46>4,\"Es sind zu viele Schützen in Wertung!\",\" \")","v":" "},{"$nulls":18},"Ansprechpartner für Rückfragen:"]
[4,{"$f":"'Wettkampf 1'!B5","v":"Lorup III"},null,{"$f":"M46","v":936.7},{"$f":"IF(N46>4,\"Es sind zu viele Schützen in Wertung!\",\" \")","v":" "},{"$nulls":16},"Name:"]
[5,{"$f":"'Wettkampf 1'!B6","v":"Breddenb.-Heid. III"},null,{"$f":"O46","v":{"v":924.9000000000001,"d":"924.9"}},{"$f":"IF(P46>4,\"Es sind zu viele Schützen in Wertung!\",\" \")","v":" "},{"$nulls":16},"Tel:"]
[6,{"$f":"'Wettkampf 1'!B7","v":"Werlte III"},null,{"$f":"Q46","v":932.3},{"$f":"IF(R46>4,\"Es sind zu viele Schützen in Wertung!\",\" \")","v":" "},{"$nulls":16},"Standaufsicht:","Wesseln Johannes"]
[]
[null,"Einzelergebnisse:","Verein / Gruppe","Ergebnisse (mindestens 0 eintragen)","AW? Dann x eintippen",null,"Verein 1",null,"Verein 2",null,"Verein 3",null,"Verein 4",null,"Verein 5",null,"Verein 6",{"$nulls":3},"Proberechnung bei Streifen:"]
[1,{"$f":"'Wettkampf 1'!B10","v":"Hans Gebken 3"},{"$f":"'Wettkampf 1'!C10","v":"Breddenb.-Heid. I"},310.2,null,{"$f":"IF(E10=\"x\",\"0\",D10)","v":310.2},{"$f":"IF(C10=$B$2,F10,0)","v":310.2},{"$f":"(IF(AND($E10=\"\",$C10=$B$2),1,0))","v":1},{"$f":"IF($C10=$B$3,F10,0)","v":0},{"$f":"(IF(AND($E10=\"\",$C10=$B$3),1,0))","v":0},{"$f":"IF($C10=$B$4,F10,0)","v":0},{"$f":"(IF(AND($E10=\"\",$C10=$B$4),1,0))","v":0},{"$f":"IF($C10=$B$5,F10,0)","v":0},{"$f":"(IF(AND($E10=\"\",$C10=$B$5),1,0))","v":0},{"$f":"IF($C10=$B$6,F10,0)","v":0},{"$f":"(IF(AND($E10=\"\",$C10=$B$6),1,0))","v":0},{"$f":"IF($C10=$B$7,F10,0)","v":0},{"$f":"(IF(AND($E10=\"\",$C10=$B$7),1,0))","v":0},null,null,104.3,102.9,{"v":103,"d":"103.0"},{"$f":"U10+V10+W10","v":310.2},{"$f":"IF(X10=D10,1,0)","v":1},{"$f":"IF(X10=0,0,1)","v":1},{"$f":"IF(Y10+Z10=2,\"Korrekt\",\"\")","v":"Korrekt"}]
[2,{"$f":"'Wettkampf 1'!B11","v":"Gerd Vogel "},{"$f":"'Wettkampf 1'!C11","v":"Breddenb.-Heid. I"},310.1,null,{"$f":"IF(E11=\"x\",\"0\",D11)","v":310.1},{"$f":"IF(C11=$B$2,F11,0)","v":310.1},{"$f":"(IF(AND($E11=\"\",$C11=$B$2),1,0))","v":1},{"$f":"IF($C11=$B$3,F11,0)","v":0},{"$f":"(IF(AND($E11=\"\",$C11=$B$3),1,0))","v":0},{"$f":"IF($C11=$B$4,F11,0)","v":0},{"$f":"(IF(AND($E11=\"\",$C11=$B$4),1,0))","v":0},{"$f":"IF($C11=$B$5,F11,0)","v":0},{"$f":"(IF(AND($E11=\"\",$C11=$B$5),1,0))","v":0},{"$f":"IF($C11=$B$6,F11,0)","v":0},{"$f":"(IF(AND($E11=\"\",$C11=$B$6),1,0))","v":0},{"$f":"IF($C11=$B$7,F11,0)","v":0},{"$f":"(IF(AND($E11=\"\",$C11=$B$7),1,0))","v":0},null,null,100.9,103.5,105.7,{"$f":"U11+V11+W11","v":310.1},{"$f":"IF(X11=D11,1,0)","v":1},{"$f":"IF(X11=0,0,1)","v":1},{"$f":"IF(Y11+Z11=2,\"Korrekt\",\"\")","v":"Korrekt"}]
[3,{"$f":"'Wettkampf 1'!B12","v":"Heinz Engbers"},{"$f":"'Wettkampf 1'!C12","v":"Breddenb.-Heid. I"},310.4,null,310.4,310.4,1,0,0,0,0,0,0,0,0,0,0,null,null,103.4,102.4,104.6,310.4,1,1,"Korrekt"]
[4,{"$f":"'Wettkampf 1'!B13","v":"Willi Engbers"},{"$f":"'Wettkampf 1'!C13","v":"Breddenb.-Heid. I"},309.7,null,309.7,309.7,1,0,0,0,0,0,0,0,0,0,0,null,null,102.6,104.2,102.9,{"v":309.70000000000005,"d":"309.7"},1,1,"Korrekt"]
[5,{"$f":"'Wettkampf 1'!B14","v":"Hans Gebken 1"},{"$f":"'Wettkampf 1'!C14","v":"Breddenb.-Heid. I"},306.2,"x","0","0",0,0,0,0,0,0,0,0,0,0,0,null,null,101.3,103.2,101.7,306.2,1,1,"Korrekt"]
[6,{"$f":"'Wettkampf 1'!B15","v":"Philipp Schmidt"},{"$f":"'Wettkampf 1'!C15","v":"Ostenwalde II"},313.6,null,313.6,0,0,313.6,1,0,0,0,0,0,0,0,0,null,null,104.7,104.5,104.4,313.6,1,1,"Korrekt"]
[7,{"$f":"'Wettkampf 1'!B16","v":"Philipp Scholübbers "},{"$f":"'Wettkampf 1'!C16","v":"Ostenwalde II"},303.3,null,303.3,0,0,303.3,1,0,0,0,0,0,0,0,0,null,null,103.1,95.9,104.3,303.3,1,1,"Korrekt"]
[8,{"$f":"'Wettkampf 1'!B17","v":"Matthias Brinkmann"},{"$f":"'Wettkampf 1'!C17","v":"Ostenwalde II"},309.8,"x","0",0,0,"0",0,0,0,0,0,0,0,0,0,null,null,102.3,{"v":103,"d":"103.0"},104.5,309.8,1,1,"Korrekt"]
[9,{"$f":"'Wettkampf 1'!B18","v":"Patrik Krüßel"},{"$f":"'Wettkampf 1'!C18","v":"Ostenwalde II"},309.9,null,309.9,0,0,309.9,1,0,0,0,0,0,0,0,0,null,null,104.4,101.7,103.8,{"v":309.90000000000003,"d":"309.9"},1,1,"Korrekt"]
[10,{"$f":"'Wettkampf 1'!B19","v":"Markus Jansen"},{"$f":"'Wettkampf 1'!C19","v":"Ostenwalde II"},310.8,null,310.8,0,0,310.8,1,0,0,0,0,0,0,0,0,null,null,104.2,104.7,101.9,310.8,1,1,"Korrekt"]
[11,{"$f":"'Wettkampf 1'!B20","v":"Helmut Benten "},{"$f":"'Wettkampf 1'!C20","v":"Ostenwalde II"},307.1,"x","0",0,0,"0",0,0,0,0,0,0,0,0,0,null,null,102.5,103.1,101.5,307.1,1,1,"Korrekt"]
[12,{"$f":"'Wettkampf 1'!B21","v":"Heinz Dirksen"},{"$f":"'Wettkampf 1'!C21","v":"Börgermoor II"},306.9,null,306.9,0,0,0,0,306.9,1,0,0,0,0,0,0,null,null,{"v":103,"d":"103.0"},101.3,102.6,306.9,1,1,"Korrekt"]
[13,{"$f":"'Wettkampf 1'!B22","v":"Hans Ortmann "},{"$f":"'Wettkampf 1'!C22","v":"Börgermoor II"},310.1,null,310.1,0,0,0,0,310.1,1,0,0,0,0,0,0,null,null,104.8,101.5,103.8,310.1,1,1,"Korrekt"]
[14,{"$f":"'Wettkampf 1'!B23","v":"Karl-Heinz Ortmann"},{"$f":"'Wettkampf 1'!C23","v":"Börgermoor II"},310.2,null,310.2,0,0,0,0,310.2,1,0,0,0,0,0,0,null,null,102.1,103.4,104.7,310.2,1,1,"Korrekt"]
[15,{"$f":"'Wettkampf 1'!B24","v":"Johannes Jansen"},{"$f":"'Wettkampf 1'!C24","v":"Börgermoor II"},311.9,null,311.9,0,0,0,0,311.9,1,0,0,0,0,0,0,null,null,{"v":104,"d":"104.0"},{"v":104,"d":"104.0"},103.9,311.9,1,1,"Korrekt"]
[16,{"$f":"'Wettkampf 1'!B25","v":"Kevin Minnert"},{"$f":"'Wettkampf 1'!C25","v":"Börgermoor II"},null,"x","0",0,0,0,0,"0",0,0,0,0,0,0,0,{"$nulls":5},{"v":0,"d":"0.0"},1,0,""]
[17,{"$f":"'Wettkampf 1'!B26","v":"Daniel Schülke"},{"$f":"'Wettkampf 1'!C26","v":"Börgermoor II"},{"v":301,"d":"301.0"},"x","0",0,0,0,0,"0",0,0,0,0,0,0,0,null,null,101.5,98.5,{"v":101,"d":"101.0"},{"v":301,"d":"301.0"},1,1,"Korrekt"]
[18,{"$f":"'Wettkampf 1'!B27","v":"Frank Wotte"},{"$f":"'Wettkampf 1'!C27","v":"Lorup III"},314.2,null,314.2,0,0,0,0,0,0,314.2,1,0,0,0,0,null,null,104.8,105.7,103.7,314.2,1,1,"Korrekt"]
[19,{"$f":"'Wettkampf 1'!B28","v":"Johannes Wesseln"},{"$f":"'Wettkampf 1'!C28","v":"Lorup III"},311.5,null,311.5,0,0,0,0,0,0,311.5,1,0,0,0,0,null,null,103.5,103.9,104.1,311.5,1,1,"Korrekt"]
[20,{"$f":"'Wettkampf 1'!B29","v":"Anton Oldiges"},{"$f":"'Wettkampf 1'!C29","v":"Lorup III"},{"v":304,"d":"304.0"},"x","0",0,0,0,0,0,0,"0",0,0,0,0,0,null,null,100.2,101.7,102.1,{"v":304,"d":"304.0"},1,1,"Korrekt"]
[21,{"$f":"'Wettkampf 1'!B30","v":"Jürgen Will"},{"$f":"'Wettkampf 1'!C30","v":"Lorup III"},{"v":311,"d":"311.0"},null,{"v":311,"d":"311.0"},0,0,0,0,0,0,311,1,0,0,0,0,null,null,102.6,104.2,104.2,{"v":311,"d":"311.0"},1,1,"Korrekt"]
[22,{"$f":"'Wettkampf 1'!B31","v":"Schütze 22"},{"$f":"'Wettkampf 1'!C31","v":"Lorup III"},null,null,{"v":0,"d":"0.0"},0,0,0,0,0,0,0,1,0,0,0,0,{"$nulls":5},{"v":0,"d":"0.0"},1,0,""]
[23,{"$f":"'Wettkampf 1'!B32","v":"Schütze 23"},{"$f":"'Wettkampf 1'!C32","v":"Lorup III"},null,"x","0",0,0,0,0,0,0,"0",0,0,0,0,0,{"$nulls":5},{"v":0,"d":"0.0"},1,0,""]
[24,{"$f":"'Wettkampf 1'!B33","v":"Norbert Jansen"},{"$f":"'Wettkampf 1'!C33","v":"Breddenb.-Heid. III"},303.6,null,303.6,0,0,0,0,0,0,0,0,303.6,1,0,0,null,null,100.9,100.5,102.2,303.6,1,1,"Korrekt"]
[25,{"$f":"'Wettkampf 1'!B34","v":"Werner Jansen"},{"$f":"'Wettkampf 1'!C34","v":"Breddenb.-Heid. III"},301.2,"x","0",0,0,0,0,0,0,0,0,"0",0,0,0,null,null,101.6,98.5,101.1,301.2,1,1,"Korrekt"]
[26,{"$f":"'Wettkampf 1'!B35","v":"Alfons Plüster"},{"$f":"'Wettkampf 1'!C35","v":"Breddenb.-Heid. III"},304.7,null,304.7,0,0,0,0,0,0,0,0,304.7,1,0,0,null,null,99.5,103.4,101.8,304.7,1,1,"Korrekt"]
[27,{"$f":"'Wettkampf 1'!B36","v":"Johannes Oldiges"},{"$f":"'Wettkampf 1'!C36","v":"Breddenb.-Heid. III"},306.1,"x","0",0,0,0,0,0,0,0,0,"0",0,0,0,null,null,102.5,103.2,100.4,306.1,1,1,"Korrekt"]
[28,{"$f":"'Wettkampf 1'!B37","v":"Hans Plüster"},{"$f":"'Wettkampf 1'!C37","v":"Breddenb.-Heid. III"},311.4,null,311.4,0,0,0,0,0,0,0,0,311.4,1,0,0,null,null,104.9,102.3,104.2,311.4,1,1,"Korrekt"]
[29,{"$f":"'Wettkampf 1'!B38","v":"Josef Wübben "},{"$f":"'Wettkampf 1'!C38","v":"Breddenb.-Heid. III"},308.8,null,308.8,0,0,0,0,0,0,0,0,308.8,1,0,0,null,null,105.9,102.2,100.7,308.8,1,1,"Korrekt"]
[30,{"$f":"'Wettkampf 1'!B39","v":"Thomas Niermann"},{"$f":"'Wettkampf 1'!C39","v":"Werlte III"},307.8,null,307.8,0,0,0,0,0,0,0,0,0,0,307.8,1,null,null,103.5,100.5,103.8,307.8,1,1,"Korrekt"]
[31,{"$f":"'Wettkampf 1'!B40","v":"Bernd Thien"},{"$f":"'Wettkampf 1'!C40","v":"Werlte III"},313.2,null,313.2,0,0,0,0,0,0,0,0,0,0,313.2,1,null,null,105.6,{"v":104,"d":"104.0"},103.6,313.2,1,1,"Korrekt"]
[32,{"$f":"'Wettkampf 1'!B41","v":"Norbert Grünloh "},{"$f":"'Wettkampf 1'!C41","v":"Werlte III"},309.3,null,309.3,0,0,0,0,0,0,0,0,0,0,309.3,1,null,null,105.5,101.4,102.4,309.3,1,1,"Korrekt"]
[33,{"$f":"'Wettkampf 1'!B42","v":"Andreas Thoben "},{"$f":"'Wettkampf 1'!C42","v":"Werlte III"},309.8,null,309.8,0,0,0,0,0,0,0,0,0,0,309.8,1,null,null,102.8,103.7,103.3,309.8,1,1,"Korrekt"]
[34,{"$f":"'Wettkampf 1'!B43","v":"Hermann Krone "},{"$f":"'Wettkampf 1'!C43","v":"Werlte III"},307.9,"x","0",0,0,0,0,0,0,0,0,0,0,"0",0,null,null,102.3,102.7,102.9,307.9,1,1,"Korrekt"]
[35,{"$f":"'Wettkampf 1'!B44","v":"Michael Freitag "},{"$f":"'Wettkampf 1'!C44","v":"Werlte III"},null,"x","0",0,0,0,0,0,0,0,0,0,0,"0",0,{"$nulls":5},{"v":0,"d":"0.0"},1,0,""]
[36,{"$f":"'Wettkampf 1'!B45","v":"Joachim Niermann"},{"$f":"'Wettkampf 1'!C45","v":"Werlte III"},308.7,"x","0",0,0,0,0,0,0,0,0,0,0,"0",0,null,null,102.5,101.5,104.7,308.7,1,1,"Korrekt"]
[{"$nulls":6},{"$f":"LARGE(G10:G45,1)+LARGE(G10:G45,2)+LARGE(G10:G45,3)","v":930.6999999999999},{"$f":"SUM(H10:H45)","v":4},{"$f":"LARGE(I10:I45,1)+LARGE(I10:I45,2)+LARGE(I10:I45,3)","v":934.3000000000001},{"$f":"SUM(J10:J45)","v":4},{"$f":"LARGE(K10:K45,1)+LARGE(K10:K45,2)+LARGE(K10:K45,3)","v":932.1999999999999},{"$f":"SUM(L10:L45)","v":4},{"$f":"LARGE(M10:M45,1)+LARGE(M10:M45,2)+LARGE(M10:M45,3)","v":936.7},{"$f":"SUM(N10:N45)","v":4},{"$f":"LARGE(O10:O45,1)+LARGE(O10:O45,2)+LARGE(O10:O45,3)","v":924.9000000000001},{"$f":"SUM(P10:P45)","v":4},{"$f":"LARGE(Q10:Q45,1)+LARGE(Q10:Q45,2)+LARGE(Q10:Q45,3)","v":932.3},{"$f":"SUM(R10:S45)","v":4}]
[null,null,"per Email an: sk-huemmling@gmx.de"]

{"sheet":"11","index":11,"n_rows":47,"n_cols":27,"rows_kept":47,"merged":[[0,22,0,23],[1,22,1,23],[4,22,4,23],[5,22,5,23],[6,22,6,23],[8,20,8,23]]}
[null,"Verein / Gruppe",null,"Ergebnisse",{"$nulls":17},"Austragungsort:",{"$f":"Übersicht!P4","v":"Breddenberg"}]
[1,{"$f":"'Wettkampf 1'!B2","v":"Breddenb.-Heid. I"},null,{"$f":"G46","v":930.9},{"$f":"IF(H46>4,\"Es sind zu viele Schützen in Wertung!\",\" \")","v":" "},{"$nulls":16},"Wettkampftag:",{"$f":"Übersicht!P3","v":"15.03."}]
[2,{"$f":"'Wettkampf 1'!B3","v":"Ostenwalde II"},null,{"$f":"I46","v":940.4},{"$f":"IF(J46>4,\"Es sind zu viele Schützen in Wertung!\",\" \")","v":" "}]
[3,{"$f":"'Wettkampf 1'!B4","v":"Börgermoor II"},null,{"$f":"K46","v":932.3},{"$f":"IF(L46>4,\"Es sind zu viele Schützen in Wertung!\",\" \")","v":" "},{"$nulls":18},"Ansprechpartner für Rückfragen:"]
[4,{"$f":"'Wettkampf 1'!B5","v":"Lorup III"},null,{"$f":"M46","v":{"v":936,"d":"936.0"}},{"$f":"IF(N46>4,\"Es sind zu viele Schützen in Wertung!\",\" \")","v":" "},{"$nulls":16},"Name:","Oldiges johannes"]
[5,{"$f":"'Wettkampf 1'!B6","v":"Breddenb.-Heid. III"},null,{"$f":"O46","v":934.4},{"$f":"IF(P46>4,\"Es sind zu viele Schützen in Wertung!\",\" \")","v":" "},{"$nulls":16},"Tel:","015209409594"]
[6,{"$f":"'Wettkampf 1'!B7","v":"Werlte III"},null,{"$f":"Q46","v":936.3},{"$f":"IF(R46>4,\"Es sind zu viele Schützen in Wertung!\",\" \")","v":" "},{"$nulls":16},"Standaufsicht:","N. Jansen"]
[]
[null,"Einzelergebnisse:","Verein / Gruppe","Ergebnisse (mindestens 0 eintragen)","AW? Dann x eintippen",null,"Verein 1",null,"Verein 2",null,"Verein 3",null,"Verein 4",null,"Verein 5",null,"Verein 6",{"$nulls":3},"Proberechnung bei Streifen:"]
[1,{"$f":"'Wettkampf 1'!B10","v":"Hans Gebken 3"},{"$f":"'Wettkampf 1'!C10","v":"Breddenb.-Heid. I"},308.3,null,{"$f":"IF(E10=\"x\",\"0\",D10)","v":308.3},{"$f":"IF(C10=$B$2,F10,0)","v":308.3},{"$f":"(IF(AND($E10=\"\",$C10=$B$2),1,0))","v":1},{"$f":"IF($C10=$B$3,F10,0)","v":0},{"$f":"(IF(AND($E10=\"\",$C10=$B$3),1,0))","v":0},{"$f":"IF($C10=$B$4,F10,0)","v":0},{"$f":"(IF(AND($E10=\"\",$C10=$B$4),1,0))","v":0},{"$f":"IF($C10=$B$5,F10,0)","v":0},{"$f":"(IF(AND($E10=\"\",$C10=$B$5),1,0))","v":0},{"$f":"IF($C10=$B$6,F10,0)","v":0},{"$f":"(IF(AND($E10=\"\",$C10=$B$6),1,0))","v":0},{"$f":"IF($C10=$B$7,F10,0)","v":0},{"$f":"(IF(AND($E10=\"\",$C10=$B$7),1,0))","v":0},{"$nulls":5},{"$f":"U10+V10+W10","v":{"v":0,"d":"0.0"}},{"$f":"IF(X10=D10,1,0)","v":0},{"$f":"IF(X10=0,0,1)","v":0},{"$f":"IF(Y10+Z10=2,\"Korrekt\",\"\")","v":""}]
[2,{"$f":"'Wettkampf 1'!B11","v":"Gerd Vogel "},{"$f":"'Wettkampf 1'!C11","v":"Breddenb.-Heid. I"},310.7,null,{"$f":"IF(E11=\"x\",\"0\",D11)","v":310.7},{"$f":"IF(C11=$B$2,F11,0)","v":310.7},{"$f":"(IF(AND($E11=\"\",$C11=$B$2),1,0))","v":1},{"$f":"IF($C11=$B$3,F11,0)","v":0},{"$f":"(IF(AND($E11=\"\",$C11=$B$3),1,0))","v":0},{"$f":"IF($C11=$B$4,F11,0)","v":0},{"$f":"(IF(AND($E11=\"\",$C11=$B$4),1,0))","v":0},{"$f":"IF($C11=$B$5,F11,0)","v":0},{"$f":"(IF(AND($E11=\"\",$C11=$B$5),1,0))","v":0},{"$f":"IF($C11=$B$6,F11,0)","v":0},{"$f":"(IF(AND($E11=\"\",$C11=$B$6),1,0))","v":0},{"$f":"IF($C11=$B$7,F11,0)","v":0},{"$f":"(IF(AND($E11=\"\",$C11=$B$7),1,0))","v":0},{"$nulls":5},{"$f":"U11+V11+W11","v":{"v":0,"d":"0.0"}},{"$f":"IF(X11=D11,1,0)","v":0},{"$f":"IF(X11=0,0,1)","v":0},{"$f":"IF(Y11+Z11=2,\"Korrekt\",\"\")","v":""}]
[3,{"$f":"'Wettkampf 1'!B12","v":"Heinz Engbers"},{"$f":"'Wettkampf 1'!C12","v":"Breddenb.-Heid. I"},310.1,null,310.1,310.1,1,0,0,0,0,0,0,0,0,0,0,{"$nulls":5},{"v":0,"d":"0.0"},0,0,""]
[4,{"$f":"'Wettkampf 1'!B13","v":"Willi Engbers"},{"$f":"'Wettkampf 1'!C13","v":"Breddenb.-Heid. I"},310.1,null,310.1,310.1,1,0,0,0,0,0,0,0,0,0,0,{"$nulls":5},{"v":0,"d":"0.0"},0,0,""]
[5,{"$f":"'Wettkampf 1'!B14","v":"Hans Gebken 1"},{"$f":"'Wettkampf 1'!C14","v":"Breddenb.-Heid. I"},305.7,"x","0","0",0,0,0,0,0,0,0,0,0,0,0,{"$nulls":5},{"v":0,"d":"0.0"},0,0,""]
[6,{"$f":"'Wettkampf 1'!B15","v":"Philipp Schmidt"},{"$f":"'Wettkampf 1'!C15","v":"Ostenwalde II"},314.1,null,314.1,0,0,314.1,1,0,0,0,0,0,0,0,0,{"$nulls":5},{"v":0,"d":"0.0"},0,0,""]
[7,{"$f":"'Wettkampf 1'!B16","v":"Philipp Scholübbers "},{"$f":"'Wettkampf 1'!C16","v":"Ostenwalde II"},313.7,null,313.7,0,0,313.7,1,0,0,0,0,0,0,0,0,{"$nulls":5},{"v":0,"d":"0.0"},0,0,""]
[8,{"$f":"'Wettkampf 1'!B17","v":"Matthias Brinkmann"},{"$f":"'Wettkampf 1'!C17","v":"Ostenwalde II"},304.1,null,304.1,0,0,304.1,1,0,0,0,0,0,0,0,0,{"$nulls":5},{"v":0,"d":"0.0"},0,0,""]
[9,{"$f":"'Wettkampf 1'!B18","v":"Patrik Krüßel"},{"$f":"'Wettkampf 1'!C18","v":"Ostenwalde II"},312.6,null,312.6,0,0,312.6,1,0,0,0,0,0,0,0,0,{"$nulls":5},{"v":0,"d":"0.0"},0,0,""]
[10,{"$f":"'Wettkampf 1'!B19","v":"Markus Jansen"},{"$f":"'Wettkampf 1'!C19","v":"Ostenwalde II"},306.9,"x","0",0,0,"0",0,0,0,0,0,0,0,0,0,{"$nulls":5},{"v":0,"d":"0.0"},0,0,""]
[11,{"$f":"'Wettkampf 1'!B20","v":"Helmut Benten "},{"$f":"'Wettkampf 1'!C20","v":"Ostenwalde II"},309.8,"x","0",0,0,"0",0,0,0,0,0,0,0,0,0,{"$nulls":5},{"v":0,"d":"0.0"},0,0,""]
[12,{"$f":"'Wettkampf 1'!B21","v":"Heinz Dirksen"},{"$f":"'Wettkampf 1'!C21","v":"Börgermoor II"},308.5,"x","0",0,0,0,0,"0",0,0,0,0,0,0,0,{"$nulls":5},{"v":0,"d":"0.0"},0,0,""]
[13,{"$f":"'Wettkampf 1'!B22","v":"Hans Ortmann "},{"$f":"'Wettkampf 1'!C22","v":"Börgermoor II"},310.4,null,310.4,0,0,0,0,310.4,1,0,0,0,0,0,0,{"$nulls":5},{"v":0,"d":"0.0"},0,0,""]
[14,{"$f":"'Wettkampf 1'!B23","v":"Karl-Heinz Ortmann"},{"$f":"'Wettkampf 1'!C23","v":"Börgermoor II"},{"v":310,"d":"310.0"},null,{"v":310,"d":"310.0"},0,0,0,0,310,1,0,0,0,0,0,0,{"$nulls":5},{"v":0,"d":"0.0"},0,0,""]
[15,{"$f":"'Wettkampf 1'!B24","v":"Johannes Jansen"},{"$f":"'Wettkampf 1'!C24","v":"Börgermoor II"},311.9,null,311.9,0,0,0,0,311.9,1,0,0,0,0,0,0,{"$nulls":5},{"v":0,"d":"0.0"},0,0,""]
[16,{"$f":"'Wettkampf 1'!B25","v":"Kevin Minnert"},{"$f":"'Wettkampf 1'!C25","v":"Börgermoor II"},null,null,{"v":0,"d":"0.0"},0,0,0,0,0,1,0,0,0,0,0,0,{"$nulls":5},{"v":0,"d":"0.0"},1,0,""]
[17,{"$f":"'Wettkampf 1'!B26","v":"Daniel Schülke"},{"$f":"'Wettkampf 1'!C26","v":"Börgermoor II"},299.4,"x","0",0,0,0,0,"0",0,0,0,0,0,0,0,{"$nulls":5},{"v":0,"d":"0.0"},0,0,""]
[18,{"$f":"'Wettkampf 1'!B27","v":"Frank Wotte"},{"$f":"'Wettkampf 1'!C27","v":"Lorup III"},314.1,null,314.1,0,0,0,0,0,0,314.1,1,0,0,0,0,{"$nulls":5},{"v":0,"d":"0.0"},0,0,""]
[19,{"$f":"'Wettkampf 1'!B28","v":"Johannes Wesseln"},{"$f":"'Wettkampf 1'!C28","v":"Lorup III"},312.4,null,312.4,0,0,0,0,0,0,312.4,1,0,0,0,0,{"$nulls":5},{"v":0,"d":"0.0"},0,0,""]
[20,{"$f":"'Wettkampf 1'!B29","v":"Anton Oldiges"},{"$f":"'Wettkampf 1'!C29","v":"Lorup III"},309.5,null,309.5,0,0,0,0,0,0,309.5,1,0,0,0,0,{"$nulls":5},{"v":0,"d":"0.0"},0,0,""]
[21,{"$f":"'Wettkampf 1'!B30","v":"Jürgen Will"},{"$f":"'Wettkampf 1'!C30","v":"Lorup III"},308.9,"x","0",0,0,0,0,0,0,"0",0,0,0,0,0,{"$nulls":5},{"v":0,"d":"0.0"},0,0,""]
[22,{"$f":"'Wettkampf 1'!B31","v":"Schütze 22"},{"$f":"'Wettkampf 1'!C31","v":"Lorup III"},null,"x","0",0,0,0,0,0,0,"0",0,0,0,0,0,{"$nulls":5},{"v":0,"d":"0.0"},1,0,""]
[23,{"$f":"'Wettkampf 1'!B32","v":"Schütze 23"},{"$f":"'Wettkampf 1'!C32","v":"Lorup III"},null,"x","0",0,0,0,0,0,0,"0",0,0,0,0,0,{"$nulls":5},{"v":0,"d":"0.0"},1,0,""]
[24,{"$f":"'Wettkampf 1'!B33","v":"Norbert Jansen"},{"$f":"'Wettkampf 1'!C33","v":"Breddenb.-Heid. III"},309.7,null,309.7,0,0,0,0,0,0,0,0,309.7,1,0,0,{"$nulls":5},{"v":0,"d":"0.0"},0,0,""]
[25,{"$f":"'Wettkampf 1'!B34","v":"Werner Jansen"},{"$f":"'Wettkampf 1'!C34","v":"Breddenb.-Heid. III"},309.5,null,309.5,0,0,0,0,0,0,0,0,309.5,1,0,0,{"$nulls":5},{"v":0,"d":"0.0"},0,0,""]
[26,{"$f":"'Wettkampf 1'!B35","v":"Alfons Plüster"},{"$f":"'Wettkampf 1'!C35","v":"Breddenb.-Heid. III"},305.1,"x","0",0,0,0,0,0,0,0,0,"0",0,0,0,{"$nulls":5},{"v":0,"d":"0.0"},0,0,""]
[27,{"$f":"'Wettkampf 1'!B36","v":"Johannes Oldiges"},{"$f":"'Wettkampf 1'!C36","v":"Breddenb.-Heid. III"},302.6,"x","0",0,0,0,0,0,0,0,0,"0",0,0,0,{"$nulls":5},{"v":0,"d":"0.0"},0,0,""]
[28,{"$f":"'Wettkampf 1'!B37","v":"Hans Plüster"},{"$f":"'Wettkampf 1'!C37","v":"Breddenb.-Heid. III"},315.2,null,315.2,0,0,0,0,0,0,0,0,315.2,1,0,0,{"$nulls":5},{"v":0,"d":"0.0"},0,0,""]
[29,{"$f":"'Wettkampf 1'!B38","v":"Josef Wübben "},{"$f":"'Wettkampf 1'!C38","v":"Breddenb.-Heid. III"},305.8,null,305.8,0,0,0,0,0,0,0,0,305.8,1,0,0,{"$nulls":5},{"v":0,"d":"0.0"},0,0,""]
[30,{"$f":"'Wettkampf 1'!B39","v":"Thomas Niermann"},{"$f":"'Wettkampf 1'!C39","v":"Werlte III"},312.1,null,312.1,0,0,0,0,0,0,0,0,0,0,312.1,1,{"$nulls":5},{"v":0,"d":"0.0"},0,0,""]
[31,{"$f":"'Wettkampf 1'!B40","v":"Bernd Thien"},{"$f":"'Wettkampf 1'!C40","v":"Werlte III"},313.9,null,313.9,0,0,0,0,0,0,0,0,0,0,313.9,1,{"$nulls":5},{"v":0,"d":"0.0"},0,0,""]
[32,{"$f":"'Wettkampf 1'!B41","v":"Norbert Grünloh "},{"$f":"'Wettkampf 1'!C41","v":"Werlte III"},309.7,null,309.7,0,0,0,0,0,0,0,0,0,0,309.7,1,{"$nulls":5},{"v":0,"d":"0.0"},0,0,""]
[33,{"$f":"'Wettkampf 1'!B42","v":"Andreas Thoben "},{"$f":"'Wettkampf 1'!C42","v":"Werlte III"},310.3,null,310.3,0,0,0,0,0,0,0,0,0,0,310.3,1,{"$nulls":5},{"v":0,"d":"0.0"},0,0,""]
[34,{"$f":"'Wettkampf 1'!B43","v":"Hermann Krone "},{"$f":"'Wettkampf 1'!C43","v":"Werlte III"},303.8,"x","0",0,0,0,0,0,0,0,0,0,0,"0",0,{"$nulls":5},{"v":0,"d":"0.0"},0,0,""]
[35,{"$f":"'Wettkampf 1'!B44","v":"Michael Freitag "},{"$f":"'Wettkampf 1'!C44","v":"Werlte III"},308.6,"x","0",0,0,0,0,0,0,0,0,0,0,"0",0,{"$nulls":5},{"v":0,"d":"0.0"},0,0,""]
[36,{"$f":"'Wettkampf 1'!B45","v":"Joachim Niermann"},{"$f":"'Wettkampf 1'!C45","v":"Werlte III"},309.2,"x","0",0,0,0,0,0,0,0,0,0,0,"0",0,{"$nulls":5},{"v":0,"d":"0.0"},0,0,""]
[{"$nulls":6},{"$f":"LARGE(G10:G45,1)+LARGE(G10:G45,2)+LARGE(G10:G45,3)","v":930.9},{"$f":"SUM(H10:H45)","v":4},{"$f":"LARGE(I10:I45,1)+LARGE(I10:I45,2)+LARGE(I10:I45,3)","v":940.4},{"$f":"SUM(J10:J45)","v":4},{"$f":"LARGE(K10:K45,1)+LARGE(K10:K45,2)+LARGE(K10:K45,3)","v":932.3},{"$f":"SUM(L10:L45)","v":4},{"$f":"LARGE(M10:M45,1)+LARGE(M10:M45,2)+LARGE(M10:M45,3)","v":936},{"$f":"SUM(N10:N45)","v":3},{"$f":"LARGE(O10:O45,1)+LARGE(O10:O45,2)+LARGE(O10:O45,3)","v":934.4},{"$f":"SUM(P10:P45)","v":4},{"$f":"LARGE(Q10:Q45,1)+LARGE(Q10:Q45,2)+LARGE(Q10:Q45,3)","v":936.3},{"$f":"SUM(R10:S45)","v":4}]
[null,null,"per Email an: sk-huemmling@gmx.de"]

{"sheet":"12","index":12,"n_rows":47,"n_cols":27,"rows_kept":47,"merged":[[0,22,0,23],[1,22,1,23],[4,22,4,23],[5,22,5,23],[6,22,6,23],[8,20,8,23]]}
[null,"Verein / Gruppe",null,"Ergebnisse",{"$nulls":17},"Austragungsort:",{"$f":"Übersicht!Q4","v":"Werlte"}]
[1,{"$f":"'Wettkampf 1'!B2","v":"Breddenb.-Heid. I"},null,{"$f":"G46","v":{"v":0,"d":"0.0"}},{"$f":"IF(H46>4,\"Es sind zu viele Schützen in Wertung!\",\" \")","v":" "},{"$nulls":16},"Wettkampftag:",{"$f":"Übersicht!Q3","v":"29.03."}]
[2,{"$f":"'Wettkampf 1'!B3","v":"Ostenwalde II"},null,{"$f":"I46","v":{"v":0,"d":"0.0"}},{"$f":"IF(J46>4,\"Es sind zu viele Schützen in Wertung!\",\" \")","v":" "}]
[3,{"$f":"'Wettkampf 1'!B4","v":"Börgermoor II"},null,{"$f":"K46","v":{"v":0,"d":"0.0"}},{"$f":"IF(L46>4,\"Es sind zu viele Schützen in Wertung!\",\" \")","v":" "},{"$nulls":18},"Ansprechpartner für Rückfragen:"]
[4,{"$f":"'Wettkampf 1'!B5","v":"Lorup III"},null,{"$f":"M46","v":{"v":0,"d":"0.0"}},{"$f":"IF(N46>4,\"Es sind zu viele Schützen in Wertung!\",\" \")","v":" "},{"$nulls":16},"Name:"]
[5,{"$f":"'Wettkampf 1'!B6","v":"Breddenb.-Heid. III"},null,{"$f":"O46","v":{"v":0,"d":"0.0"}},{"$f":"IF(P46>4,\"Es sind zu viele Schützen in Wertung!\",\" \")","v":" "},{"$nulls":16},"Tel:"]
[6,{"$f":"'Wettkampf 1'!B7","v":"Werlte III"},null,{"$f":"Q46","v":{"v":0,"d":"0.0"}},{"$f":"IF(R46>4,\"Es sind zu viele Schützen in Wertung!\",\" \")","v":" "},{"$nulls":16},"Standaufsicht:"]
[]
[null,"Einzelergebnisse:","Verein / Gruppe","Ergebnisse (mindestens 0 eintragen)","AW? Dann x eintippen",null,"Verein 1",null,"Verein 2",null,"Verein 3",null,"Verein 4",null,"Verein 5",null,"Verein 6",{"$nulls":3},"Proberechnung bei Streifen:"]
[1,{"$f":"'Wettkampf 1'!B10","v":"Hans Gebken 3"},{"$f":"'Wettkampf 1'!C10","v":"Breddenb.-Heid. I"},null,null,{"$f":"IF(E10=\"x\",\"0\",D10)","v":{"v":0,"d":"0.0"}},{"$f":"IF(C10=$B$2,F10,0)","v":0},{"$f":"(IF(AND($E10=\"\",$C10=$B$2),1,0))","v":1},{"$f":"IF($C10=$B$3,F10,0)","v":0},{"$f":"(IF(AND($E10=\"\",$C10=$B$3),1,0))","v":0},{"$f":"IF($C10=$B$4,F10,0)","v":0},{"$f":"(IF(AND($E10=\"\",$C10=$B$4),1,0))","v":0},{"$f":"IF($C10=$B$5,F10,0)","v":0},{"$f":"(IF(AND($E10=\"\",$C10=$B$5),1,0))","v":0},{"$f":"IF($C10=$B$6,F10,0)","v":0},{"$f":"(IF(AND($E10=\"\",$C10=$B$6),1,0))","v":0},{"$f":"IF($C10=$B$7,F10,0)","v":0},{"$f":"(IF(AND($E10=\"\",$C10=$B$7),1,0))","v":0},{"$nulls":5},{"$f":"U10+V10+W10","v":{"v":0,"d":"0.0"}},{"$f":"IF(X10=D10,1,0)","v":1},{"$f":"IF(X10=0,0,1)","v":0},{"$f":"IF(Y10+Z10=2,\"Korrekt\",\"\")","v":""}]
[2,{"$f":"'Wettkampf 1'!B11","v":"Gerd Vogel "},{"$f":"'Wettkampf 1'!C11","v":"Breddenb.-Heid. I"},null,null,{"$f":"IF(E11=\"x\",\"0\",D11)","v":{"v":0,"d":"0.0"}},{"$f":"IF(C11=$B$2,F11,0)","v":0},{"$f":"(IF(AND($E11=\"\",$C11=$B$2),1,0))","v":1},{"$f":"IF($C11=$B$3,F11,0)","v":0},{"$f":"(IF(AND($E11=\"\",$C11=$B$3),1,0))","v":0},{"$f":"IF($C11=$B$4,F11,0)","v":0},{"$f":"(IF(AND($E11=\"\",$C11=$B$4),1,0))","v":0},{"$f":"IF($C11=$B$5,F11,0)","v":0},{"$f":"(IF(AND($E11=\"\",$C11=$B$5),1,0))","v":0},{"$f":"IF($C11=$B$6,F11,0)","v":0},{"$f":"(IF(AND($E11=\"\",$C11=$B$6),1,0))","v":0},{"$f":"IF($C11=$B$7,F11,0)","v":0},{"$f":"(IF(AND($E11=\"\",$C11=$B$7),1,0))","v":0},{"$nulls":5},{"$f":"U11+V11+W11","v":{"v":0,"d":"0.0"}},{"$f":"IF(X11=D11,1,0)","v":1},{"$f":"IF(X11=0,0,1)","v":0},{"$f":"IF(Y11+Z11=2,\"Korrekt\",\"\")","v":""}]
[3,{"$f":"'Wettkampf 1'!B12","v":"Heinz Engbers"},{"$f":"'Wettkampf 1'!C12","v":"Breddenb.-Heid. I"},null,null,{"v":0,"d":"0.0"},0,1,0,0,0,0,0,0,0,0,0,0,{"$nulls":5},{"v":0,"d":"0.0"},1,0,""]
[4,{"$f":"'Wettkampf 1'!B13","v":"Willi Engbers"},{"$f":"'Wettkampf 1'!C13","v":"Breddenb.-Heid. I"},null,null,{"v":0,"d":"0.0"},0,1,0,0,0,0,0,0,0,0,0,0,{"$nulls":5},{"v":0,"d":"0.0"},1,0,""]
[5,{"$f":"'Wettkampf 1'!B14","v":"Hans Gebken 1"},{"$f":"'Wettkampf 1'!C14","v":"Breddenb.-Heid. I"},null,"x","0","0",0,0,0,0,0,0,0,0,0,0,0,{"$nulls":5},{"v":0,"d":"0.0"},1,0,""]
[6,{"$f":"'Wettkampf 1'!B15","v":"Philipp Schmidt"},{"$f":"'Wettkampf 1'!C15","v":"Ostenwalde II"},null,"x","0",0,0,"0",0,0,0,0,0,0,0,0,0,{"$nulls":5},{"v":0,"d":"0.0"},1,0,""]
[7,{"$f":"'Wettkampf 1'!B16","v":"Philipp Scholübbers "},{"$f":"'Wettkampf 1'!C16","v":"Ostenwalde II"},null,null,{"v":0,"d":"0.0"},0,0,0,1,0,0,0,0,0,0,0,0,{"$nulls":5},{"v":0,"d":"0.0"},1,0,""]
[8,{"$f":"'Wettkampf 1'!B17","v":"Matthias Brinkmann"},{"$f":"'Wettkampf 1'!C17","v":"Ostenwalde II"},null,null,{"v":0,"d":"0.0"},0,0,0,1,0,0,0,0,0,0,0,0,{"$nulls":5},{"v":0,"d":"0.0"},1,0,""]
[9,{"$f":"'Wettkampf 1'!B18","v":"Patrik Krüßel"},{"$f":"'Wettkampf 1'!C18","v":"Ostenwalde II"},null,null,{"v":0,"d":"0.0"},0,0,0,1,0,0,0,0,0,0,0,0,{"$nulls":5},{"v":0,"d":"0.0"},1,0,""]
[10,{"$f":"'Wettkampf 1'!B19","v":"Markus Jansen"},{"$f":"'Wettkampf 1'!C19","v":"Ostenwalde II"},null,null,{"v":0,"d":"0.0"},0,0,0,1,0,0,0,0,0,0,0,0,{"$nulls":5},{"v":0,"d":"0.0"},1,0,""]
[11,{"$f":"'Wettkampf 1'!B20","v":"Helmut Benten "},{"$f":"'Wettkampf 1'!C20","v":"Ostenwalde II"},null,"x","0",0,0,"0",0,0,0,0,0,0,0,0,0,{"$nulls":5},{"v":0,"d":"0.0"},1,0,""]
[12,{"$f":"'Wettkampf 1'!B21","v":"Heinz Dirksen"},{"$f":"'Wettkampf 1'!C21","v":"Börgermoor II"},null,"x","0",0,0,0,0,"0",0,0,0,0,0,0,0,{"$nulls":5},{"v":0,"d":"0.0"},1,0,""]
[13,{"$f":"'Wettkampf 1'!B22","v":"Hans Ortmann "},{"$f":"'Wettkampf 1'!C22","v":"Börgermoor II"},null,null,{"v":0,"d":"0.0"},0,0,0,0,0,1,0,0,0,0,0,0,{"$nulls":5},{"v":0,"d":"0.0"},1,0,""]
[14,{"$f":"'Wettkampf 1'!B23","v":"Karl-Heinz Ortmann"},{"$f":"'Wettkampf 1'!C23","v":"Börgermoor II"},null,null,{"v":0,"d":"0.0"},0,0,0,0,0,1,0,0,0,0,0,0,{"$nulls":5},{"v":0,"d":"0.0"},1,0,""]
[15,{"$f":"'Wettkampf 1'!B24","v":"Johannes Jansen"},{"$f":"'Wettkampf 1'!C24","v":"Börgermoor II"},null,null,{"v":0,"d":"0.0"},0,0,0,0,0,1,0,0,0,0,0,0,{"$nulls":5},{"v":0,"d":"0.0"},1,0,""]
[16,{"$f":"'Wettkampf 1'!B25","v":"Kevin Minnert"},{"$f":"'Wettkampf 1'!C25","v":"Börgermoor II"},null,null,{"v":0,"d":"0.0"},0,0,0,0,0,1,0,0,0,0,0,0,{"$nulls":5},{"v":0,"d":"0.0"},1,0,""]
[17,{"$f":"'Wettkampf 1'!B26","v":"Daniel Schülke"},{"$f":"'Wettkampf 1'!C26","v":"Börgermoor II"},null,"x","0",0,0,0,0,"0",0,0,0,0,0,0,0,{"$nulls":5},{"v":0,"d":"0.0"},1,0,""]
[18,{"$f":"'Wettkampf 1'!B27","v":"Frank Wotte"},{"$f":"'Wettkampf 1'!C27","v":"Lorup III"},null,"x","0",0,0,0,0,0,0,"0",0,0,0,0,0,{"$nulls":5},{"v":0,"d":"0.0"},1,0,""]
[19,{"$f":"'Wettkampf 1'!B28","v":"Johannes Wesseln"},{"$f":"'Wettkampf 1'!C28","v":"Lorup III"},null,null,{"v":0,"d":"0.0"},0,0,0,0,0,0,0,1,0,0,0,0,{"$nulls":5},{"v":0,"d":"0.0"},1,0,""]
[20,{"$f":"'Wettkampf 1'!B29","v":"Anton Oldiges"},{"$f":"'Wettkampf 1'!C29","v":"Lorup III"},null,null,{"v":0,"d":"0.0"},0,0,0,0,0,0,0,1,0,0,0,0,{"$nulls":5},{"v":0,"d":"0.0"},1,0,""]
[21,{"$f":"'Wettkampf 1'!B30","v":"Jürgen Will"},{"$f":"'Wettkampf 1'!C30","v":"Lorup III"},null,null,{"v":0,"d":"0.0"},0,0,0,0,0,0,0,1,0,0,0,0,{"$nulls":5},{"v":0,"d":"0.0"},1,0,""]
[22,{"$f":"'Wettkampf 1'!B31","v":"Schütze 22"},{"$f":"'Wettkampf 1'!C31","v":"Lorup III"},null,null,{"v":0,"d":"0.0"},0,0,0,0,0,0,0,1,0,0,0,0,{"$nulls":5},{"v":0,"d":"0.0"},1,0,""]
[23,{"$f":"'Wettkampf 1'!B32","v":"Schütze 23"},{"$f":"'Wettkampf 1'!C32","v":"Lorup III"},null,"x","0",0,0,0,0,0,0,"0",0,0,0,0,0,{"$nulls":5},{"v":0,"d":"0.0"},1,0,""]
[24,{"$f":"'Wettkampf 1'!B33","v":"Norbert Jansen"},{"$f":"'Wettkampf 1'!C33","v":"Breddenb.-Heid. III"},null,"x","0",0,0,0,0,0,0,0,0,"0",0,0,0,{"$nulls":5},{"v":0,"d":"0.0"},1,0,""]
[25,{"$f":"'Wettkampf 1'!B34","v":"Werner Jansen"},{"$f":"'Wettkampf 1'!C34","v":"Breddenb.-Heid. III"},null,null,{"v":0,"d":"0.0"},0,0,0,0,0,0,0,0,0,1,0,0,{"$nulls":5},{"v":0,"d":"0.0"},1,0,""]
[26,{"$f":"'Wettkampf 1'!B35","v":"Alfons Plüster"},{"$f":"'Wettkampf 1'!C35","v":"Breddenb.-Heid. III"},null,null,{"v":0,"d":"0.0"},0,0,0,0,0,0,0,0,0,1,0,0,{"$nulls":5},{"v":0,"d":"0.0"},1,0,""]
[27,{"$f":"'Wettkampf 1'!B36","v":"Johannes Oldiges"},{"$f":"'Wettkampf 1'!C36","v":"Breddenb.-Heid. III"},null,null,{"v":0,"d":"0.0"},0,0,0,0,0,0,0,0,0,1,0,0,{"$nulls":5},{"v":0,"d":"0.0"},1,0,""]
[28,{"$f":"'Wettkampf 1'!B37","v":"Hans Plüster"},{"$f":"'Wettkampf 1'!C37","v":"Breddenb.-Heid. III"},null,null,{"v":0,"d":"0.0"},0,0,0,0,0,0,0,0,0,1,0,0,{"$nulls":5},{"v":0,"d":"0.0"},1,0,""]
[29,{"$f":"'Wettkampf 1'!B38","v":"Josef Wübben "},{"$f":"'Wettkampf 1'!C38","v":"Breddenb.-Heid. III"},null,"x","0",0,0,0,0,0,0,0,0,"0",0,0,0,{"$nulls":5},{"v":0,"d":"0.0"},1,0,""]
[30,{"$f":"'Wettkampf 1'!B39","v":"Thomas Niermann"},{"$f":"'Wettkampf 1'!C39","v":"Werlte III"},null,"x","0",0,0,0,0,0,0,0,0,0,0,"0",0,{"$nulls":5},{"v":0,"d":"0.0"},1,0,""]
[31,{"$f":"'Wettkampf 1'!B40","v":"Bernd Thien"},{"$f":"'Wettkampf 1'!C40","v":"Werlte III"},null,null,{"v":0,"d":"0.0"},0,0,0,0,0,0,0,0,0,0,0,1,{"$nulls":5},{"v":0,"d":"0.0"},1,0,""]
[32,{"$f":"'Wettkampf 1'!B41","v":"Norbert Grünloh "},{"$f":"'Wettkampf 1'!C41","v":"Werlte III"},null,null,{"v":0,"d":"0.0"},0,0,0,0,0,0,0,0,0,0,0,1,{"$nulls":5},{"v":0,"d":"0.0"},1,0,""]
[33,{"$f":"'Wettkampf 1'!B42","v":"Andreas Thoben "},{"$f":"'Wettkampf 1'!C42","v":"Werlte III"},null,null,{"v":0,"d":"0.0"},0,0,0,0,0,0,0,0,0,0,0,1,{"$nulls":5},{"v":0,"d":"0.0"},1,0,""]
[34,{"$f":"'Wettkampf 1'!B43","v":"Hermann Krone "},{"$f":"'Wettkampf 1'!C43","v":"Werlte III"},null,null,{"v":0,"d":"0.0"},0,0,0,0,0,0,0,0,0,0,0,1,{"$nulls":5},{"v":0,"d":"0.0"},1,0,""]
[35,{"$f":"'Wettkampf 1'!B44","v":"Michael Freitag "},{"$f":"'Wettkampf 1'!C44","v":"Werlte III"},null,"x","0",0,0,0,0,0,0,0,0,0,0,"0",0,{"$nulls":5},{"v":0,"d":"0.0"},1,0,""]
[36,{"$f":"'Wettkampf 1'!B45","v":"Joachim Niermann"},{"$f":"'Wettkampf 1'!C45","v":"Werlte III"},null,"x","0",0,0,0,0,0,0,0,0,0,0,"0",0,{"$nulls":5},{"v":0,"d":"0.0"},1,0,""]
[{"$nulls":6},{"$f":"LARGE(G10:G45,1)+LARGE(G10:G45,2)+LARGE(G10:G45,3)","v":0},{"$f":"SUM(H10:H45)","v":4},{"$f":"LARGE(I10:I45,1)+LARGE(I10:I45,2)+LARGE(I10:I45,3)","v":0},{"$f":"SUM(J10:J45)","v":4},{"$f":"LARGE(K10:K45,1)+LARGE(K10:K45,2)+LARGE(K10:K45,3)","v":0},{"$f":"SUM(L10:L45)","v":4},{"$f":"LARGE(M10:M45,1)+LARGE(M10:M45,2)+LARGE(M10:M45,3)","v":0},{"$f":"SUM(N10:N45)","v":4},{"$f":"LARGE(O10:O45,1)+LARGE(O10:O45,2)+LARGE(O10:O45,3)","v":0},{"$f":"SUM(P10:P45)","v":4},{"$f":"LARGE(Q10:Q45,1)+LARGE(Q10:Q45,2)+LARGE(Q10:Q45,3)","v":0},{"$f":"SUM(R10:S45)","v":4}]
[null,null,"per Email an: sk-huemmling@gmx.de"]

{"sheet":"Ausdruck","index":13,"n_rows":48,"n_cols":29,"rows_kept":48,"merged":[[0,3,0,19],[0,24,0,25],[1,3,1,19],[1,24,1,25],[2,3,2,19],[3,3,3,19],[4,24,4,25],[5,24,5,25],[6,24,6,25],[8,22,8,25]]}
[null,"Verein / Gruppe","Ergebnisse",{"$f":"Übersicht!K1","v":"2019/2020"},{"$nulls":19},"Austragungsort:"]
[1,{"$f":"'Wettkampf 1'!B2","v":"Breddenb.-Heid. I"},null,"Klasse:",{"$nulls":19},"Wettkampftag:"]
[2,{"$f":"'Wettkampf 1'!B3","v":"Ostenwalde II"},null,{"$f":"Übersicht!M1","v":"2. Kreisliga"}]
[3,{"$f":"'Wettkampf 1'!B4","v":"Börgermoor II"},null,{"$f":"Übersicht!P1","v":"Schützen"},{"$nulls":21},"Ansprechpartner für Rückfragen:"]
[4,{"$f":"'Wettkampf 1'!B5","v":"Lorup III"},{"$nulls":21},"Name:"]
[5,{"$f":"'Wettkampf 1'!B6","v":"Breddenb.-Heid. III"},{"$nulls":21},"Tel:"]
[6,{"$f":"'Wettkampf 1'!B7","v":"Werlte III"},{"$nulls":21},"Standaufsicht:"]
[]
[null,"Name Schütze","Verein/Gruppe","Ergebnis","AW? ",null,"Verein 1",null,"Verein 2",null,"Verein 3",null,"Verein 4",null,"Verein 5",null,"Verein 6",{"$nulls":3},"Geburts-datum",null,"Proberechnung bei Streifen:"]
[1,{"$f":"'Wettkampf 1'!B10","v":"Hans Gebken 3"},{"$f":"'Wettkampf 1'!C10","v":"Breddenb.-Heid. I"},null,null,{"$f":"IF(E10=\"x\",\"0\",D10)","v":0},{"$f":"IF(C10=$B$2,F10,0)","v":0},{"$f":"(IF(AND($E10=\"\",$C10=$B$2),1,0))","v":1},{"$f":"IF($C10=$B$3,F10,0)","v":0},{"$f":"(IF(AND($E10=\"\",$C10=$B$3),1,0))","v":0},{"$f":"IF($C10=$B$4,F10,0)","v":0},{"$f":"(IF(AND($E10=\"\",$C10=$B$4),1,0))","v":0},{"$f":"IF($C10=$B$5,F10,0)","v":0},{"$f":"(IF(AND($E10=\"\",$C10=$B$5),1,0))","v":0},{"$f":"IF($C10=$B$6,F10,0)","v":0},{"$f":"(IF(AND($E10=\"\",$C10=$B$6),1,0))","v":0},{"$f":"IF($C10=$B$7,F10,0)","v":0},{"$f":"(IF(AND($E10=\"\",$C10=$B$7),1,0))","v":0},{"$nulls":8},{"$f":"IF(Z10=D10,1,0)","v":1},{"$f":"IF(Z10=0,0,1)","v":0},{"$f":"IF(AA10+AB10=2,\"Korrekt\",\"\")","v":""}]
[2,{"$f":"'Wettkampf 1'!B11","v":"Gerd Vogel "},{"$f":"'Wettkampf 1'!C11","v":"Breddenb.-Heid. I"},null,null,{"$f":"IF(E11=\"x\",\"0\",D11)","v":0},{"$f":"IF(C11=$B$2,F11,0)","v":0},{"$f":"(IF(AND($E11=\"\",$C11=$B$2),1,0))","v":1},{"$f":"IF($C11=$B$3,F11,0)","v":0},{"$f":"(IF(AND($E11=\"\",$C11=$B$3),1,0))","v":0},{"$f":"IF($C11=$B$4,F11,0)","v":0},{"$f":"(IF(AND($E11=\"\",$C11=$B$4),1,0))","v":0},{"$f":"IF($C11=$B$5,F11,0)","v":0},{"$f":"(IF(AND($E11=\"\",$C11=$B$5),1,0))","v":0},{"$f":"IF($C11=$B$6,F11,0)","v":0},{"$f":"(IF(AND($E11=\"\",$C11=$B$6),1,0))","v":0},{"$f":"IF($C11=$B$7,F11,0)","v":0},{"$f":"(IF(AND($E11=\"\",$C11=$B$7),1,0))","v":0},{"$nulls":8},{"$f":"IF(Z11=D11,1,0)","v":1},{"$f":"IF(Z11=0,0,1)","v":0},{"$f":"IF(AA11+AB11=2,\"Korrekt\",\"\")","v":""}]
[3,{"$f":"'Wettkampf 1'!B12","v":"Heinz Engbers"},{"$f":"'Wettkampf 1'!C12","v":"Breddenb.-Heid. I"},null,null,0,0,1,0,0,0,0,0,0,0,0,0,0,{"$nulls":8},1,0,""]
[4,{"$f":"'Wettkampf 1'!B13","v":"Willi Engbers"},{"$f":"'Wettkampf 1'!C13","v":"Breddenb.-Heid. I"},null,null,0,0,1,0,0,0,0,0,0,0,0,0,0,{"$nulls":8},1,0,""]
[5,{"$f":"'Wettkampf 1'!B14","v":"Hans Gebken 1"},{"$f":"'Wettkampf 1'!C14","v":"Breddenb.-Heid. I"},null,null,0,0,1,0,0,0,0,0,0,0,0,0,0,{"$nulls":8},1,0,""]
[6,{"$f":"'Wettkampf 1'!B15","v":"Philipp Schmidt"},{"$f":"'Wettkampf 1'!C15","v":"Ostenwalde II"},null,null,0,0,0,0,1,0,0,0,0,0,0,0,0,{"$nulls":8},1,0,""]
[7,{"$f":"'Wettkampf 1'!B16","v":"Philipp Scholübbers "},{"$f":"'Wettkampf 1'!C16","v":"Ostenwalde II"},null,null,0,0,0,0,1,0,0,0,0,0,0,0,0,{"$nulls":8},1,0,""]
[8,{"$f":"'Wettkampf 1'!B17","v":"Matthias Brinkmann"},{"$f":"'Wettkampf 1'!C17","v":"Ostenwalde II"},null,null,0,0,0,0,1,0,0,0,0,0,0,0,0,{"$nulls":8},1,0,""]
[9,{"$f":"'Wettkampf 1'!B18","v":"Patrik Krüßel"},{"$f":"'Wettkampf 1'!C18","v":"Ostenwalde II"},null,null,0,0,0,0,1,0,0,0,0,0,0,0,0,{"$nulls":8},1,0,""]
[10,{"$f":"'Wettkampf 1'!B19","v":"Markus Jansen"},{"$f":"'Wettkampf 1'!C19","v":"Ostenwalde II"},null,null,0,0,0,0,1,0,0,0,0,0,0,0,0,{"$nulls":8},1,0,""]
[11,{"$f":"'Wettkampf 1'!B20","v":"Helmut Benten "},{"$f":"'Wettkampf 1'!C20","v":"Ostenwalde II"},null,null,0,0,0,0,1,0,0,0,0,0,0,0,0,{"$nulls":8},1,0,""]
[12,{"$f":"'Wettkampf 1'!B21","v":"Heinz Dirksen"},{"$f":"'Wettkampf 1'!C21","v":"Börgermoor II"},null,null,0,0,0,0,0,0,1,0,0,0,0,0,0,{"$nulls":8},1,0,""]
[13,{"$f":"'Wettkampf 1'!B22","v":"Hans Ortmann "},{"$f":"'Wettkampf 1'!C22","v":"Börgermoor II"},null,null,0,0,0,0,0,0,1,0,0,0,0,0,0,{"$nulls":8},1,0,""]
[14,{"$f":"'Wettkampf 1'!B23","v":"Karl-Heinz Ortmann"},{"$f":"'Wettkampf 1'!C23","v":"Börgermoor II"},null,null,0,0,0,0,0,0,1,0,0,0,0,0,0,{"$nulls":8},1,0,""]
[15,{"$f":"'Wettkampf 1'!B24","v":"Johannes Jansen"},{"$f":"'Wettkampf 1'!C24","v":"Börgermoor II"},null,null,0,0,0,0,0,0,1,0,0,0,0,0,0,{"$nulls":8},1,0,""]
[16,{"$f":"'Wettkampf 1'!B25","v":"Kevin Minnert"},{"$f":"'Wettkampf 1'!C25","v":"Börgermoor II"},null,null,0,0,0,0,0,0,1,0,0,0,0,0,0,{"$nulls":8},1,0,""]
[17,{"$f":"'Wettkampf 1'!B26","v":"Daniel Schülke"},{"$f":"'Wettkampf 1'!C26","v":"Börgermoor II"},null,null,0,0,0,0,0,0,1,0,0,0,0,0,0,{"$nulls":8},1,0,""]
[18,{"$f":"'Wettkampf 1'!B27","v":"Frank Wotte"},{"$f":"'Wettkampf 1'!C27","v":"Lorup III"},null,null,0,0,0,0,0,0,0,0,1,0,0,0,0,{"$nulls":8},1,0,""]
[19,{"$f":"'Wettkampf 1'!B28","v":"Johannes Wesseln"},{"$f":"'Wettkampf 1'!C28","v":"Lorup III"},null,null,0,0,0,0,0,0,0,0,1,0,0,0,0,{"$nulls":8},1,0,""]
[20,{"$f":"'Wettkampf 1'!B29","v":"Anton Oldiges"},{"$f":"'Wettkampf 1'!C29","v":"Lorup III"},null,null,0,0,0,0,0,0,0,0,1,0,0,0,0,{"$nulls":8},1,0,""]
[21,{"$f":"'Wettkampf 1'!B30","v":"Jürgen Will"},{"$f":"'Wettkampf 1'!C30","v":"Lorup III"},null,null,0,0,0,0,0,0,0,0,1,0,0,0,0,{"$nulls":8},1,0,""]
[22,{"$f":"'Wettkampf 1'!B31","v":"Schütze 22"},{"$f":"'Wettkampf 1'!C31","v":"Lorup III"},null,null,0,0,0,0,0,0,0,0,1,0,0,0,0,{"$nulls":8},1,0,""]
[23,{"$f":"'Wettkampf 1'!B32","v":"Schütze 23"},{"$f":"'Wettkampf 1'!C32","v":"Lorup III"},null,null,0,0,0,0,0,0,0,0,1,0,0,0,0,{"$nulls":8},1,0,""]
[24,{"$f":"'Wettkampf 1'!B33","v":"Norbert Jansen"},{"$f":"'Wettkampf 1'!C33","v":"Breddenb.-Heid. III"},null,null,0,0,0,0,0,0,0,0,0,0,1,0,0,{"$nulls":8},1,0,""]
[25,{"$f":"'Wettkampf 1'!B34","v":"Werner Jansen"},{"$f":"'Wettkampf 1'!C34","v":"Breddenb.-Heid. III"},null,null,0,0,0,0,0,0,0,0,0,0,1,0,0,{"$nulls":8},1,0,""]
[26,{"$f":"'Wettkampf 1'!B35","v":"Alfons Plüster"},{"$f":"'Wettkampf 1'!C35","v":"Breddenb.-Heid. III"},null,null,0,0,0,0,0,0,0,0,0,0,1,0,0,{"$nulls":8},1,0,""]
[27,{"$f":"'Wettkampf 1'!B36","v":"Johannes Oldiges"},{"$f":"'Wettkampf 1'!C36","v":"Breddenb.-Heid. III"},null,null,0,0,0,0,0,0,0,0,0,0,1,0,0,{"$nulls":8},1,0,""]
[28,{"$f":"'Wettkampf 1'!B37","v":"Hans Plüster"},{"$f":"'Wettkampf 1'!C37","v":"Breddenb.-Heid. III"},null,null,0,0,0,0,0,0,0,0,0,0,1,0,0,{"$nulls":8},1,0,""]
[29,{"$f":"'Wettkampf 1'!B38","v":"Josef Wübben "},{"$f":"'Wettkampf 1'!C38","v":"Breddenb.-Heid. III"},null,null,0,0,0,0,0,0,0,0,0,0,1,0,0,{"$nulls":8},1,0,""]
[30,{"$f":"'Wettkampf 1'!B39","v":"Thomas Niermann"},{"$f":"'Wettkampf 1'!C39","v":"Werlte III"},null,null,0,0,0,0,0,0,0,0,0,0,0,0,1,{"$nulls":8},1,0,""]
[31,{"$f":"'Wettkampf 1'!B40","v":"Bernd Thien"},{"$f":"'Wettkampf 1'!C40","v":"Werlte III"},null,null,0,0,0,0,0,0,0,0,0,0,0,0,1,{"$nulls":8},1,0,""]
[32,{"$f":"'Wettkampf 1'!B41","v":"Norbert Grünloh "},{"$f":"'Wettkampf 1'!C41","v":"Werlte III"},null,null,0,0,0,0,0,0,0,0,0,0,0,0,1,{"$nulls":8},1,0,""]
[33,{"$f":"'Wettkampf 1'!B42","v":"Andreas Thoben "},{"$f":"'Wettkampf 1'!C42","v":"Werlte III"},null,null,0,0,0,0,0,0,0,0,0,0,0,0,1,{"$nulls":8},1,0,""]
[34,{"$f":"'Wettkampf 1'!B43","v":"Hermann Krone "},{"$f":"'Wettkampf 1'!C43","v":"Werlte III"},null,null,0,0,0,0,0,0,0,0,0,0,0,0,1,{"$nulls":8},1,0,""]
[35,{"$f":"'Wettkampf 1'!B44","v":"Michael Freitag "},{"$f":"'Wettkampf 1'!C44","v":"Werlte III"},null,null,0,0,0,0,0,0,0,0,0,0,0,0,1,{"$nulls":8},1,0,""]
[36,{"$f":"'Wettkampf 1'!B45","v":"Joachim Niermann"},{"$f":"'Wettkampf 1'!C45","v":"Werlte III"},null,null,0,0,0,0,0,0,0,0,0,0,0,0,1,{"$nulls":8},1,0,""]
[{"$nulls":6},{"$f":"LARGE(G10:G45,1)+LARGE(G10:G45,2)+LARGE(G10:G45,3)","v":0},{"$f":"SUM(H10:H45)","v":5},{"$f":"LARGE(I10:I45,1)+LARGE(I10:I45,2)+LARGE(I10:I45,3)","v":0},{"$f":"SUM(J10:J45)","v":6},{"$f":"LARGE(K10:K45,1)+LARGE(K10:K45,2)+LARGE(K10:K45,3)","v":0},{"$f":"SUM(L10:L45)","v":6},{"$f":"LARGE(M10:M45,1)+LARGE(M10:M45,2)+LARGE(M10:M45,3)","v":0},{"$f":"SUM(N10:N45)","v":6},{"$f":"LARGE(O10:O45,1)+LARGE(O10:O45,2)+LARGE(O10:O45,3)","v":0},{"$f":"SUM(P10:P45)","v":6},{"$f":"LARGE(Q10:Q45,1)+LARGE(Q10:Q45,2)+LARGE(Q10:Q45,3)","v":0},{"$f":"SUM(R10:S45)","v":7}]
[]
[null,"Bitte beachtet, dass die Standaufsicht benannt werden muss"]

{"sheet":"Ausdruck blank","index":14,"n_rows":48,"n_cols":29,"rows_kept":48,"merged":[[0,3,0,19],[0,24,0,25],[1,3,1,19],[1,24,1,25],[2,3,2,19],[3,3,3,19],[4,24,4,25],[5,24,5,25],[6,24,6,25],[8,22,8,25]]}
[null,"Verein / Gruppe","Ergebnisse",{"$f":"Übersicht!K1","v":"2019/2020"},{"$nulls":19},"Austragungsort:"]
[1,null,null,"Klasse:",{"$nulls":19},"Wettkampftag:"]
[2]
[3,{"$nulls":24},"Ansprechpartner für Rückfragen:"]
[4,{"$nulls":22},"Name:"]
[5,{"$nulls":22},"Tel:"]
[6,{"$nulls":22},"Standaufsicht:"]
[]
[null,"Name Schütze","Verein/Gruppe","Ergebnis","AW? ",null,"Verein 1",null,"Verein 2",null,"Verein 3",null,"Verein 4",null,"Verein 5",null,"Verein 6",{"$nulls":3},"Geburts-datum",null,"Proberechnung bei Streifen:"]
[1,{"$nulls":4},{"$f":"IF(E10=\"x\",\"0\",D10)","v":0},{"$f":"IF(C10=$B$2,F10,0)","v":0},{"$f":"(IF(AND($E10=\"\",$C10=$B$2),1,0))","v":1},{"$f":"IF($C10=$B$3,F10,0)","v":0},{"$f":"(IF(AND($E10=\"\",$C10=$B$3),1,0))","v":1},{"$f":"IF($C10=$B$4,F10,0)","v":0},{"$f":"(IF(AND($E10=\"\",$C10=$B$4),1,0))","v":1},{"$f":"IF($C10=$B$5,F10,0)","v":0},{"$f":"(IF(AND($E10=\"\",$C10=$B$5),1,0))","v":1},{"$f":"IF($C10=$B$6,F10,0)","v":0},{"$f":"(IF(AND($E10=\"\",$C10=$B$6),1,0))","v":1},{"$f":"IF($C10=$B$7,F10,0)","v":0},{"$f":"(IF(AND($E10=\"\",$C10=$B$7),1,0))","v":1},{"$nulls":8},{"$f":"IF(Z10=D10,1,0)","v":1},{"$f":"IF(Z10=0,0,1)","v":0},{"$f":"IF(AA10+AB10=2,\"Korrekt\",\"\")","v":""}]
[2,{"$nulls":4},{"$f":"IF(E11=\"x\",\"0\",D11)","v":0},{"$f":"IF(C11=$B$2,F11,0)","v":0},{"$f":"(IF(AND($E11=\"\",$C11=$B$2),1,0))","v":1},{"$f":"IF($C11=$B$3,F11,0)","v":0},{"$f":"(IF(AND($E11=\"\",$C11=$B$3),1,0))","v":1},{"$f":"IF($C11=$B$4,F11,0)","v":0},{"$f":"(IF(AND($E11=\"\",$C11=$B$4),1,0))","v":1},{"$f":"IF($C11=$B$5,F11,0)","v":0},{"$f":"(IF(AND($E11=\"\",$C11=$B$5),1,0))","v":1},{"$f":"IF($C11=$B$6,F11,0)","v":0},{"$f":"(IF(AND($E11=\"\",$C11=$B$6),1,0))","v":1},{"$f":"IF($C11=$B$7,F11,0)","v":0},{"$f":"(IF(AND($E11=\"\",$C11=$B$7),1,0))","v":1},{"$nulls":8},{"$f":"IF(Z11=D11,1,0)","v":1},{"$f":"IF(Z11=0,0,1)","v":0},{"$f":"IF(AA11+AB11=2,\"Korrekt\",\"\")","v":""}]
[3,{"$nulls":4},0,0,1,0,1,0,1,0,1,0,1,0,1,{"$nulls":8},1,0,""]
[4,{"$nulls":4},0,0,1,0,1,0,1,0,1,0,1,0,1,{"$nulls":8},1,0,""]
[5,{"$nulls":4},0,0,1,0,1,0,1,0,1,0,1,0,1,{"$nulls":8},1,0,""]
[6,{"$nulls":4},0,0,1,0,1,0,1,0,1,0,1,0,1,{"$nulls":8},1,0,""]
[7,{"$nulls":4},0,0,1,0,1,0,1,0,1,0,1,0,1,{"$nulls":8},1,0,""]
[8,{"$nulls":4},0,0,1,0,1,0,1,0,1,0,1,0,1,{"$nulls":8},1,0,""]
[9,{"$nulls":4},0,0,1,0,1,0,1,0,1,0,1,0,1,{"$nulls":8},1,0,""]
[10,{"$nulls":4},0,0,1,0,1,0,1,0,1,0,1,0,1,{"$nulls":8},1,0,""]
[11,{"$nulls":4},0,0,1,0,1,0,1,0,1,0,1,0,1,{"$nulls":8},1,0,""]
[12,{"$nulls":4},0,0,1,0,1,0,1,0,1,0,1,0,1,{"$nulls":8},1,0,""]
[13,{"$nulls":4},0,0,1,0,1,0,1,0,1,0,1,0,1,{"$nulls":8},1,0,""]
[14,{"$nulls":4},0,0,1,0,1,0,1,0,1,0,1,0,1,{"$nulls":8},1,0,""]
[15,{"$nulls":4},0,0,1,0,1,0,1,0,1,0,1,0,1,{"$nulls":8},1,0,""]
[16,{"$nulls":4},0,0,1,0,1,0,1,0,1,0,1,0,1,{"$nulls":8},1,0,""]
[17,{"$nulls":4},0,0,1,0,1,0,1,0,1,0,1,0,1,{"$nulls":8},1,0,""]
[18,{"$nulls":4},0,0,1,0,1,0,1,0,1,0,1,0,1,{"$nulls":8},1,0,""]
[19,{"$nulls":4},0,0,1,0,1,0,1,0,1,0,1,0,1,{"$nulls":8},1,0,""]
[20,{"$nulls":4},0,0,1,0,1,0,1,0,1,0,1,0,1,{"$nulls":8},1,0,""]
[21,{"$nulls":4},0,0,1,0,1,0,1,0,1,0,1,0,1,{"$nulls":8},1,0,""]
[22,{"$nulls":4},0,0,1,0,1,0,1,0,1,0,1,0,1,{"$nulls":8},1,0,""]
[23,{"$nulls":4},0,0,1,0,1,0,1,0,1,0,1,0,1,{"$nulls":8},1,0,""]
[24,{"$nulls":4},0,0,1,0,1,0,1,0,1,0,1,0,1,{"$nulls":8},1,0,""]
[25,{"$nulls":4},0,0,1,0,1,0,1,0,1,0,1,0,1,{"$nulls":8},1,0,""]
[26,{"$nulls":4},0,0,1,0,1,0,1,0,1,0,1,0,1,{"$nulls":8},1,0,""]
[27,{"$nulls":4},0,0,1,0,1,0,1,0,1,0,1,0,1,{"$nulls":8},1,0,""]
[28,{"$nulls":4},0,0,1,0,1,0,1,0,1,0,1,0,1,{"$nulls":8},1,0,""]
[29,{"$nulls":4},0,0,1,0,1,0,1,0,1,0,1,0,1,{"$nulls":8},1,0,""]
[30,{"$nulls":4},0,0,1,0,1,0,1,0,1,0,1,0,1,{"$nulls":8},1,0,""]
[31,{"$nulls":4},0,0,1,0,1,0,1,0,1,0,1,0,1,{"$nulls":8},1,0,""]
[32,{"$nulls":4},0,0,1,0,1,0,1,0,1,0,1,0,1,{"$nulls":8},1,0,""]
[33,{"$nulls":4},0,0,1,0,1,0,1,0,1,0,1,0,1,{"$nulls":8},1,0,""]
[34,{"$nulls":4},0,0,1,0,1,0,1,0,1,0,1,0,1,{"$nulls":8},1,0,""]
[35,{"$nulls":4},0,0,1,0,1,0,1,0,1,0,1,0,1,{"$nulls":8},1,0,""]
[36,{"$nulls":4},0,0,1,0,1,0,1,0,1,0,1,0,1,{"$nulls":8},1,0,""]
[{"$nulls":6},{"$f":"LARGE(G10:G45,1)+LARGE(G10:G45,2)+LARGE(G10:G45,3)","v":0},{"$f":"SUM(H10:H45)","v":36},{"$f":"LARGE(I10:I45,1)+LARGE(I10:I45,2)+LARGE(I10:I45,3)","v":0},{"$f":"SUM(J10:J45)","v":36},{"$f":"LARGE(K10:K45,1)+LARGE(K10:K45,2)+LARGE(K10:K45,3)","v":0},{"$f":"SUM(L10:L45)","v":36},{"$f":"LARGE(M10:M45,1)+LARGE(M10:M45,2)+LARGE(M10:M45,3)","v":0},{"$f":"SUM(N10:N45)","v":36},{"$f":"LARGE(O10:O45,1)+LARGE(O10:O45,2)+LARGE(O10:O45,3)","v":0},{"$f":"SUM(P10:P45)","v":36},{"$f":"LARGE(Q10:Q45,1)+LARGE(Q10:Q45,2)+LARGE(Q10:Q45,3)","v":0},{"$f":"SUM(R10:S45)","v":36}]
[]
[null,"Bitte beachtet, dass die Standaufsicht benannt werden muss"]

{"sheet":"Übersicht Schützen","index":15,"n_rows":37,"n_cols":23,"rows_kept":37,"hidden":true}
[null,null,{"v":1,"d":"1.0"},{"v":2,"d":"2.0"},{"v":3,"d":"3.0"},{"v":4,"d":"4.0"},{"v":5,"d":"5.0"},{"v":6,"d":"6.0"},{"$nulls":3},{"v":7,"d":"7.0"},{"v":8,"d":"8.0"},{"v":9,"d":"9.0"},{"v":10,"d":"10.0"},{"v":11,"d":"11.0"},{"v":12,"d":"12.0"}]
["Philipp Schmidt",{"$f":"VLOOKUP(A2,'Wettkampf 1'!$B$10:$C$45,2,FALSE)","v":"Ostenwalde II"},{"$f":"VLOOKUP(A2,'Wettkampf 1'!$B$10:$D$45,3,FALSE)","v":313.2},{"$f":"VLOOKUP($A2,'2'!$B$10:$D$45,3,FALSE)","v":315.9},{"$f":"VLOOKUP($A2,'3'!$B$10:$D$45,3,FALSE)","v":315.4},{"$f":"VLOOKUP($A2,'4'!$B$10:$D$45,3,FALSE)","v":310.2},{"$f":"VLOOKUP($A2,' 5'!$B$10:$D$45,3,FALSE)","v":318.3},{"$f":"VLOOKUP($A2,' 6'!$B$10:$D$45,3,FALSE)","v":316.5},{"$f":"K2/J2","v":{"v":314.91666666666663,"d":"314.9"}},{"$f":"VLOOKUP(A2,Formelhilfe!$A$9:$H$44,8,FALSE)","v":{"v":6,"d":"6.0"}},{"$f":"SUM(C2:H2)","v":{"v":1889.4999999999998,"d":"1,889.5"}},{"$f":"VLOOKUP($A2,'7'!$B$10:$D$45,3,FALSE)","v":315.8},{"$f":"VLOOKUP($A2,'8'!$B$10:$D$45,3,FALSE)","v":317.1},{"$f":"VLOOKUP($A2,'9'!$B$10:$D$45,3,FALSE)","v":316.9},{"$f":"VLOOKUP($A2,' 10'!$B$10:$D$45,3,FALSE)","v":313.6},{"$f":"VLOOKUP($A2,'11'!$B$10:$D$45,3,FALSE)","v":314.1},{"$f":"VLOOKUP($A2,'12'!$B$10:$D$45,3,FALSE)","v":{"v":0,"d":"0.0"}},{"$f":"T2/S2","v":315.5},{"$f":"VLOOKUP(A2,Formelhilfe!$A$9:$O$44,15,FALSE)","v":{"v":5,"d":"5.0"}},{"$f":"SUM(L2:Q2)","v":{"v":1577.5,"d":"1,577.5"}},{"$f":"W2/V2","v":{"v":315.18181818181813,"d":"315.2"}},{"$f":"VLOOKUP(A2,Formelhilfe!$A$9:$P$44,16,FALSE)","v":{"v":11,"d":"11.0"}},{"$f":"SUM(C2:H2,L2:Q2)","v":{"v":3466.9999999999995,"d":"3,467.0"}}]
["Frank Wotte",{"$f":"VLOOKUP(A3,'Wettkampf 1'!$B$10:$C$45,2,FALSE)","v":"Lorup III"},{"$f":"VLOOKUP(A3,'Wettkampf 1'!$B$10:$D$45,3,FALSE)","v":{"v":312,"d":"312.0"}},{"$f":"VLOOKUP($A3,'2'!$B$10:$D$45,3,FALSE)","v":{"v":313,"d":"313.0"}},{"$f":"VLOOKUP($A3,'3'!$B$10:$D$45,3,FALSE)","v":314.5},{"$f":"VLOOKUP($A3,'4'!$B$10:$D$45,3,FALSE)","v":314.5},{"$f":"VLOOKUP($A3,' 5'!$B$10:$D$45,3,FALSE)","v":314.6},{"$f":"VLOOKUP($A3,' 6'!$B$10:$D$45,3,FALSE)","v":311.6},{"v":313.3666666666666,"d":"313.4"},{"$f":"VLOOKUP(A3,Formelhilfe!$A$9:$H$44,8,FALSE)","v":{"v":6,"d":"6.0"}},{"v":1880.1999999999998,"d":"1,880.2"},{"$f":"VLOOKUP($A3,'7'!$B$10:$D$45,3,FALSE)","v":313.8},{"$f":"VLOOKUP($A3,'8'!$B$10:$D$45,3,FALSE)","v":313.6},{"$f":"VLOOKUP($A3,'9'!$B$10:$D$45,3,FALSE)","v":314.2},{"$f":"VLOOKUP($A3,' 10'!$B$10:$D$45,3,FALSE)","v":314.2},{"$f":"VLOOKUP($A3,'11'!$B$10:$D$45,3,FALSE)","v":314.1},{"$f":"VLOOKUP($A3,'12'!$B$10:$D$45,3,FALSE)","v":{"v":0,"d":"0.0"}},{"v":313.98,"d":"314.0"},{"$f":"VLOOKUP(A3,Formelhilfe!$A$9:$O$44,15,FALSE)","v":{"v":5,"d":"5.0"}},{"v":1569.9,"d":"1,569.9"},{"v":313.64545454545447,"d":"313.6"},{"$f":"VLOOKUP(A3,Formelhilfe!$A$9:$P$44,16,FALSE)","v":{"v":11,"d":"11.0"}},{"v":3450.0999999999995,"d":"3,450.1"}]
["Bernd Thien",{"$f":"VLOOKUP(A4,'Wettkampf 1'!$B$10:$C$45,2,FALSE)","v":"Werlte III"},{"$f":"VLOOKUP(A4,'Wettkampf 1'!$B$10:$D$45,3,FALSE)","v":311.9},{"$f":"VLOOKUP($A4,'2'!$B$10:$D$45,3,FALSE)","v":315.1},{"$f":"VLOOKUP($A4,'3'!$B$10:$D$45,3,FALSE)","v":314.4},{"$f":"VLOOKUP($A4,'4'!$B$10:$D$45,3,FALSE)","v":311.9},{"$f":"VLOOKUP($A4,' 5'!$B$10:$D$45,3,FALSE)","v":314.3},{"$f":"VLOOKUP($A4,' 6'!$B$10:$D$45,3,FALSE)","v":{"v":309,"d":"309.0"}},{"v":312.76666666666665,"d":"312.8"},{"$f":"VLOOKUP(A4,Formelhilfe!$A$9:$H$44,8,FALSE)","v":{"v":6,"d":"6.0"}},{"v":1876.6,"d":"1,876.6"},{"$f":"VLOOKUP($A4,'7'!$B$10:$D$45,3,FALSE)","v":310.7},{"$f":"VLOOKUP($A4,'8'!$B$10:$D$45,3,FALSE)","v":313.7},{"$f":"VLOOKUP($A4,'9'!$B$10:$D$45,3,FALSE)","v":317.7},{"$f":"VLOOKUP($A4,' 10'!$B$10:$D$45,3,FALSE)","v":313.2},{"$f":"VLOOKUP($A4,'11'!$B$10:$D$45,3,FALSE)","v":313.9},{"$f":"VLOOKUP($A4,'12'!$B$10:$D$45,3,FALSE)","v":{"v":0,"d":"0.0"}},{"v":313.84,"d":"313.8"},{"$f":"VLOOKUP(A4,Formelhilfe!$A$9:$O$44,15,FALSE)","v":{"v":5,"d":"5.0"}},{"v":1569.1999999999998,"d":"1,569.2"},{"v":313.2545454545454,"d":"313.3"},{"$f":"VLOOKUP(A4,Formelhilfe!$A$9:$P$44,16,FALSE)","v":{"v":11,"d":"11.0"}},{"v":3445.7999999999993,"d":"3,445.8"}]
["Hans Plüster",{"$f":"VLOOKUP(A5,'Wettkampf 1'!$B$10:$C$45,2,FALSE)","v":"Breddenb.-Heid. III"},{"$f":"VLOOKUP(A5,'Wettkampf 1'!$B$10:$D$45,3,FALSE)","v":310.9},{"$f":"VLOOKUP($A5,'2'!$B$10:$D$45,3,FALSE)","v":309.6},{"$f":"VLOOKUP($A5,'3'!$B$10:$D$45,3,FALSE)","v":314.8},{"$f":"VLOOKUP($A5,'4'!$B$10:$D$45,3,FALSE)","v":312.2},{"$f":"VLOOKUP($A5,' 5'!$B$10:$D$45,3,FALSE)","v":312.8},{"$f":"VLOOKUP($A5,' 6'!$B$10:$D$45,3,FALSE)","v":311.4},{"v":311.95,"d":"312.0"},{"$f":"VLOOKUP(A5,Formelhilfe!$A$9:$H$44,8,FALSE)","v":{"v":6,"d":"6.0"}},{"v":1871.6999999999998,"d":"1,871.7"},{"$f":"VLOOKUP($A5,'7'!$B$10:$D$45,3,FALSE)","v":315.6},{"$f":"VLOOKUP($A5,'8'!$B$10:$D$45,3,FALSE)","v":313.4},{"$f":"VLOOKUP($A5,'9'!$B$10:$D$45,3,FALSE)","v":314.3},{"$f":"VLOOKUP($A5,' 10'!$B$10:$D$45,3,FALSE)","v":311.4},{"$f":"VLOOKUP($A5,'11'!$B$10:$D$45,3,FALSE)","v":315.2},{"$f":"VLOOKUP($A5,'12'!$B$10:$D$45,3,FALSE)","v":{"v":0,"d":"0.0"}},{"v":313.97999999999996,"d":"314.0"},{"$f":"VLOOKUP(A5,Formelhilfe!$A$9:$O$44,15,FALSE)","v":{"v":5,"d":"5.0"}},{"v":1569.8999999999999,"d":"1,569.9"},{"v":312.8727272727273,"d":"312.9"},{"$f":"VLOOKUP(A5,Formelhilfe!$A$9:$P$44,16,FALSE)","v":{"v":11,"d":"11.0"}},{"v":3441.6,"d":"3,441.6"}]
["Philipp Scholübbers ",{"$f":"VLOOKUP(A6,'Wettkampf 1'!$B$10:$C$45,2,FALSE)","v":"Ostenwalde II"},{"$f":"VLOOKUP(A6,'Wettkampf 1'!$B$10:$D$45,3,FALSE)","v":312.2},{"$f":"VLOOKUP($A6,'2'!$B$10:$D$45,3,FALSE)","v":314.1},{"$f":"VLOOKUP($A6,'3'!$B$10:$D$45,3,FALSE)","v":315.4},{"$f":"VLOOKUP($A6,'4'!$B$10:$D$45,3,FALSE)","v":312.4},{"$f":"VLOOKUP($A6,' 5'!$B$10:$D$45,3,FALSE)","v":314.6},{"$f":"VLOOKUP($A6,' 6'!$B$10:$D$45,3,FALSE)","v":312.7},{"v":313.56666666666666,"d":"313.6"},{"$f":"VLOOKUP(A6,Formelhilfe!$A$9:$H$44,8,FALSE)","v":{"v":6,"d":"6.0"}},{"v":1881.3999999999999,"d":"1,881.4"},{"$f":"VLOOKUP($A6,'7'!$B$10:$D$45,3,FALSE)","v":{"v":314,"d":"314.0"}},{"$f":"VLOOKUP($A6,'8'!$B$10:$D$45,3,FALSE)","v":{"v":311.70000000000005,"d":"311.7"}},{"$f":"VLOOKUP($A6,'9'!$B$10:$D$45,3,FALSE)","v":{"v":316,"d":"316.0"}},{"$f":"VLOOKUP($A6,' 10'!$B$10:$D$45,3,FALSE)","v":303.3},{"$f":"VLOOKUP($A6,'11'!$B$10:$D$45,3,FALSE)","v":313.7},{"$f":"VLOOKUP($A6,'12'!$B$10:$D$45,3,FALSE)","v":{"v":0,"d":"0.0"}},{"v":311.74,"d":"311.7"},{"$f":"VLOOKUP(A6,Formelhilfe!$A$9:$O$44,15,FALSE)","v":{"v":5,"d":"5.0"}},{"v":1558.7,"d":"1,558.7"},{"v":312.7363636363636,"d":"312.7"},{"$f":"VLOOKUP(A6,Formelhilfe!$A$9:$P$44,16,FALSE)","v":{"v":11,"d":"11.0"}},{"v":3440.0999999999995,"d":"3,440.1"}]
["Andreas Thoben ",{"$f":"VLOOKUP(A7,'Wettkampf 1'!$B$10:$C$45,2,FALSE)","v":"Werlte III"},{"$f":"VLOOKUP(A7,'Wettkampf 1'!$B$10:$D$45,3,FALSE)","v":314.8},{"$f":"VLOOKUP($A7,'2'!$B$10:$D$45,3,FALSE)","v":311.7},{"$f":"VLOOKUP($A7,'3'!$B$10:$D$45,3,FALSE)","v":313.4},{"$f":"VLOOKUP($A7,'4'!$B$10:$D$45,3,FALSE)","v":313.9},{"$f":"VLOOKUP($A7,' 5'!$B$10:$D$45,3,FALSE)","v":314.4},{"$f":"VLOOKUP($A7,' 6'!$B$10:$D$45,3,FALSE)","v":312.8},{"v":313.49999999999994,"d":"313.5"},{"$f":"VLOOKUP(A7,Formelhilfe!$A$9:$H$44,8,FALSE)","v":{"v":6,"d":"6.0"}},{"v":1880.9999999999998,"d":"1,881.0"},{"$f":"VLOOKUP($A7,'7'!$B$10:$D$45,3,FALSE)","v":{"v":316,"d":"316.0"}},{"$f":"VLOOKUP($A7,'8'!$B$10:$D$45,3,FALSE)","v":312.7},{"$f":"VLOOKUP($A7,'9'!$B$10:$D$45,3,FALSE)","v":307.2},{"$f":"VLOOKUP($A7,' 10'!$B$10:$D$45,3,FALSE)","v":309.8},{"$f":"VLOOKUP($A7,'11'!$B$10:$D$45,3,FALSE)","v":310.3},{"$f":"VLOOKUP($A7,'12'!$B$10:$D$45,3,FALSE)","v":{"v":0,"d":"0.0"}},311.2,{"$f":"VLOOKUP(A7,Formelhilfe!$A$9:$O$44,15,FALSE)","v":{"v":5,"d":"5.0"}},{"v":1556,"d":"1,556.0"},{"v":312.45454545454544,"d":"312.5"},{"$f":"VLOOKUP(A7,Formelhilfe!$A$9:$P$44,16,FALSE)","v":{"v":11,"d":"11.0"}},{"v":3437,"d":"3,437.0"}]
["Johannes Jansen",{"$f":"VLOOKUP(A8,'Wettkampf 1'!$B$10:$C$45,2,FALSE)","v":"Börgermoor II"},{"$f":"VLOOKUP(A8,'Wettkampf 1'!$B$10:$D$45,3,FALSE)","v":312.1},{"$f":"VLOOKUP($A8,'2'!$B$10:$D$45,3,FALSE)","v":308.3},{"$f":"VLOOKUP($A8,'3'!$B$10:$D$45,3,FALSE)","v":313.6},{"$f":"VLOOKUP($A8,'4'!$B$10:$D$45,3,FALSE)","v":{"v":309,"d":"309.0"}},{"$f":"VLOOKUP($A8,' 5'!$B$10:$D$45,3,FALSE)","v":310.1},{"$f":"VLOOKUP($A8,' 6'!$B$10:$D$45,3,FALSE)","v":311.5},{"v":310.76666666666665,"d":"310.8"},{"$f":"VLOOKUP(A8,Formelhilfe!$A$9:$H$44,8,FALSE)","v":{"v":6,"d":"6.0"}},{"v":1864.6,"d":"1,864.6"},{"$f":"VLOOKUP($A8,'7'!$B$10:$D$45,3,FALSE)","v":{"v":313,"d":"313.0"}},{"$f":"VLOOKUP($A8,'8'!$B$10:$D$45,3,FALSE)","v":{"v":314.20000000000005,"d":"314.2"}},{"$f":"VLOOKUP($A8,'9'!$B$10:$D$45,3,FALSE)","v":310.5},{"$f":"VLOOKUP($A8,' 10'!$B$10:$D$45,3,FALSE)","v":311.9},{"$f":"VLOOKUP($A8,'11'!$B$10:$D$45,3,FALSE)","v":311.9},{"$f":"VLOOKUP($A8,'12'!$B$10:$D$45,3,FALSE)","v":{"v":0,"d":"0.0"}},312.3,{"$f":"VLOOKUP(A8,Formelhilfe!$A$9:$O$44,15,FALSE)","v":{"v":5,"d":"5.0"}},{"v":1561.5,"d":"1,561.5"},{"v":311.4636363636364,"d":"311.5"},{"$f":"VLOOKUP(A8,Formelhilfe!$A$9:$P$44,16,FALSE)","v":{"v":11,"d":"11.0"}},{"v":3426.1000000000004,"d":"3,426.1"}]
["Thomas Niermann",{"$f":"VLOOKUP(A9,'Wettkampf 1'!$B$10:$C$45,2,FALSE)","v":"Werlte III"},{"$f":"VLOOKUP(A9,'Wettkampf 1'!$B$10:$D$45,3,FALSE)","v":313.1},{"$f":"VLOOKUP($A9,'2'!$B$10:$D$45,3,FALSE)","v":311.2},{"$f":"VLOOKUP($A9,'3'!$B$10:$D$45,3,FALSE)","v":313.6},{"$f":"VLOOKUP($A9,'4'!$B$10:$D$45,3,FALSE)","v":310.1},{"$f":"VLOOKUP($A9,' 5'!$B$10:$D$45,3,FALSE)","v":{"v":308,"d":"308.0"}},{"$f":"VLOOKUP($A9,' 6'!$B$10:$D$45,3,FALSE)","v":310.5},{"v":311.0833333333333,"d":"311.1"},{"$f":"VLOOKUP(A9,Formelhilfe!$A$9:$H$44,8,FALSE)","v":{"v":6,"d":"6.0"}},{"v":1866.5,"d":"1,866.5"},{"$f":"VLOOKUP($A9,'7'!$B$10:$D$45,3,FALSE)","v":312.3},{"$f":"VLOOKUP($A9,'8'!$B$10:$D$45,3,FALSE)","v":315.3},{"$f":"VLOOKUP($A9,'9'!$B$10:$D$45,3,FALSE)","v":{"v":310,"d":"310.0"}},{"$f":"VLOOKUP($A9,' 10'!$B$10:$D$45,3,FALSE)","v":307.8},{"$f":"VLOOKUP($A9,'11'!$B$10:$D$45,3,FALSE)","v":312.1},{"$f":"VLOOKUP($A9,'12'!$B$10:$D$45,3,FALSE)","v":{"v":0,"d":"0.0"}},311.5,{"$f":"VLOOKUP(A9,Formelhilfe!$A$9:$O$44,15,FALSE)","v":{"v":5,"d":"5.0"}},{"v":1557.5,"d":"1,557.5"},{"v":311.2727272727273,"d":"311.3"},{"$f":"VLOOKUP(A9,Formelhilfe!$A$9:$P$44,16,FALSE)","v":{"v":11,"d":"11.0"}},{"v":3424.0000000000005,"d":"3,424.0"}]
["Norbert Grünloh ",{"$f":"VLOOKUP(A10,'Wettkampf 1'!$B$10:$C$45,2,FALSE)","v":"Werlte III"},{"$f":"VLOOKUP(A10,'Wettkampf 1'!$B$10:$D$45,3,FALSE)","v":311.6},{"$f":"VLOOKUP($A10,'2'!$B$10:$D$45,3,FALSE)","v":311.3},{"$f":"VLOOKUP($A10,'3'!$B$10:$D$45,3,FALSE)","v":315.1},{"$f":"VLOOKUP($A10,'4'!$B$10:$D$45,3,FALSE)","v":{"v":313,"d":"313.0"}},{"$f":"VLOOKUP($A10,' 5'!$B$10:$D$45,3,FALSE)","v":310.2},{"$f":"VLOOKUP($A10,' 6'!$B$10:$D$45,3,FALSE)","v":313.8},312.5,{"$f":"VLOOKUP(A10,Formelhilfe!$A$9:$H$44,8,FALSE)","v":{"v":6,"d":"6.0"}},{"v":1875,"d":"1,875.0"},{"$f":"VLOOKUP($A10,'7'!$B$10:$D$45,3,FALSE)","v":307.8},{"$f":"VLOOKUP($A10,'8'!$B$10:$D$45,3,FALSE)","v":309.5},{"$f":"VLOOKUP($A10,'9'!$B$10:$D$45,3,FALSE)","v":311.6},{"$f":"VLOOKUP($A10,' 10'!$B$10:$D$45,3,FALSE)","v":309.3},{"$f":"VLOOKUP($A10,'11'!$B$10:$D$45,3,FALSE)","v":309.7},{"$f":"VLOOKUP($A10,'12'!$B$10:$D$45,3,FALSE)","v":{"v":0,"d":"0.0"}},{"v":309.58000000000004,"d":"309.6"},{"$f":"VLOOKUP(A10,Formelhilfe!$A$9:$O$44,15,FALSE)","v":{"v":5,"d":"5.0"}},{"v":1547.9,"d":"1,547.9"},{"v":311.1727272727273,"d":"311.2"},{"$f":"VLOOKUP(A10,Formelhilfe!$A$9:$P$44,16,FALSE)","v":{"v":11,"d":"11.0"}},{"v":3422.9,"d":"3,422.9"}]
["Patrik Krüßel",{"$f":"VLOOKUP(A11,'Wettkampf 1'!$B$10:$C$45,2,FALSE)","v":"Ostenwalde II"},{"$f":"VLOOKUP(A11,'Wettkampf 1'!$B$10:$D$45,3,FALSE)","v":311.8},{"$f":"VLOOKUP($A11,'2'!$B$10:$D$45,3,FALSE)","v":312.8},{"$f":"VLOOKUP($A11,'3'!$B$10:$D$45,3,FALSE)","v":314.3},{"$f":"VLOOKUP($A11,'4'!$B$10:$D$45,3,FALSE)","v":311.1},{"$f":"VLOOKUP($A11,' 5'!$B$10:$D$45,3,FALSE)","v":313.6},{"$f":"VLOOKUP($A11,' 6'!$B$10:$D$45,3,FALSE)","v":311.8},{"v":312.56666666666666,"d":"312.6"},{"$f":"VLOOKUP(A11,Formelhilfe!$A$9:$H$44,8,FALSE)","v":{"v":6,"d":"6.0"}},{"v":1875.3999999999999,"d":"1,875.4"},{"$f":"VLOOKUP($A11,'7'!$B$10:$D$45,3,FALSE)","v":308.8},{"$f":"VLOOKUP($A11,'8'!$B$10:$D$45,3,FALSE)","v":305.4},{"$f":"VLOOKUP($A11,'9'!$B$10:$D$45,3,FALSE)","v":310.6},{"$f":"VLOOKUP($A11,' 10'!$B$10:$D$45,3,FALSE)","v":309.9},{"$f":"VLOOKUP($A11,'11'!$B$10:$D$45,3,FALSE)","v":312.6},{"$f":"VLOOKUP($A11,'12'!$B$10:$D$45,3,FALSE)","v":{"v":0,"d":"0.0"}},{"v":309.46000000000004,"d":"309.5"},{"$f":"VLOOKUP(A11,Formelhilfe!$A$9:$O$44,15,FALSE)","v":{"v":5,"d":"5.0"}},{"v":1547.3000000000002,"d":"1,547.3"},{"v":311.1545454545454,"d":"311.2"},{"$f":"VLOOKUP(A11,Formelhilfe!$A$9:$P$44,16,FALSE)","v":{"v":11,"d":"11.0"}},{"v":3422.7,"d":"3,422.7"}]
["Johannes Wesseln",{"$f":"VLOOKUP(A12,'Wettkampf 1'!$B$10:$C$45,2,FALSE)","v":"Lorup III"},{"$f":"VLOOKUP(A12,'Wettkampf 1'!$B$10:$D$45,3,FALSE)","v":310.2},{"$f":"VLOOKUP($A12,'2'!$B$10:$D$45,3,FALSE)","v":308.8},{"$f":"VLOOKUP($A12,'3'!$B$10:$D$45,3,FALSE)","v":311.5},{"$f":"VLOOKUP($A12,'4'!$B$10:$D$45,3,FALSE)","v":310.2},{"$f":"VLOOKUP($A12,' 5'!$B$10:$D$45,3,FALSE)","v":311.5},{"$f":"VLOOKUP($A12,' 6'!$B$10:$D$45,3,FALSE)","v":312.1},{"v":310.7166666666667,"d":"310.7"},{"$f":"VLOOKUP(A12,Formelhilfe!$A$9:$H$44,8,FALSE)","v":{"v":6,"d":"6.0"}},{"v":1864.3000000000002,"d":"1,864.3"},{"$f":"VLOOKUP($A12,'7'!$B$10:$D$45,3,FALSE)","v":312.9},{"$f":"VLOOKUP($A12,'8'!$B$10:$D$45,3,FALSE)","v":{"v":308.70000000000005,"d":"308.7"}},{"$f":"VLOOKUP($A12,'9'!$B$10:$D$45,3,FALSE)","v":307.9},{"$f":"VLOOKUP($A12,' 10'!$B$10:$D$45,3,FALSE)","v":311.5},{"$f":"VLOOKUP($A12,'11'!$B$10:$D$45,3,FALSE)","v":312.4},{"$f":"VLOOKUP($A12,'12'!$B$10:$D$45,3,FALSE)","v":{"v":0,"d":"0.0"}},{"v":310.68,"d":"310.7"},{"$f":"VLOOKUP(A12,Formelhilfe!$A$9:$O$44,15,FALSE)","v":{"v":5,"d":"5.0"}},{"v":1553.4,"d":"1,553.4"},{"v":310.70000000000005,"d":"310.7"},{"$f":"VLOOKUP(A12,Formelhilfe!$A$9:$P$44,16,FALSE)","v":{"v":11,"d":"11.0"}},{"v":3417.7000000000007,"d":"3,417.7"}]
["Jürgen Will",{"$f":"VLOOKUP(A13,'Wettkampf 1'!$B$10:$C$45,2,FALSE)","v":"Lorup III"},{"$f":"VLOOKUP(A13,'Wettkampf 1'!$B$10:$D$45,3,FALSE)","v":313.9},{"$f":"VLOOKUP($A13,'2'!$B$10:$D$45,3,FALSE)","v":311.5},{"$f":"VLOOKUP($A13,'3'!$B$10:$D$45,3,FALSE)","v":312.5},{"$f":"VLOOKUP($A13,'4'!$B$10:$D$45,3,FALSE)","v":312.5},{"$f":"VLOOKUP($A13,' 5'!$B$10:$D$45,3,FALSE)","v":305.2},{"$f":"VLOOKUP($A13,' 6'!$B$10:$D$45,3,FALSE)","v":308.4},{"v":310.6666666666667,"d":"310.7"},{"$f":"VLOOKUP(A13,Formelhilfe!$A$9:$H$44,8,FALSE)","v":{"v":6,"d":"6.0"}},{"v":1864,"d":"1,864.0"},{"$f":"VLOOKUP($A13,'7'!$B$10:$D$45,3,FALSE)","v":310.3},{"$f":"VLOOKUP($A13,'8'!$B$10:$D$45,3,FALSE)","v":{"v":310,"d":"310.0"}},{"$f":"VLOOKUP($A13,'9'!$B$10:$D$45,3,FALSE)","v":310.9},{"$f":"VLOOKUP($A13,' 10'!$B$10:$D$45,3,FALSE)","v":{"v":311,"d":"311.0"}},{"$f":"VLOOKUP($A13,'11'!$B$10:$D$45,3,FALSE)","v":308.9},{"$f":"VLOOKUP($A13,'12'!$B$10:$D$45,3,FALSE)","v":{"v":0,"d":"0.0"}},{"v":310.21999999999997,"d":"310.2"},{"$f":"VLOOKUP(A13,Formelhilfe!$A$9:$O$44,15,FALSE)","v":{"v":5,"d":"5.0"}},{"v":1551.1,"d":"1,551.1"},{"v":310.4636363636364,"d":"310.5"},{"$f":"VLOOKUP(A13,Formelhilfe!$A$9:$P$44,16,FALSE)","v":{"v":11,"d":"11.0"}},{"v":3415.1000000000004,"d":"3,415.1"}]
["Hans Ortmann ",{"$f":"VLOOKUP(A14,'Wettkampf 1'!$B$10:$C$45,2,FALSE)","v":"Börgermoor II"},{"$f":"VLOOKUP(A14,'Wettkampf 1'!$B$10:$D$45,3,FALSE)","v":{"v":310,"d":"310.0"}},{"$f":"VLOOKUP($A14,'2'!$B$10:$D$45,3,FALSE)","v":311.1},{"$f":"VLOOKUP($A14,'3'!$B$10:$D$45,3,FALSE)","v":310.2},{"$f":"VLOOKUP($A14,'4'!$B$10:$D$45,3,FALSE)","v":311.1},{"$f":"VLOOKUP($A14,' 5'!$B$10:$D$45,3,FALSE)","v":310.1},{"$f":"VLOOKUP($A14,' 6'!$B$10:$D$45,3,FALSE)","v":309.7},{"v":310.3666666666667,"d":"310.4"},{"$f":"VLOOKUP(A14,Formelhilfe!$A$9:$H$44,8,FALSE)","v":{"v":6,"d":"6.0"}},{"v":1862.2,"d":"1,862.2"},{"$f":"VLOOKUP($A14,'7'!$B$10:$D$45,3,FALSE)","v":309.6},{"$f":"VLOOKUP($A14,'8'!$B$10:$D$45,3,FALSE)","v":306.7},{"$f":"VLOOKUP($A14,'9'!$B$10:$D$45,3,FALSE)","v":308.8},{"$f":"VLOOKUP($A14,' 10'!$B$10:$D$45,3,FALSE)","v":310.1},{"$f":"VLOOKUP($A14,'11'!$B$10:$D$45,3,FALSE)","v":310.4},{"$f":"VLOOKUP($A14,'12'!$B$10:$D$45,3,FALSE)","v":{"v":0,"d":"0.0"}},{"v":309.12,"d":"309.1"},{"$f":"VLOOKUP(A14,Formelhilfe!$A$9:$O$44,15,FALSE)","v":{"v":5,"d":"5.0"}},{"v":1545.6,"d":"1,545.6"},309.8,{"$f":"VLOOKUP(A14,Formelhilfe!$A$9:$P$44,16,FALSE)","v":{"v":11,"d":"11.0"}},{"v":3407.8,"d":"3,407.8"}]
["Markus Jansen",{"$f":"VLOOKUP(A15,'Wettkampf 1'!$B$10:$C$45,2,FALSE)","v":"Ostenwalde II"},{"$f":"VLOOKUP(A15,'Wettkampf 1'!$B$10:$D$45,3,FALSE)","v":{"v":309,"d":"309.0"}},{"$f":"VLOOKUP($A15,'2'!$B$10:$D$45,3,FALSE)","v":311.1},{"$f":"VLOOKUP($A15,'3'!$B$10:$D$45,3,FALSE)","v":310.7},{"$f":"VLOOKUP($A15,'4'!$B$10:$D$45,3,FALSE)","v":308.3},{"$f":"VLOOKUP($A15,' 5'!$B$10:$D$45,3,FALSE)","v":311.7},{"$f":"VLOOKUP($A15,' 6'!$B$10:$D$45,3,FALSE)","v":308.6},{"v":309.90000000000003,"d":"309.9"},{"$f":"VLOOKUP(A15,Formelhilfe!$A$9:$H$44,8,FALSE)","v":{"v":6,"d":"6.0"}},{"v":1859.4,"d":"1,859.4"},{"$f":"VLOOKUP($A15,'7'!$B$10:$D$45,3,FALSE)","v":{"v":309,"d":"309.0"}},{"$f":"VLOOKUP($A15,'8'!$B$10:$D$45,3,FALSE)","v":{"v":308,"d":"308.0"}},{"$f":"VLOOKUP($A15,'9'!$B$10:$D$45,3,FALSE)","v":311.3},{"$f":"VLOOKUP($A15,' 10'!$B$10:$D$45,3,FALSE)","v":310.8},{"$f":"VLOOKUP($A15,'11'!$B$10:$D$45,3,FALSE)","v":306.9},{"$f":"VLOOKUP($A15,'12'!$B$10:$D$45,3,FALSE)","v":{"v":0,"d":"0.0"}},309.2,{"$f":"VLOOKUP(A15,Formelhilfe!$A$9:$O$44,15,FALSE)","v":{"v":5,"d":"5.0"}},{"v":1546,"d":"1,546.0"},{"v":309.5818181818182,"d":"309.6"},{"$f":"VLOOKUP(A15,Formelhilfe!$A$9:$P$44,16,FALSE)","v":{"v":11,"d":"11.0"}},{"v":3405.4000000000005,"d":"3,405.4"}]
["Willi Engbers",{"$f":"VLOOKUP(A16,'Wettkampf 1'!$B$10:$C$45,2,FALSE)","v":"Breddenb.-Heid. I"},{"$f":"VLOOKUP(A16,'Wettkampf 1'!$B$10:$D$45,3,FALSE)","v":312.3},{"$f":"VLOOKUP($A16,'2'!$B$10:$D$45,3,FALSE)","v":{"v":308,"d":"308.0"}},{"$f":"VLOOKUP($A16,'3'!$B$10:$D$45,3,FALSE)","v":309.2},{"$f":"VLOOKUP($A16,'4'!$B$10:$D$45,3,FALSE)","v":309.4},{"$f":"VLOOKUP($A16,' 5'!$B$10:$D$45,3,FALSE)","v":{"v":309,"d":"309.0"}},{"$f":"VLOOKUP($A16,' 6'!$B$10:$D$45,3,FALSE)","v":307.9},309.3,{"$f":"VLOOKUP(A16,Formelhilfe!$A$9:$H$44,8,FALSE)","v":{"v":6,"d":"6.0"}},{"v":1855.8000000000002,"d":"1,855.8"},{"$f":"VLOOKUP($A16,'7'!$B$10:$D$45,3,FALSE)","v":311.1},{"$f":"VLOOKUP($A16,'8'!$B$10:$D$45,3,FALSE)","v":{"v":307.20000000000005,"d":"307.2"}},{"$f":"VLOOKUP($A16,'9'!$B$10:$D$45,3,FALSE)","v":310.6},{"$f":"VLOOKUP($A16,' 10'!$B$10:$D$45,3,FALSE)","v":309.7},{"$f":"VLOOKUP($A16,'11'!$B$10:$D$45,3,FALSE)","v":310.1},{"$f":"VLOOKUP($A16,'12'!$B$10:$D$45,3,FALSE)","v":{"v":0,"d":"0.0"}},{"v":309.74000000000007,"d":"309.7"},{"$f":"VLOOKUP(A16,Formelhilfe!$A$9:$O$44,15,FALSE)","v":{"v":5,"d":"5.0"}},{"v":1548.7000000000003,"d":"1,548.7"},309.5,{"$f":"VLOOKUP(A16,Formelhilfe!$A$9:$P$44,16,FALSE)","v":{"v":11,"d":"11.0"}},{"v":3404.5,"d":"3,404.5"}]
["Karl-Heinz Ortmann",{"$f":"VLOOKUP(A17,'Wettkampf 1'!$B$10:$C$45,2,FALSE)","v":"Börgermoor II"},{"$f":"VLOOKUP(A17,'Wettkampf 1'!$B$10:$D$45,3,FALSE)","v":305.9},{"$f":"VLOOKUP($A17,'2'!$B$10:$D$45,3,FALSE)","v":306.9},{"$f":"VLOOKUP($A17,'3'!$B$10:$D$45,3,FALSE)","v":312.2},{"$f":"VLOOKUP($A17,'4'!$B$10:$D$45,3,FALSE)","v":309.3},{"$f":"VLOOKUP($A17,' 5'!$B$10:$D$45,3,FALSE)","v":307.7},{"$f":"VLOOKUP($A17,' 6'!$B$10:$D$45,3,FALSE)","v":307.7},{"v":308.28333333333336,"d":"308.3"},{"$f":"VLOOKUP(A17,Formelhilfe!$A$9:$H$44,8,FALSE)","v":{"v":6,"d":"6.0"}},{"v":1849.7,"d":"1,849.7"},{"$f":"VLOOKUP($A17,'7'!$B$10:$D$45,3,FALSE)","v":310.6},{"$f":"VLOOKUP($A17,'8'!$B$10:$D$45,3,FALSE)","v":306.4},{"$f":"VLOOKUP($A17,'9'!$B$10:$D$45,3,FALSE)","v":{"v":313,"d":"313.0"}},{"$f":"VLOOKUP($A17,' 10'!$B$10:$D$45,3,FALSE)","v":310.2},{"$f":"VLOOKUP($A17,'11'!$B$10:$D$45,3,FALSE)","v":{"v":310,"d":"310.0"}},{"$f":"VLOOKUP($A17,'12'!$B$10:$D$45,3,FALSE)","v":{"v":0,"d":"0.0"}},{"v":310.04,"d":"310.0"},{"$f":"VLOOKUP(A17,Formelhilfe!$A$9:$O$44,15,FALSE)","v":{"v":5,"d":"5.0"}},{"v":1550.2,"d":"1,550.2"},{"v":309.08181818181816,"d":"309.1"},{"$f":"VLOOKUP(A17,Formelhilfe!$A$9:$P$44,16,FALSE)","v":{"v":11,"d":"11.0"}},{"v":3399.9,"d":"3,399.9"}]
["Norbert Jansen",{"$f":"VLOOKUP(A18,'Wettkampf 1'!$B$10:$C$45,2,FALSE)","v":"Breddenb.-Heid. III"},{"$f":"VLOOKUP(A18,'Wettkampf 1'!$B$10:$D$45,3,FALSE)","v":300.5},{"$f":"VLOOKUP($A18,'2'!$B$10:$D$45,3,FALSE)","v":308.3},{"$f":"VLOOKUP($A18,'3'!$B$10:$D$45,3,FALSE)","v":{"v":311,"d":"311.0"}},{"$f":"VLOOKUP($A18,'4'!$B$10:$D$45,3,FALSE)","v":{"v":308,"d":"308.0"}},{"$f":"VLOOKUP($A18,' 5'!$B$10:$D$45,3,FALSE)","v":310.3},{"$f":"VLOOKUP($A18,' 6'!$B$10:$D$45,3,FALSE)","v":309.5},{"v":307.93333333333334,"d":"307.9"},{"$f":"VLOOKUP(A18,Formelhilfe!$A$9:$H$44,8,FALSE)","v":{"v":6,"d":"6.0"}},{"v":1847.6,"d":"1,847.6"},{"$f":"VLOOKUP($A18,'7'!$B$10:$D$45,3,FALSE)","v":312.3},{"$f":"VLOOKUP($A18,'8'!$B$10:$D$45,3,FALSE)","v":310.3},{"$f":"VLOOKUP($A18,'9'!$B$10:$D$45,3,FALSE)","v":311.3},{"$f":"VLOOKUP($A18,' 10'!$B$10:$D$45,3,FALSE)","v":303.6},{"$f":"VLOOKUP($A18,'11'!$B$10:$D$45,3,FALSE)","v":309.7},{"$f":"VLOOKUP($A18,'12'!$B$10:$D$45,3,FALSE)","v":{"v":0,"d":"0.0"}},{"v":309.44,"d":"309.4"},{"$f":"VLOOKUP(A18,Formelhilfe!$A$9:$O$44,15,FALSE)","v":{"v":5,"d":"5.0"}},{"v":1547.2,"d":"1,547.2"},{"v":308.6181818181818,"d":"308.6"},{"$f":"VLOOKUP(A18,Formelhilfe!$A$9:$P$44,16,FALSE)","v":{"v":11,"d":"11.0"}},{"v":3394.8,"d":"3,394.8"}]
["Joachim Niermann",{"$f":"VLOOKUP(A19,'Wettkampf 1'!$B$10:$C$45,2,FALSE)","v":"Werlte III"},{"$f":"VLOOKUP(A19,'Wettkampf 1'!$B$10:$D$45,3,FALSE)","v":{"v":305,"d":"305.0"}},{"$f":"VLOOKUP($A19,'2'!$B$10:$D$45,3,FALSE)","v":307.9},{"$f":"VLOOKUP($A19,'3'!$B$10:$D$45,3,FALSE)","v":305.3},{"$f":"VLOOKUP($A19,'4'!$B$10:$D$45,3,FALSE)","v":313.4},{"$f":"VLOOKUP($A19,' 5'!$B$10:$D$45,3,FALSE)","v":312.3},{"$f":"VLOOKUP($A19,' 6'!$B$10:$D$45,3,FALSE)","v":307.9},{"v":308.63333333333327,"d":"308.6"},{"$f":"VLOOKUP(A19,Formelhilfe!$A$9:$H$44,8,FALSE)","v":{"v":6,"d":"6.0"}},{"v":1851.7999999999997,"d":"1,851.8"},{"$f":"VLOOKUP($A19,'7'!$B$10:$D$45,3,FALSE)","v":310.5},{"$f":"VLOOKUP($A19,'8'!$B$10:$D$45,3,FALSE)","v":306.6},{"$f":"VLOOKUP($A19,'9'!$B$10:$D$45,3,FALSE)","v":306.2},{"$f":"VLOOKUP($A19,' 10'!$B$10:$D$45,3,FALSE)","v":308.7},{"$f":"VLOOKUP($A19,'11'!$B$10:$D$45,3,FALSE)","v":309.2},{"$f":"VLOOKUP($A19,'12'!$B$10:$D$45,3,FALSE)","v":{"v":0,"d":"0.0"}},{"v":308.24,"d":"308.2"},{"$f":"VLOOKUP(A19,Formelhilfe!$A$9:$O$44,15,FALSE)","v":{"v":5,"d":"5.0"}},{"v":1541.2,"d":"1,541.2"},{"v":308.4545454545454,"d":"308.5"},{"$f":"VLOOKUP(A19,Formelhilfe!$A$9:$P$44,16,FALSE)","v":{"v":11,"d":"11.0"}},{"v":3392.999999999999,"d":"3,393.0"}]
["Heinz Engbers",{"$f":"VLOOKUP(A20,'Wettkampf 1'!$B$10:$C$45,2,FALSE)","v":"Breddenb.-Heid. I"},{"$f":"VLOOKUP(A20,'Wettkampf 1'!$B$10:$D$45,3,FALSE)","v":308.1},{"$f":"VLOOKUP($A20,'2'!$B$10:$D$45,3,FALSE)","v":309.5},{"$f":"VLOOKUP($A20,'3'!$B$10:$D$45,3,FALSE)","v":305.4},{"$f":"VLOOKUP($A20,'4'!$B$10:$D$45,3,FALSE)","v":307.8},{"$f":"VLOOKUP($A20,' 5'!$B$10:$D$45,3,FALSE)","v":304.5},{"$f":"VLOOKUP($A20,' 6'!$B$10:$D$45,3,FALSE)","v":308.3},{"v":307.26666666666665,"d":"307.3"},{"$f":"VLOOKUP(A20,Formelhilfe!$A$9:$H$44,8,FALSE)","v":{"v":6,"d":"6.0"}},{"v":1843.6,"d":"1,843.6"},{"$f":"VLOOKUP($A20,'7'!$B$10:$D$45,3,FALSE)","v":307.9},{"$f":"VLOOKUP($A20,'8'!$B$10:$D$45,3,FALSE)","v":311.8},{"$f":"VLOOKUP($A20,'9'!$B$10:$D$45,3,FALSE)","v":308.8},{"$f":"VLOOKUP($A20,' 10'!$B$10:$D$45,3,FALSE)","v":310.4},{"$f":"VLOOKUP($A20,'11'!$B$10:$D$45,3,FALSE)","v":310.1},{"$f":"VLOOKUP($A20,'12'!$B$10:$D$45,3,FALSE)","v":{"v":0,"d":"0.0"}},309.8,{"$f":"VLOOKUP(A20,Formelhilfe!$A$9:$O$44,15,FALSE)","v":{"v":5,"d":"5.0"}},{"v":1549,"d":"1,549.0"},{"v":308.41818181818184,"d":"308.4"},{"$f":"VLOOKUP(A20,Formelhilfe!$A$9:$P$44,16,FALSE)","v":{"v":11,"d":"11.0"}},{"v":3392.6000000000004,"d":"3,392.6"}]
["Josef Wübben ",{"$f":"VLOOKUP(A21,'Wettkampf 1'!$B$10:$C$45,2,FALSE)","v":"Breddenb.-Heid. III"},{"$f":"VLOOKUP(A21,'Wettkampf 1'!$B$10:$D$45,3,FALSE)","v":309.4},{"$f":"VLOOKUP($A21,'2'!$B$10:$D$45,3,FALSE)","v":314.2},{"$f":"VLOOKUP($A21,'3'!$B$10:$D$45,3,FALSE)","v":306.2},{"$f":"VLOOKUP($A21,'4'!$B$10:$D$45,3,FALSE)","v":309.8},{"$f":"VLOOKUP($A21,' 5'!$B$10:$D$45,3,FALSE)","v":309.4},{"$f":"VLOOKUP($A21,' 6'!$B$10:$D$45,3,FALSE)","v":303.9},{"v":308.81666666666666,"d":"308.8"},{"$f":"VLOOKUP(A21,Formelhilfe!$A$9:$H$44,8,FALSE)","v":{"v":6,"d":"6.0"}},{"v":1852.9,"d":"1,852.9"},{"$f":"VLOOKUP($A21,'7'!$B$10:$D$45,3,FALSE)","v":310.1},{"$f":"VLOOKUP($A21,'8'!$B$10:$D$45,3,FALSE)","v":301.5},{"$f":"VLOOKUP($A21,'9'!$B$10:$D$45,3,FALSE)","v":310.6},{"$f":"VLOOKUP($A21,' 10'!$B$10:$D$45,3,FALSE)","v":308.8},{"$f":"VLOOKUP($A21,'11'!$B$10:$D$45,3,FALSE)","v":305.8},{"$f":"VLOOKUP($A21,'12'!$B$10:$D$45,3,FALSE)","v":{"v":0,"d":"0.0"}},{"v":307.36,"d":"307.4"},{"$f":"VLOOKUP(A21,Formelhilfe!$A$9:$O$44,15,FALSE)","v":{"v":5,"d":"5.0"}},{"v":1536.8,"d":"1,536.8"},{"v":308.1545454545455,"d":"308.2"},{"$f":"VLOOKUP(A21,Formelhilfe!$A$9:$P$44,16,FALSE)","v":{"v":11,"d":"11.0"}},{"v":3389.7000000000003,"d":"3,389.7"}]
["Hermann Krone ",{"$f":"VLOOKUP(A22,'Wettkampf 1'!$B$10:$C$45,2,FALSE)","v":"Werlte III"},{"$f":"VLOOKUP(A22,'Wettkampf 1'!$B$10:$D$45,3,FALSE)","v":306.8},{"$f":"VLOOKUP($A22,'2'!$B$10:$D$45,3,FALSE)","v":307.4},{"$f":"VLOOKUP($A22,'3'!$B$10:$D$45,3,FALSE)","v":311.6},{"$f":"VLOOKUP($A22,'4'!$B$10:$D$45,3,FALSE)","v":304.3},{"$f":"VLOOKUP($A22,' 5'!$B$10:$D$45,3,FALSE)","v":312.2},{"$f":"VLOOKUP($A22,' 6'!$B$10:$D$45,3,FALSE)","v":310.3},{"v":308.7666666666667,"d":"308.8"},{"$f":"VLOOKUP(A22,Formelhilfe!$A$9:$H$44,8,FALSE)","v":{"v":6,"d":"6.0"}},{"v":1852.6000000000001,"d":"1,852.6"},{"$f":"VLOOKUP($A22,'7'!$B$10:$D$45,3,FALSE)","v":307.3},{"$f":"VLOOKUP($A22,'8'!$B$10:$D$45,3,FALSE)","v":306.8},{"$f":"VLOOKUP($A22,'9'!$B$10:$D$45,3,FALSE)","v":{"v":311,"d":"311.0"}},{"$f":"VLOOKUP($A22,' 10'!$B$10:$D$45,3,FALSE)","v":307.9},{"$f":"VLOOKUP($A22,'11'!$B$10:$D$45,3,FALSE)","v":303.8},{"$f":"VLOOKUP($A22,'12'!$B$10:$D$45,3,FALSE)","v":{"v":0,"d":"0.0"}},{"v":307.36,"d":"307.4"},{"$f":"VLOOKUP(A22,Formelhilfe!$A$9:$O$44,15,FALSE)","v":{"v":5,"d":"5.0"}},{"v":1536.8,"d":"1,536.8"},{"v":308.1272727272728,"d":"308.1"},{"$f":"VLOOKUP(A22,Formelhilfe!$A$9:$P$44,16,FALSE)","v":{"v":11,"d":"11.0"}},{"v":3389.4000000000005,"d":"3,389.4"}]
["Heinz Dirksen",{"$f":"VLOOKUP(A23,'Wettkampf 1'!$B$10:$C$45,2,FALSE)","v":"Börgermoor II"},{"$f":"VLOOKUP(A23,'Wettkampf 1'!$B$10:$D$45,3,FALSE)","v":309.6},{"$f":"VLOOKUP($A23,'2'!$B$10:$D$45,3,FALSE)","v":306.8},{"$f":"VLOOKUP($A23,'3'!$B$10:$D$45,3,FALSE)","v":307.1},{"$f":"VLOOKUP($A23,'4'!$B$10:$D$45,3,FALSE)","v":307.7},{"$f":"VLOOKUP($A23,' 5'!$B$10:$D$45,3,FALSE)","v":304.4},{"$f":"VLOOKUP($A23,' 6'!$B$10:$D$45,3,FALSE)","v":307.8},{"v":307.2333333333333,"d":"307.2"},{"$f":"VLOOKUP(A23,Formelhilfe!$A$9:$H$44,8,FALSE)","v":{"v":6,"d":"6.0"}},{"v":1843.3999999999999,"d":"1,843.4"},{"$f":"VLOOKUP($A23,'7'!$B$10:$D$45,3,FALSE)","v":307.5},{"$f":"VLOOKUP($A23,'8'!$B$10:$D$45,3,FALSE)","v":{"v":306.29999999999995,"d":"306.3"}},{"$f":"VLOOKUP($A23,'9'!$B$10:$D$45,3,FALSE)","v":310.9},{"$f":"VLOOKUP($A23,' 10'!$B$10:$D$45,3,FALSE)","v":306.9},{"$f":"VLOOKUP($A23,'11'!$B$10:$D$45,3,FALSE)","v":308.5},{"$f":"VLOOKUP($A23,'12'!$B$10:$D$45,3,FALSE)","v":{"v":0,"d":"0.0"}},{"v":308.02,"d":"308.0"},{"$f":"VLOOKUP(A23,Formelhilfe!$A$9:$O$44,15,FALSE)","v":{"v":5,"d":"5.0"}},{"v":1540.1,"d":"1,540.1"},{"v":307.59090909090907,"d":"307.6"},{"$f":"VLOOKUP(A23,Formelhilfe!$A$9:$P$44,16,FALSE)","v":{"v":11,"d":"11.0"}},{"v":3383.5,"d":"3,383.5"}]
["Werner Jansen",{"$f":"VLOOKUP(A24,'Wettkampf 1'!$B$10:$C$45,2,FALSE)","v":"Breddenb.-Heid. III"},{"$f":"VLOOKUP(A24,'Wettkampf 1'!$B$10:$D$45,3,FALSE)","v":304.3},{"$f":"VLOOKUP($A24,'2'!$B$10:$D$45,3,FALSE)","v":309.7},{"$f":"VLOOKUP($A24,'3'!$B$10:$D$45,3,FALSE)","v":309.4},{"$f":"VLOOKUP($A24,'4'!$B$10:$D$45,3,FALSE)","v":305.8},{"$f":"VLOOKUP($A24,' 5'!$B$10:$D$45,3,FALSE)","v":304.8},{"$f":"VLOOKUP($A24,' 6'!$B$10:$D$45,3,FALSE)","v":306.7},{"v":306.78333333333336,"d":"306.8"},{"$f":"VLOOKUP(A24,Formelhilfe!$A$9:$H$44,8,FALSE)","v":{"v":6,"d":"6.0"}},{"v":1840.7,"d":"1,840.7"},{"$f":"VLOOKUP($A24,'7'!$B$10:$D$45,3,FALSE)","v":308.5},{"$f":"VLOOKUP($A24,'8'!$B$10:$D$45,3,FALSE)","v":{"v":309,"d":"309.0"}},{"$f":"VLOOKUP($A24,'9'!$B$10:$D$45,3,FALSE)","v":312.6},{"$f":"VLOOKUP($A24,' 10'!$B$10:$D$45,3,FALSE)","v":301.2},{"$f":"VLOOKUP($A24,'11'!$B$10:$D$45,3,FALSE)","v":309.5},{"$f":"VLOOKUP($A24,'12'!$B$10:$D$45,3,FALSE)","v":{"v":0,"d":"0.0"}},{"v":308.15999999999997,"d":"308.2"},{"$f":"VLOOKUP(A24,Formelhilfe!$A$9:$O$44,15,FALSE)","v":{"v":5,"d":"5.0"}},{"v":1540.8,"d":"1,540.8"},{"v":307.4090909090909,"d":"307.4"},{"$f":"VLOOKUP(A24,Formelhilfe!$A$9:$P$44,16,FALSE)","v":{"v":11,"d":"11.0"}},{"v":3381.4999999999995,"d":"3,381.5"}]
["Gerd Vogel ",{"$f":"VLOOKUP(A25,'Wettkampf 1'!$B$10:$C$45,2,FALSE)","v":"Breddenb.-Heid. I"},{"$f":"VLOOKUP(A25,'Wettkampf 1'!$B$10:$D$45,3,FALSE)","v":263.8},{"$f":"VLOOKUP($A25,'2'!$B$10:$D$45,3,FALSE)","v":310.9},{"$f":"VLOOKUP($A25,'3'!$B$10:$D$45,3,FALSE)","v":313.1},{"$f":"VLOOKUP($A25,'4'!$B$10:$D$45,3,FALSE)","v":312.6},{"$f":"VLOOKUP($A25,' 5'!$B$10:$D$45,3,FALSE)","v":309.1},{"$f":"VLOOKUP($A25,' 6'!$B$10:$D$45,3,FALSE)","v":{"v":313,"d":"313.0"}},{"v":303.75,"d":"303.8"},{"$f":"VLOOKUP(A25,Formelhilfe!$A$9:$H$44,8,FALSE)","v":{"v":6,"d":"6.0"}},{"v":1822.5,"d":"1,822.5"},{"$f":"VLOOKUP($A25,'7'!$B$10:$D$45,3,FALSE)","v":312.1},{"$f":"VLOOKUP($A25,'8'!$B$10:$D$45,3,FALSE)","v":308.6},{"$f":"VLOOKUP($A25,'9'!$B$10:$D$45,3,FALSE)","v":313.2},{"$f":"VLOOKUP($A25,' 10'!$B$10:$D$45,3,FALSE)","v":310.1},{"$f":"VLOOKUP($A25,'11'!$B$10:$D$45,3,FALSE)","v":310.7},{"$f":"VLOOKUP($A25,'12'!$B$10:$D$45,3,FALSE)","v":{"v":0,"d":"0.0"}},{"v":310.94,"d":"310.9"},{"$f":"VLOOKUP(A25,Formelhilfe!$A$9:$O$44,15,FALSE)","v":{"v":5,"d":"5.0"}},{"v":1554.7,"d":"1,554.7"},{"v":307.01818181818174,"d":"307.0"},{"$f":"VLOOKUP(A25,Formelhilfe!$A$9:$P$44,16,FALSE)","v":{"v":11,"d":"11.0"}},{"v":3377.1999999999994,"d":"3,377.2"}]
["Helmut Benten ",{"$f":"VLOOKUP(A26,'Wettkampf 1'!$B$10:$C$45,2,FALSE)","v":"Ostenwalde II"},{"$f":"VLOOKUP(A26,'Wettkampf 1'!$B$10:$D$45,3,FALSE)","v":309.3},{"$f":"VLOOKUP($A26,'2'!$B$10:$D$45,3,FALSE)","v":313.7},{"$f":"VLOOKUP($A26,'3'!$B$10:$D$45,3,FALSE)","v":306.2},{"$f":"VLOOKUP($A26,'4'!$B$10:$D$45,3,FALSE)","v":303.4},{"$f":"VLOOKUP($A26,' 5'!$B$10:$D$45,3,FALSE)","v":304.8},{"$f":"VLOOKUP($A26,' 6'!$B$10:$D$45,3,FALSE)","v":304.7},{"v":307.01666666666665,"d":"307.0"},{"$f":"VLOOKUP(A26,Formelhilfe!$A$9:$H$44,8,FALSE)","v":{"v":6,"d":"6.0"}},{"v":1842.1,"d":"1,842.1"},{"$f":"VLOOKUP($A26,'7'!$B$10:$D$45,3,FALSE)","v":305.2},{"$f":"VLOOKUP($A26,'8'!$B$10:$D$45,3,FALSE)","v":302.3},{"$f":"VLOOKUP($A26,'9'!$B$10:$D$45,3,FALSE)","v":{"v":307,"d":"307.0"}},{"$f":"VLOOKUP($A26,' 10'!$B$10:$D$45,3,FALSE)","v":307.1},{"$f":"VLOOKUP($A26,'11'!$B$10:$D$45,3,FALSE)","v":309.8},{"$f":"VLOOKUP($A26,'12'!$B$10:$D$45,3,FALSE)","v":{"v":0,"d":"0.0"}},{"v":306.28,"d":"306.3"},{"$f":"VLOOKUP(A26,Formelhilfe!$A$9:$O$44,15,FALSE)","v":{"v":5,"d":"5.0"}},{"v":1531.3999999999999,"d":"1,531.4"},{"v":306.6818181818182,"d":"306.7"},{"$f":"VLOOKUP(A26,Formelhilfe!$A$9:$P$44,16,FALSE)","v":{"v":11,"d":"11.0"}},{"v":3373.5,"d":"3,373.5"}]
["Anton Oldiges",{"$f":"VLOOKUP(A27,'Wettkampf 1'!$B$10:$C$45,2,FALSE)","v":"Lorup III"},{"$f":"VLOOKUP(A27,'Wettkampf 1'!$B$10:$D$45,3,FALSE)","v":301.6},{"$f":"VLOOKUP($A27,'2'!$B$10:$D$45,3,FALSE)","v":302.5},{"$f":"VLOOKUP($A27,'3'!$B$10:$D$45,3,FALSE)","v":{"v":311,"d":"311.0"}},{"$f":"VLOOKUP($A27,'4'!$B$10:$D$45,3,FALSE)","v":306.7},{"$f":"VLOOKUP($A27,' 5'!$B$10:$D$45,3,FALSE)","v":305.2},{"$f":"VLOOKUP($A27,' 6'!$B$10:$D$45,3,FALSE)","v":307.3},{"v":305.71666666666664,"d":"305.7"},{"$f":"VLOOKUP(A27,Formelhilfe!$A$9:$H$44,8,FALSE)","v":{"v":6,"d":"6.0"}},{"v":1834.3,"d":"1,834.3"},{"$f":"VLOOKUP($A27,'7'!$B$10:$D$45,3,FALSE)","v":306.3},{"$f":"VLOOKUP($A27,'8'!$B$10:$D$45,3,FALSE)","v":309.2},{"$f":"VLOOKUP($A27,'9'!$B$10:$D$45,3,FALSE)","v":308.8},{"$f":"VLOOKUP($A27,' 10'!$B$10:$D$45,3,FALSE)","v":{"v":304,"d":"304.0"}},{"$f":"VLOOKUP($A27,'11'!$B$10:$D$45,3,FALSE)","v":309.5},{"$f":"VLOOKUP($A27,'12'!$B$10:$D$45,3,FALSE)","v":{"v":0,"d":"0.0"}},{"v":307.56,"d":"307.6"},{"$f":"VLOOKUP(A27,Formelhilfe!$A$9:$O$44,15,FALSE)","v":{"v":5,"d":"5.0"}},{"v":1537.8,"d":"1,537.8"},{"v":306.55454545454546,"d":"306.6"},{"$f":"VLOOKUP(A27,Formelhilfe!$A$9:$P$44,16,FALSE)","v":{"v":11,"d":"11.0"}},{"v":3372.1,"d":"3,372.1"}]
["Hans Gebken 3",{"$f":"VLOOKUP(A28,'Wettkampf 1'!$B$10:$C$45,2,FALSE)","v":"Breddenb.-Heid. I"},{"$f":"VLOOKUP(A28,'Wettkampf 1'!$B$10:$D$45,3,FALSE)","v":306.3},{"$f":"VLOOKUP($A28,'2'!$B$10:$D$45,3,FALSE)","v":300.7},{"$f":"VLOOKUP($A28,'3'!$B$10:$D$45,3,FALSE)","v":304.1},{"$f":"VLOOKUP($A28,'4'!$B$10:$D$45,3,FALSE)","v":304.5},{"$f":"VLOOKUP($A28,' 5'!$B$10:$D$45,3,FALSE)","v":306.7},{"$f":"VLOOKUP($A28,' 6'!$B$10:$D$45,3,FALSE)","v":307.9},{"v":305.0333333333333,"d":"305.0"},{"$f":"VLOOKUP(A28,Formelhilfe!$A$9:$H$44,8,FALSE)","v":{"v":6,"d":"6.0"}},{"v":1830.1999999999998,"d":"1,830.2"},{"$f":"VLOOKUP($A28,'7'!$B$10:$D$45,3,FALSE)","v":303.6},{"$f":"VLOOKUP($A28,'8'!$B$10:$D$45,3,FALSE)","v":306.4},{"$f":"VLOOKUP($A28,'9'!$B$10:$D$45,3,FALSE)","v":310.5},{"$f":"VLOOKUP($A28,' 10'!$B$10:$D$45,3,FALSE)","v":310.2},{"$f":"VLOOKUP($A28,'11'!$B$10:$D$45,3,FALSE)","v":308.3},{"$f":"VLOOKUP($A28,'12'!$B$10:$D$45,3,FALSE)","v":{"v":0,"d":"0.0"}},307.8,{"$f":"VLOOKUP(A28,Formelhilfe!$A$9:$O$44,15,FALSE)","v":{"v":5,"d":"5.0"}},{"v":1539,"d":"1,539.0"},{"v":306.29090909090905,"d":"306.3"},{"$f":"VLOOKUP(A28,Formelhilfe!$A$9:$P$44,16,FALSE)","v":{"v":11,"d":"11.0"}},{"v":3369.2,"d":"3,369.2"}]
["Johannes Oldiges",{"$f":"VLOOKUP(A29,'Wettkampf 1'!$B$10:$C$45,2,FALSE)","v":"Breddenb.-Heid. III"},{"$f":"VLOOKUP(A29,'Wettkampf 1'!$B$10:$D$45,3,FALSE)","v":306.7},{"$f":"VLOOKUP($A29,'2'!$B$10:$D$45,3,FALSE)","v":304.1},{"$f":"VLOOKUP($A29,'3'!$B$10:$D$45,3,FALSE)","v":307.6},{"$f":"VLOOKUP($A29,'4'!$B$10:$D$45,3,FALSE)","v":{"v":305,"d":"305.0"}},{"$f":"VLOOKUP($A29,' 5'!$B$10:$D$45,3,FALSE)","v":308.9},{"$f":"VLOOKUP($A29,' 6'!$B$10:$D$45,3,FALSE)","v":307.5},{"v":306.6333333333334,"d":"306.6"},{"$f":"VLOOKUP(A29,Formelhilfe!$A$9:$H$44,8,FALSE)","v":{"v":6,"d":"6.0"}},{"v":1839.8000000000002,"d":"1,839.8"},{"$f":"VLOOKUP($A29,'7'!$B$10:$D$45,3,FALSE)","v":303.8},{"$f":"VLOOKUP($A29,'8'!$B$10:$D$45,3,FALSE)","v":{"v":305.79999999999995,"d":"305.8"}},{"$f":"VLOOKUP($A29,'9'!$B$10:$D$45,3,FALSE)","v":307.5},{"$f":"VLOOKUP($A29,' 10'!$B$10:$D$45,3,FALSE)","v":306.1},{"$f":"VLOOKUP($A29,'11'!$B$10:$D$45,3,FALSE)","v":302.6},{"$f":"VLOOKUP($A29,'12'!$B$10:$D$45,3,FALSE)","v":{"v":0,"d":"0.0"}},{"v":305.15999999999997,"d":"305.2"},{"$f":"VLOOKUP(A29,Formelhilfe!$A$9:$O$44,15,FALSE)","v":{"v":5,"d":"5.0"}},{"v":1525.7999999999997,"d":"1,525.8"},{"v":305.9636363636364,"d":"306.0"},{"$f":"VLOOKUP(A29,Formelhilfe!$A$9:$P$44,16,FALSE)","v":{"v":11,"d":"11.0"}},{"v":3365.6000000000004,"d":"3,365.6"}]
["Alfons Plüster",{"$f":"VLOOKUP(A30,'Wettkampf 1'!$B$10:$C$45,2,FALSE)","v":"Breddenb.-Heid. III"},{"$f":"VLOOKUP(A30,'Wettkampf 1'!$B$10:$D$45,3,FALSE)","v":305.9},{"$f":"VLOOKUP($A30,'2'!$B$10:$D$45,3,FALSE)","v":301.5},{"$f":"VLOOKUP($A30,'3'!$B$10:$D$45,3,FALSE)","v":302.1},{"$f":"VLOOKUP($A30,'4'!$B$10:$D$45,3,FALSE)","v":301.6},{"$f":"VLOOKUP($A30,' 5'!$B$10:$D$45,3,FALSE)","v":{"v":308,"d":"308.0"}},{"$f":"VLOOKUP($A30,' 6'!$B$10:$D$45,3,FALSE)","v":303.6},{"v":303.7833333333333,"d":"303.8"},{"$f":"VLOOKUP(A30,Formelhilfe!$A$9:$H$44,8,FALSE)","v":{"v":6,"d":"6.0"}},{"v":1822.6999999999998,"d":"1,822.7"},{"$f":"VLOOKUP($A30,'7'!$B$10:$D$45,3,FALSE)","v":311.8},{"$f":"VLOOKUP($A30,'8'!$B$10:$D$45,3,FALSE)","v":{"v":306.29999999999995,"d":"306.3"}},{"$f":"VLOOKUP($A30,'9'!$B$10:$D$45,3,FALSE)","v":305.1},{"$f":"VLOOKUP($A30,' 10'!$B$10:$D$45,3,FALSE)","v":304.7},{"$f":"VLOOKUP($A30,'11'!$B$10:$D$45,3,FALSE)","v":305.1},{"$f":"VLOOKUP($A30,'12'!$B$10:$D$45,3,FALSE)","v":{"v":0,"d":"0.0"}},306.6,{"$f":"VLOOKUP(A30,Formelhilfe!$A$9:$O$44,15,FALSE)","v":{"v":5,"d":"5.0"}},{"v":1533,"d":"1,533.0"},{"v":305.06363636363636,"d":"305.1"},{"$f":"VLOOKUP(A30,Formelhilfe!$A$9:$P$44,16,FALSE)","v":{"v":11,"d":"11.0"}},{"v":3355.7,"d":"3,355.7"}]
["Hans Gebken 1",{"$f":"VLOOKUP(A31,'Wettkampf 1'!$B$10:$C$45,2,FALSE)","v":"Breddenb.-Heid. I"},{"$f":"VLOOKUP(A31,'Wettkampf 1'!$B$10:$D$45,3,FALSE)","v":298.3},{"$f":"VLOOKUP($A31,'2'!$B$10:$D$45,3,FALSE)","v":{"v":305,"d":"305.0"}},{"$f":"VLOOKUP($A31,'3'!$B$10:$D$45,3,FALSE)","v":297.1},{"$f":"VLOOKUP($A31,'4'!$B$10:$D$45,3,FALSE)","v":303.4},{"$f":"VLOOKUP($A31,' 5'!$B$10:$D$45,3,FALSE)","v":303.6},{"$f":"VLOOKUP($A31,' 6'!$B$10:$D$45,3,FALSE)","v":299.8},301.2,{"$f":"VLOOKUP(A31,Formelhilfe!$A$9:$H$44,8,FALSE)","v":{"v":6,"d":"6.0"}},{"v":1807.2,"d":"1,807.2"},{"$f":"VLOOKUP($A31,'7'!$B$10:$D$45,3,FALSE)","v":306.8},{"$f":"VLOOKUP($A31,'8'!$B$10:$D$45,3,FALSE)","v":306.4},{"$f":"VLOOKUP($A31,'9'!$B$10:$D$45,3,FALSE)","v":307.7},{"$f":"VLOOKUP($A31,' 10'!$B$10:$D$45,3,FALSE)","v":306.2},{"$f":"VLOOKUP($A31,'11'!$B$10:$D$45,3,FALSE)","v":305.7},{"$f":"VLOOKUP($A31,'12'!$B$10:$D$45,3,FALSE)","v":{"v":0,"d":"0.0"}},{"v":306.56000000000006,"d":"306.6"},{"$f":"VLOOKUP(A31,Formelhilfe!$A$9:$O$44,15,FALSE)","v":{"v":5,"d":"5.0"}},{"v":1532.8000000000002,"d":"1,532.8"},{"v":303.63636363636357,"d":"303.6"},{"$f":"VLOOKUP(A31,Formelhilfe!$A$9:$P$44,16,FALSE)","v":{"v":11,"d":"11.0"}},{"v":3339.9999999999995,"d":"3,340.0"}]
["Michael Freitag ",{"$f":"VLOOKUP(A32,'Wettkampf 1'!$B$10:$C$45,2,FALSE)","v":"Werlte III"},{"$f":"VLOOKUP(A32,'Wettkampf 1'!$B$10:$D$45,3,FALSE)","v":309.3},{"$f":"VLOOKUP($A32,'2'!$B$10:$D$45,3,FALSE)","v":{"v":311,"d":"311.0"}},{"$f":"VLOOKUP($A32,'3'!$B$10:$D$45,3,FALSE)","v":306.8},{"$f":"VLOOKUP($A32,'4'!$B$10:$D$45,3,FALSE)","v":313.1},{"$f":"VLOOKUP($A32,' 5'!$B$10:$D$45,3,FALSE)","v":314.6},{"$f":"VLOOKUP($A32,' 6'!$B$10:$D$45,3,FALSE)","v":310.1},{"v":310.8166666666666,"d":"310.8"},{"$f":"VLOOKUP(A32,Formelhilfe!$A$9:$H$44,8,FALSE)","v":{"v":6,"d":"6.0"}},{"v":1864.8999999999996,"d":"1,864.9"},{"$f":"VLOOKUP($A32,'7'!$B$10:$D$45,3,FALSE)","v":313.9},{"$f":"VLOOKUP($A32,'8'!$B$10:$D$45,3,FALSE)","v":315.7},{"$f":"VLOOKUP($A32,'9'!$B$10:$D$45,3,FALSE)","v":311.2},{"$f":"VLOOKUP($A32,' 10'!$B$10:$D$45,3,FALSE)","v":{"v":0,"d":"0.0"}},{"$f":"VLOOKUP($A32,'11'!$B$10:$D$45,3,FALSE)","v":308.6},{"$f":"VLOOKUP($A32,'12'!$B$10:$D$45,3,FALSE)","v":{"v":0,"d":"0.0"}},{"v":312.35,"d":"312.4"},{"$f":"VLOOKUP(A32,Formelhilfe!$A$9:$O$44,15,FALSE)","v":{"v":4,"d":"4.0"}},{"v":1249.4,"d":"1,249.4"},{"v":311.42999999999995,"d":"311.4"},{"$f":"VLOOKUP(A32,Formelhilfe!$A$9:$P$44,16,FALSE)","v":{"v":10,"d":"10.0"}},{"v":3114.2999999999993,"d":"3,114.3"}]
["Matthias Brinkmann",{"$f":"VLOOKUP(A33,'Wettkampf 1'!$B$10:$C$45,2,FALSE)","v":"Ostenwalde II"},{"$f":"VLOOKUP(A33,'Wettkampf 1'!$B$10:$D$45,3,FALSE)","v":309.6},{"$f":"VLOOKUP($A33,'2'!$B$10:$D$45,3,FALSE)","v":{"v":303,"d":"303.0"}},{"$f":"VLOOKUP($A33,'3'!$B$10:$D$45,3,FALSE)","v":{"v":305,"d":"305.0"}},{"$f":"VLOOKUP($A33,'4'!$B$10:$D$45,3,FALSE)","v":308.1},{"$f":"VLOOKUP($A33,' 5'!$B$10:$D$45,3,FALSE)","v":{"v":0,"d":"0.0"}},{"$f":"VLOOKUP($A33,' 6'!$B$10:$D$45,3,FALSE)","v":303.3},305.8,{"$f":"VLOOKUP(A33,Formelhilfe!$A$9:$H$44,8,FALSE)","v":{"v":5,"d":"5.0"}},{"v":1529,"d":"1,529.0"},{"$f":"VLOOKUP($A33,'7'!$B$10:$D$45,3,FALSE)","v":310.3},{"$f":"VLOOKUP($A33,'8'!$B$10:$D$45,3,FALSE)","v":309.9},{"$f":"VLOOKUP($A33,'9'!$B$10:$D$45,3,FALSE)","v":{"v":309,"d":"309.0"}},{"$f":"VLOOKUP($A33,' 10'!$B$10:$D$45,3,FALSE)","v":309.8},{"$f":"VLOOKUP($A33,'11'!$B$10:$D$45,3,FALSE)","v":304.1},{"$f":"VLOOKUP($A33,'12'!$B$10:$D$45,3,FALSE)","v":{"v":0,"d":"0.0"}},{"v":308.62,"d":"308.6"},{"$f":"VLOOKUP(A33,Formelhilfe!$A$9:$O$44,15,FALSE)","v":{"v":5,"d":"5.0"}},{"v":1543.1,"d":"1,543.1"},{"v":307.21,"d":"307.2"},{"$f":"VLOOKUP(A33,Formelhilfe!$A$9:$P$44,16,FALSE)","v":{"v":10,"d":"10.0"}},{"v":3072.1,"d":"3,072.1"}]
["Kevin Minnert",{"$f":"VLOOKUP(A34,'Wettkampf 1'!$B$10:$C$45,2,FALSE)","v":"Börgermoor II"},{"$f":"VLOOKUP(A34,'Wettkampf 1'!$B$10:$D$45,3,FALSE)","v":306.5},{"$f":"VLOOKUP($A34,'2'!$B$10:$D$45,3,FALSE)","v":302.7},{"$f":"VLOOKUP($A34,'3'!$B$10:$D$45,3,FALSE)","v":305.3},{"$f":"VLOOKUP($A34,'4'!$B$10:$D$45,3,FALSE)","v":{"v":294,"d":"294.0"}},{"$f":"VLOOKUP($A34,' 5'!$B$10:$D$45,3,FALSE)","v":297.4},{"$f":"VLOOKUP($A34,' 6'!$B$10:$D$45,3,FALSE)","v":294.9},{"v":300.1333333333334,"d":"300.1"},{"$f":"VLOOKUP(A34,Formelhilfe!$A$9:$H$44,8,FALSE)","v":{"v":6,"d":"6.0"}},{"v":1800.8000000000002,"d":"1,800.8"},{"$f":"VLOOKUP($A34,'7'!$B$10:$D$45,3,FALSE)","v":305.1},{"$f":"VLOOKUP($A34,'8'!$B$10:$D$45,3,FALSE)","v":305.1},{"$f":"VLOOKUP($A34,'9'!$B$10:$D$45,3,FALSE)","v":{"v":0,"d":"0.0"}},{"$f":"VLOOKUP($A34,' 10'!$B$10:$D$45,3,FALSE)","v":{"v":0,"d":"0.0"}},{"$f":"VLOOKUP($A34,'11'!$B$10:$D$45,3,FALSE)","v":{"v":0,"d":"0.0"}},{"$f":"VLOOKUP($A34,'12'!$B$10:$D$45,3,FALSE)","v":{"v":0,"d":"0.0"}},305.1,{"$f":"VLOOKUP(A34,Formelhilfe!$A$9:$O$44,15,FALSE)","v":{"v":2,"d":"2.0"}},610.2,{"v":301.375,"d":"301.4"},{"$f":"VLOOKUP(A34,Formelhilfe!$A$9:$P$44,16,FALSE)","v":{"v":8,"d":"8.0"}},{"v":2411,"d":"2,411.0"}]
["Daniel Schülke",{"$f":"VLOOKUP(A35,'Wettkampf 1'!$B$10:$C$45,2,FALSE)","v":"Börgermoor II"},{"$f":"VLOOKUP(A35,'Wettkampf 1'!$B$10:$D$45,3,FALSE)","v":{"v":0,"d":"0.0"}},{"$f":"VLOOKUP($A35,'2'!$B$10:$D$45,3,FALSE)","v":{"v":0,"d":"0.0"}},{"$f":"VLOOKUP($A35,'3'!$B$10:$D$45,3,FALSE)","v":303.1},{"$f":"VLOOKUP($A35,'4'!$B$10:$D$45,3,FALSE)","v":292.3},{"$f":"VLOOKUP($A35,' 5'!$B$10:$D$45,3,FALSE)","v":306.6},{"$f":"VLOOKUP($A35,' 6'!$B$10:$D$45,3,FALSE)","v":{"v":0,"d":"0.0"}},{"v":300.6666666666667,"d":"300.7"},{"$f":"VLOOKUP(A35,Formelhilfe!$A$9:$H$44,8,FALSE)","v":{"v":3,"d":"3.0"}},{"v":902.0000000000001,"d":"902.0"},{"$f":"VLOOKUP($A35,'7'!$B$10:$D$45,3,FALSE)","v":300.4},{"$f":"VLOOKUP($A35,'8'!$B$10:$D$45,3,FALSE)","v":{"v":0,"d":"0.0"}},{"$f":"VLOOKUP($A35,'9'!$B$10:$D$45,3,FALSE)","v":292.5},{"$f":"VLOOKUP($A35,' 10'!$B$10:$D$45,3,FALSE)","v":{"v":301,"d":"301.0"}},{"$f":"VLOOKUP($A35,'11'!$B$10:$D$45,3,FALSE)","v":299.4},{"$f":"VLOOKUP($A35,'12'!$B$10:$D$45,3,FALSE)","v":{"v":0,"d":"0.0"}},{"v":298.325,"d":"298.3"},{"$f":"VLOOKUP(A35,Formelhilfe!$A$9:$O$44,15,FALSE)","v":{"v":4,"d":"4.0"}},{"v":1193.3,"d":"1,193.3"},{"v":299.3285714285715,"d":"299.3"},{"$f":"VLOOKUP(A35,Formelhilfe!$A$9:$P$44,16,FALSE)","v":{"v":7,"d":"7.0"}},{"v":2095.3,"d":"2,095.3"}]
["Schütze 22",{"$f":"VLOOKUP(A36,'Wettkampf 1'!$B$10:$C$45,2,FALSE)","v":"Lorup III"},{"$f":"VLOOKUP(A36,'Wettkampf 1'!$B$10:$D$45,3,FALSE)","v":{"v":0,"d":"0.0"}},{"$f":"VLOOKUP($A36,'2'!$B$10:$D$45,3,FALSE)","v":{"v":0,"d":"0.0"}},{"$f":"VLOOKUP($A36,'3'!$B$10:$D$45,3,FALSE)","v":{"v":0,"d":"0.0"}},{"$f":"VLOOKUP($A36,'4'!$B$10:$D$45,3,FALSE)","v":{"v":0,"d":"0.0"}},{"$f":"VLOOKUP($A36,' 5'!$B$10:$D$45,3,FALSE)","v":{"v":0,"d":"0.0"}},{"$f":"VLOOKUP($A36,' 6'!$B$10:$D$45,3,FALSE)","v":{"v":0,"d":"0.0"}},{"$error":"#DIV/0!"},{"$f":"VLOOKUP(A36,Formelhilfe!$A$9:$H$44,8,FALSE)","v":{"v":0,"d":"0.0"}},{"v":0,"d":"0.0"},{"$f":"VLOOKUP($A36,'7'!$B$10:$D$45,3,FALSE)","v":{"v":0,"d":"0.0"}},{"$f":"VLOOKUP($A36,'8'!$B$10:$D$45,3,FALSE)","v":{"v":0,"d":"0.0"}},{"$f":"VLOOKUP($A36,'9'!$B$10:$D$45,3,FALSE)","v":{"v":0,"d":"0.0"}},{"$f":"VLOOKUP($A36,' 10'!$B$10:$D$45,3,FALSE)","v":{"v":0,"d":"0.0"}},{"$f":"VLOOKUP($A36,'11'!$B$10:$D$45,3,FALSE)","v":{"v":0,"d":"0.0"}},{"$f":"VLOOKUP($A36,'12'!$B$10:$D$45,3,FALSE)","v":{"v":0,"d":"0.0"}},{"$error":"#DIV/0!"},{"$f":"VLOOKUP(A36,Formelhilfe!$A$9:$O$44,15,FALSE)","v":{"v":0,"d":"0.0"}},{"v":0,"d":"0.0"},{"$error":"#DIV/0!"},{"$f":"VLOOKUP(A36,Formelhilfe!$A$9:$P$44,16,FALSE)","v":{"v":0,"d":"0.0"}},{"v":0,"d":"0.0"}]
["Schütze 23",{"$f":"VLOOKUP(A37,'Wettkampf 1'!$B$10:$C$45,2,FALSE)","v":"Lorup III"},{"$f":"VLOOKUP(A37,'Wettkampf 1'!$B$10:$D$45,3,FALSE)","v":{"v":0,"d":"0.0"}},{"$f":"VLOOKUP($A37,'2'!$B$10:$D$45,3,FALSE)","v":{"v":0,"d":"0.0"}},{"$f":"VLOOKUP($A37,'3'!$B$10:$D$45,3,FALSE)","v":{"v":0,"d":"0.0"}},{"$f":"VLOOKUP($A37,'4'!$B$10:$D$45,3,FALSE)","v":{"v":0,"d":"0.0"}},{"$f":"VLOOKUP($A37,' 5'!$B$10:$D$45,3,FALSE)","v":{"v":0,"d":"0.0"}},{"$f":"VLOOKUP($A37,' 6'!$B$10:$D$45,3,FALSE)","v":{"v":0,"d":"0.0"}},{"$error":"#DIV/0!"},{"$f":"VLOOKUP(A37,Formelhilfe!$A$9:$H$44,8,FALSE)","v":{"v":0,"d":"0.0"}},{"v":0,"d":"0.0"},{"$f":"VLOOKUP($A37,'7'!$B$10:$D$45,3,FALSE)","v":{"v":0,"d":"0.0"}},{"$f":"VLOOKUP($A37,'8'!$B$10:$D$45,3,FALSE)","v":{"v":0,"d":"0.0"}},{"$f":"VLOOKUP($A37,'9'!$B$10:$D$45,3,FALSE)","v":{"v":0,"d":"0.0"}},{"$f":"VLOOKUP($A37,' 10'!$B$10:$D$45,3,FALSE)","v":{"v":0,"d":"0.0"}},{"$f":"VLOOKUP($A37,'11'!$B$10:$D$45,3,FALSE)","v":{"v":0,"d":"0.0"}},{"$f":"VLOOKUP($A37,'12'!$B$10:$D$45,3,FALSE)","v":{"v":0,"d":"0.0"}},{"$error":"#DIV/0!"},{"$f":"VLOOKUP(A37,Formelhilfe!$A$9:$O$44,15,FALSE)","v":{"v":0,"d":"0.0"}},{"v":0,"d":"0.0"},{"$error":"#DIV/0!"},{"$f":"VLOOKUP(A37,Formelhilfe!$A$9:$P$44,16,FALSE)","v":{"v":0,"d":"0.0"}},{"v":0,"d":"0.0"}]

{"sheet":"Formelhilfe","index":16,"n_rows":45,"n_cols":21,"rows_kept":45,"hidden":true}
[null,1,2,3,4,5,6,"Hinrunde Schnitt",7,8,9,10,11,12,"Rückrunde Schnitt","Gesamt Schnitt",null,null,"Kreisoberliga","Schützen","2019/2020"]
[{"$f":"'Wettkampf 1'!B2","v":"Breddenb.-Heid. I"},{"$f":"IF('Wettkampf 1'!D2>0,1,0)","v":1},{"$f":"IF('2'!$D2>0,1,0)","v":1},{"$f":"IF('3'!$D2>0,1,0)","v":1},{"$f":"IF('4'!$D2>0,1,0)","v":1},{"$f":"IF(' 5'!$D2>0,1,0)","v":1},{"$f":"IF(' 6'!$D2>0,1,0)","v":1},{"$f":"B2+C2+D2+E2+F2+G2","v":6},{"$f":"IF('7'!$D2>0,1,0)","v":1},{"$f":"IF('8'!$D2>0,1,0)","v":1},{"$f":"IF('9'!$D2>0,1,0)","v":1},{"$f":"IF(' 10'!$D2>0,1,0)","v":1},{"$f":"IF('11'!$D2>0,1,0)","v":1},{"$f":"IF('12'!$D2>0,1,0)","v":0},{"$f":"I2+J2+K2+L2+M2+N2","v":5},{"$f":"O2+H2","v":11},null,null,"1. Kreisliga","Damen","2020/2021"]
[{"$f":"'Wettkampf 1'!B3","v":"Ostenwalde II"},{"$f":"IF('Wettkampf 1'!D3>0,1,0)","v":1},{"$f":"IF('2'!$D3>0,1,0)","v":1},{"$f":"IF('3'!$D3>0,1,0)","v":1},{"$f":"IF('4'!$D3>0,1,0)","v":1},{"$f":"IF(' 5'!$D3>0,1,0)","v":1},{"$f":"IF(' 6'!$D3>0,1,0)","v":1},6,{"$f":"IF('7'!$D3>0,1,0)","v":1},{"$f":"IF('8'!$D3>0,1,0)","v":1},{"$f":"IF('9'!$D3>0,1,0)","v":1},{"$f":"IF(' 10'!$D3>0,1,0)","v":1},{"$f":"IF('11'!$D3>0,1,0)","v":1},{"$f":"IF('12'!$D3>0,1,0)","v":0},5,11,null,null,"2. Kreisliga","Altersgruppe","2021/2022"]
[{"$f":"'Wettkampf 1'!B4","v":"Börgermoor II"},{"$f":"IF('Wettkampf 1'!D4>0,1,0)","v":1},{"$f":"IF('2'!$D4>0,1,0)","v":1},{"$f":"IF('3'!$D4>0,1,0)","v":1},{"$f":"IF('4'!$D4>0,1,0)","v":1},{"$f":"IF(' 5'!$D4>0,1,0)","v":1},{"$f":"IF(' 6'!$D4>0,1,0)","v":1},6,{"$f":"IF('7'!$D4>0,1,0)","v":1},{"$f":"IF('8'!$D4>0,1,0)","v":1},{"$f":"IF('9'!$D4>0,1,0)","v":1},{"$f":"IF(' 10'!$D4>0,1,0)","v":1},{"$f":"IF('11'!$D4>0,1,0)","v":1},{"$f":"IF('12'!$D4>0,1,0)","v":0},5,11,null,null,"1. Kreisklasse","Senioren","2022/2023"]
[{"$f":"'Wettkampf 1'!B5","v":"Lorup III"},{"$f":"IF('Wettkampf 1'!D5>0,1,0)","v":1},{"$f":"IF('2'!$D5>0,1,0)","v":1},{"$f":"IF('3'!$D5>0,1,0)","v":1},{"$f":"IF('4'!$D5>0,1,0)","v":1},{"$f":"IF(' 5'!$D5>0,1,0)","v":1},{"$f":"IF(' 6'!$D5>0,1,0)","v":1},6,{"$f":"IF('7'!$D5>0,1,0)","v":1},{"$f":"IF('8'!$D5>0,1,0)","v":1},{"$f":"IF('9'!$D5>0,1,0)","v":1},{"$f":"IF(' 10'!$D5>0,1,0)","v":1},{"$f":"IF('11'!$D5>0,1,0)","v":1},{"$f":"IF('12'!$D5>0,1,0)","v":0},5,11,null,null,"2. Kreisklasse","   ","2023/2024"]
[{"$f":"'Wettkampf 1'!B6","v":"Breddenb.-Heid. III"},{"$f":"IF('Wettkampf 1'!D6>0,1,0)","v":1},{"$f":"IF('2'!$D6>0,1,0)","v":1},{"$f":"IF('3'!$D6>0,1,0)","v":1},{"$f":"IF('4'!$D6>0,1,0)","v":1},{"$f":"IF(' 5'!$D6>0,1,0)","v":1},{"$f":"IF(' 6'!$D6>0,1,0)","v":1},6,{"$f":"IF('7'!$D6>0,1,0)","v":1},{"$f":"IF('8'!$D6>0,1,0)","v":1},{"$f":"IF('9'!$D6>0,1,0)","v":1},{"$f":"IF(' 10'!$D6>0,1,0)","v":1},{"$f":"IF('11'!$D6>0,1,0)","v":1},{"$f":"IF('12'!$D6>0,1,0)","v":0},5,11,null,null,"3. Kreisklasse"]
[{"$f":"'Wettkampf 1'!B7","v":"Werlte III"},{"$f":"IF('Wettkampf 1'!D7>0,1,0)","v":1},{"$f":"IF('2'!$D7>0,1,0)","v":1},{"$f":"IF('3'!$D7>0,1,0)","v":1},{"$f":"IF('4'!$D7>0,1,0)","v":1},{"$f":"IF(' 5'!$D7>0,1,0)","v":1},{"$f":"IF(' 6'!$D7>0,1,0)","v":1},6,{"$f":"IF('7'!$D7>0,1,0)","v":1},{"$f":"IF('8'!$D7>0,1,0)","v":1},{"$f":"IF('9'!$D7>0,1,0)","v":1},{"$f":"IF(' 10'!$D7>0,1,0)","v":1},{"$f":"IF('11'!$D7>0,1,0)","v":1},{"$f":"IF('12'!$D7>0,1,0)","v":0},5,11,null,null,"4. Kreisklasse"]
[{"$nulls":18},"5. Kreisklasse"]
["Hans Gebken 3",{"$f":"IF('Wettkampf 1'!D10>0,1,0)","v":1},{"$f":"IF('2'!$D10>0,1,0)","v":1},{"$f":"IF('3'!$D10>0,1,0)","v":1},{"$f":"IF('4'!$D10>0,1,0)","v":1},{"$f":"IF(' 5'!$D10>0,1,0)","v":1},{"$f":"IF(' 6'!$D10>0,1,0)","v":1},{"$f":"B9+C9+D9+E9+F9+G9","v":6},{"$f":"IF('7'!$D10>0,1,0)","v":1},{"$f":"IF('8'!$D10>0,1,0)","v":1},{"$f":"IF('9'!$D10>0,1,0)","v":1},{"$f":"IF(' 10'!$D10>0,1,0)","v":1},{"$f":"IF('11'!$D10>0,1,0)","v":1},{"$f":"IF('12'!$D10>0,1,0)","v":0},{"$f":"I9+J9+K9+L9+M9+N9","v":5},{"$f":"O9+H9","v":11},null,null,"6. Kreisklasse"]
["Gerd Vogel ",{"$f":"IF('Wettkampf 1'!D11>0,1,0)","v":1},{"$f":"IF('2'!$D11>0,1,0)","v":1},{"$f":"IF('3'!$D11>0,1,0)","v":1},{"$f":"IF('4'!$D11>0,1,0)","v":1},{"$f":"IF(' 5'!$D11>0,1,0)","v":1},{"$f":"IF(' 6'!$D11>0,1,0)","v":1},{"$f":"B10+C10+D10+E10+F10+G10","v":6},{"$f":"IF('7'!$D11>0,1,0)","v":1},{"$f":"IF('8'!$D11>0,1,0)","v":1},{"$f":"IF('9'!$D11>0,1,0)","v":1},{"$f":"IF(' 10'!$D11>0,1,0)","v":1},{"$f":"IF('11'!$D11>0,1,0)","v":1},{"$f":"IF('12'!$D11>0,1,0)","v":0},{"$f":"I10+J10+K10+L10+M10+N10","v":5},{"$f":"O10+H10","v":11},null,null,"7. Kreisklasse"]
["Heinz Engbers",{"$f":"IF('Wettkampf 1'!D12>0,1,0)","v":1},{"$f":"IF('2'!$D12>0,1,0)","v":1},{"$f":"IF('3'!$D12>0,1,0)","v":1},{"$f":"IF('4'!$D12>0,1,0)","v":1},{"$f":"IF(' 5'!$D12>0,1,0)","v":1},{"$f":"IF(' 6'!$D12>0,1,0)","v":1},6,{"$f":"IF('7'!$D12>0,1,0)","v":1},{"$f":"IF('8'!$D12>0,1,0)","v":1},{"$f":"IF('9'!$D12>0,1,0)","v":1},{"$f":"IF(' 10'!$D12>0,1,0)","v":1},{"$f":"IF('11'!$D12>0,1,0)","v":1},{"$f":"IF('12'!$D12>0,1,0)","v":0},5,11]
["Willi Engbers",{"$f":"IF('Wettkampf 1'!D13>0,1,0)","v":1},{"$f":"IF('2'!$D13>0,1,0)","v":1},{"$f":"IF('3'!$D13>0,1,0)","v":1},{"$f":"IF('4'!$D13>0,1,0)","v":1},{"$f":"IF(' 5'!$D13>0,1,0)","v":1},{"$f":"IF(' 6'!$D13>0,1,0)","v":1},6,{"$f":"IF('7'!$D13>0,1,0)","v":1},{"$f":"IF('8'!$D13>0,1,0)","v":1},{"$f":"IF('9'!$D13>0,1,0)","v":1},{"$f":"IF(' 10'!$D13>0,1,0)","v":1},{"$f":"IF('11'!$D13>0,1,0)","v":1},{"$f":"IF('12'!$D13>0,1,0)","v":0},5,11]
["Hans Gebken 1",{"$f":"IF('Wettkampf 1'!D14>0,1,0)","v":1},{"$f":"IF('2'!$D14>0,1,0)","v":1},{"$f":"IF('3'!$D14>0,1,0)","v":1},{"$f":"IF('4'!$D14>0,1,0)","v":1},{"$f":"IF(' 5'!$D14>0,1,0)","v":1},{"$f":"IF(' 6'!$D14>0,1,0)","v":1},6,{"$f":"IF('7'!$D14>0,1,0)","v":1},{"$f":"IF('8'!$D14>0,1,0)","v":1},{"$f":"IF('9'!$D14>0,1,0)","v":1},{"$f":"IF(' 10'!$D14>0,1,0)","v":1},{"$f":"IF('11'!$D14>0,1,0)","v":1},{"$f":"IF('12'!$D14>0,1,0)","v":0},5,11]
["Philipp Schmidt",{"$f":"IF('Wettkampf 1'!D15>0,1,0)","v":1},{"$f":"IF('2'!$D15>0,1,0)","v":1},{"$f":"IF('3'!$D15>0,1,0)","v":1},{"$f":"IF('4'!$D15>0,1,0)","v":1},{"$f":"IF(' 5'!$D15>0,1,0)","v":1},{"$f":"IF(' 6'!$D15>0,1,0)","v":1},6,{"$f":"IF('7'!$D15>0,1,0)","v":1},{"$f":"IF('8'!$D15>0,1,0)","v":1},{"$f":"IF('9'!$D15>0,1,0)","v":1},{"$f":"IF(' 10'!$D15>0,1,0)","v":1},{"$f":"IF('11'!$D15>0,1,0)","v":1},{"$f":"IF('12'!$D15>0,1,0)","v":0},5,11]
["Philipp Scholübbers ",{"$f":"IF('Wettkampf 1'!D16>0,1,0)","v":1},{"$f":"IF('2'!$D16>0,1,0)","v":1},{"$f":"IF('3'!$D16>0,1,0)","v":1},{"$f":"IF('4'!$D16>0,1,0)","v":1},{"$f":"IF(' 5'!$D16>0,1,0)","v":1},{"$f":"IF(' 6'!$D16>0,1,0)","v":1},6,{"$f":"IF('7'!$D16>0,1,0)","v":1},{"$f":"IF('8'!$D16>0,1,0)","v":1},{"$f":"IF('9'!$D16>0,1,0)","v":1},{"$f":"IF(' 10'!$D16>0,1,0)","v":1},{"$f":"IF('11'!$D16>0,1,0)","v":1},{"$f":"IF('12'!$D16>0,1,0)","v":0},5,11]
["Matthias Brinkmann",{"$f":"IF('Wettkampf 1'!D17>0,1,0)","v":1},{"$f":"IF('2'!$D17>0,1,0)","v":1},{"$f":"IF('3'!$D17>0,1,0)","v":1},{"$f":"IF('4'!$D17>0,1,0)","v":1},{"$f":"IF(' 5'!$D17>0,1,0)","v":0},{"$f":"IF(' 6'!$D17>0,1,0)","v":1},5,{"$f":"IF('7'!$D17>0,1,0)","v":1},{"$f":"IF('8'!$D17>0,1,0)","v":1},{"$f":"IF('9'!$D17>0,1,0)","v":1},{"$f":"IF(' 10'!$D17>0,1,0)","v":1},{"$f":"IF('11'!$D17>0,1,0)","v":1},{"$f":"IF('12'!$D17>0,1,0)","v":0},5,10]
["Patrik Krüßel",{"$f":"IF('Wettkampf 1'!D18>0,1,0)","v":1},{"$f":"IF('2'!$D18>0,1,0)","v":1},{"$f":"IF('3'!$D18>0,1,0)","v":1},{"$f":"IF('4'!$D18>0,1,0)","v":1},{"$f":"IF(' 5'!$D18>0,1,0)","v":1},{"$f":"IF(' 6'!$D18>0,1,0)","v":1},6,{"$f":"IF('7'!$D18>0,1,0)","v":1},{"$f":"IF('8'!$D18>0,1,0)","v":1},{"$f":"IF('9'!$D18>0,1,0)","v":1},{"$f":"IF(' 10'!$D18>0,1,0)","v":1},{"$f":"IF('11'!$D18>0,1,0)","v":1},{"$f":"IF('12'!$D18>0,1,0)","v":0},5,11]
["Markus Jansen",{"$f":"IF('Wettkampf 1'!D19>0,1,0)","v":1},{"$f":"IF('2'!$D19>0,1,0)","v":1},{"$f":"IF('3'!$D19>0,1,0)","v":1},{"$f":"IF('4'!$D19>0,1,0)","v":1},{"$f":"IF(' 5'!$D19>0,1,0)","v":1},{"$f":"IF(' 6'!$D19>0,1,0)","v":1},6,{"$f":"IF('7'!$D19>0,1,0)","v":1},{"$f":"IF('8'!$D19>0,1,0)","v":1},{"$f":"IF('9'!$D19>0,1,0)","v":1},{"$f":"IF(' 10'!$D19>0,1,0)","v":1},{"$f":"IF('11'!$D19>0,1,0)","v":1},{"$f":"IF('12'!$D19>0,1,0)","v":0},5,11]
["Helmut Benten ",{"$f":"IF('Wettkampf 1'!D20>0,1,0)","v":1},{"$f":"IF('2'!$D20>0,1,0)","v":1},{"$f":"IF('3'!$D20>0,1,0)","v":1},{"$f":"IF('4'!$D20>0,1,0)","v":1},{"$f":"IF(' 5'!$D20>0,1,0)","v":1},{"$f":"IF(' 6'!$D20>0,1,0)","v":1},6,{"$f":"IF('7'!$D20>0,1,0)","v":1},{"$f":"IF('8'!$D20>0,1,0)","v":1},{"$f":"IF('9'!$D20>0,1,0)","v":1},{"$f":"IF(' 10'!$D20>0,1,0)","v":1},{"$f":"IF('11'!$D20>0,1,0)","v":1},{"$f":"IF('12'!$D20>0,1,0)","v":0},5,11]
["Heinz Dirksen",{"$f":"IF('Wettkampf 1'!D21>0,1,0)","v":1},{"$f":"IF('2'!$D21>0,1,0)","v":1},{"$f":"IF('3'!$D21>0,1,0)","v":1},{"$f":"IF('4'!$D21>0,1,0)","v":1},{"$f":"IF(' 5'!$D21>0,1,0)","v":1},{"$f":"IF(' 6'!$D21>0,1,0)","v":1},6,{"$f":"IF('7'!$D21>0,1,0)","v":1},{"$f":"IF('8'!$D21>0,1,0)","v":1},{"$f":"IF('9'!$D21>0,1,0)","v":1},{"$f":"IF(' 10'!$D21>0,1,0)","v":1},{"$f":"IF('11'!$D21>0,1,0)","v":1},{"$f":"IF('12'!$D21>0,1,0)","v":0},5,11]
["Hans Ortmann ",{"$f":"IF('Wettkampf 1'!D22>0,1,0)","v":1},{"$f":"IF('2'!$D22>0,1,0)","v":1},{"$f":"IF('3'!$D22>0,1,0)","v":1},{"$f":"IF('4'!$D22>0,1,0)","v":1},{"$f":"IF(' 5'!$D22>0,1,0)","v":1},{"$f":"IF(' 6'!$D22>0,1,0)","v":1},6,{"$f":"IF('7'!$D22>0,1,0)","v":1},{"$f":"IF('8'!$D22>0,1,0)","v":1},{"$f":"IF('9'!$D22>0,1,0)","v":1},{"$f":"IF(' 10'!$D22>0,1,0)","v":1},{"$f":"IF('11'!$D22>0,1,0)","v":1},{"$f":"IF('12'!$D22>0,1,0)","v":0},5,11]
["Karl-Heinz Ortmann",{"$f":"IF('Wettkampf 1'!D23>0,1,0)","v":1},{"$f":"IF('2'!$D23>0,1,0)","v":1},{"$f":"IF('3'!$D23>0,1,0)","v":1},{"$f":"IF('4'!$D23>0,1,0)","v":1},{"$f":"IF(' 5'!$D23>0,1,0)","v":1},{"$f":"IF(' 6'!$D23>0,1,0)","v":1},6,{"$f":"IF('7'!$D23>0,1,0)","v":1},{"$f":"IF('8'!$D23>0,1,0)","v":1},{"$f":"IF('9'!$D23>0,1,0)","v":1},{"$f":"IF(' 10'!$D23>0,1,0)","v":1},{"$f":"IF('11'!$D23>0,1,0)","v":1},{"$f":"IF('12'!$D23>0,1,0)","v":0},5,11]
["Johannes Jansen",{"$f":"IF('Wettkampf 1'!D24>0,1,0)","v":1},{"$f":"IF('2'!$D24>0,1,0)","v":1},{"$f":"IF('3'!$D24>0,1,0)","v":1},{"$f":"IF('4'!$D24>0,1,0)","v":1},{"$f":"IF(' 5'!$D24>0,1,0)","v":1},{"$f":"IF(' 6'!$D24>0,1,0)","v":1},6,{"$f":"IF('7'!$D24>0,1,0)","v":1},{"$f":"IF('8'!$D24>0,1,0)","v":1},{"$f":"IF('9'!$D24>0,1,0)","v":1},{"$f":"IF(' 10'!$D24>0,1,0)","v":1},{"$f":"IF('11'!$D24>0,1,0)","v":1},{"$f":"IF('12'!$D24>0,1,0)","v":0},5,11]
["Kevin Minnert",{"$f":"IF('Wettkampf 1'!D25>0,1,0)","v":1},{"$f":"IF('2'!$D25>0,1,0)","v":1},{"$f":"IF('3'!$D25>0,1,0)","v":1},{"$f":"IF('4'!$D25>0,1,0)","v":1},{"$f":"IF(' 5'!$D25>0,1,0)","v":1},{"$f":"IF(' 6'!$D25>0,1,0)","v":1},6,{"$f":"IF('7'!$D25>0,1,0)","v":1},{"$f":"IF('8'!$D25>0,1,0)","v":1},{"$f":"IF('9'!$D25>0,1,0)","v":0},{"$f":"IF(' 10'!$D25>0,1,0)","v":0},{"$f":"IF('11'!$D25>0,1,0)","v":0},{"$f":"IF('12'!$D25>0,1,0)","v":0},2,8]
["Daniel Schülke",{"$f":"IF('Wettkampf 1'!D26>0,1,0)","v":0},{"$f":"IF('2'!$D26>0,1,0)","v":0},{"$f":"IF('3'!$D26>0,1,0)","v":1},{"$f":"IF('4'!$D26>0,1,0)","v":1},{"$f":"IF(' 5'!$D26>0,1,0)","v":1},{"$f":"IF(' 6'!$D26>0,1,0)","v":0},3,{"$f":"IF('7'!$D26>0,1,0)","v":1},{"$f":"IF('8'!$D26>0,1,0)","v":0},{"$f":"IF('9'!$D26>0,1,0)","v":1},{"$f":"IF(' 10'!$D26>0,1,0)","v":1},{"$f":"IF('11'!$D26>0,1,0)","v":1},{"$f":"IF('12'!$D26>0,1,0)","v":0},4,7]
["Frank Wotte",{"$f":"IF('Wettkampf 1'!D27>0,1,0)","v":1},{"$f":"IF('2'!$D27>0,1,0)","v":1},{"$f":"IF('3'!$D27>0,1,0)","v":1},{"$f":"IF('4'!$D27>0,1,0)","v":1},{"$f":"IF(' 5'!$D27>0,1,0)","v":1},{"$f":"IF(' 6'!$D27>0,1,0)","v":1},6,{"$f":"IF('7'!$D27>0,1,0)","v":1},{"$f":"IF('8'!$D27>0,1,0)","v":1},{"$f":"IF('9'!$D27>0,1,0)","v":1},{"$f":"IF(' 10'!$D27>0,1,0)","v":1},{"$f":"IF('11'!$D27>0,1,0)","v":1},{"$f":"IF('12'!$D27>0,1,0)","v":0},5,11]
["Johannes Wesseln",{"$f":"IF('Wettkampf 1'!D28>0,1,0)","v":1},{"$f":"IF('2'!$D28>0,1,0)","v":1},{"$f":"IF('3'!$D28>0,1,0)","v":1},{"$f":"IF('4'!$D28>0,1,0)","v":1},{"$f":"IF(' 5'!$D28>0,1,0)","v":1},{"$f":"IF(' 6'!$D28>0,1,0)","v":1},6,{"$f":"IF('7'!$D28>0,1,0)","v":1},{"$f":"IF('8'!$D28>0,1,0)","v":1},{"$f":"IF('9'!$D28>0,1,0)","v":1},{"$f":"IF(' 10'!$D28>0,1,0)","v":1},{"$f":"IF('11'!$D28>0,1,0)","v":1},{"$f":"IF('12'!$D28>0,1,0)","v":0},5,11]
["Anton Oldiges",{"$f":"IF('Wettkampf 1'!D29>0,1,0)","v":1},{"$f":"IF('2'!$D29>0,1,0)","v":1},{"$f":"IF('3'!$D29>0,1,0)","v":1},{"$f":"IF('4'!$D29>0,1,0)","v":1},{"$f":"IF(' 5'!$D29>0,1,0)","v":1},{"$f":"IF(' 6'!$D29>0,1,0)","v":1},6,{"$f":"IF('7'!$D29>0,1,0)","v":1},{"$f":"IF('8'!$D29>0,1,0)","v":1},{"$f":"IF('9'!$D29>0,1,0)","v":1},{"$f":"IF(' 10'!$D29>0,1,0)","v":1},{"$f":"IF('11'!$D29>0,1,0)","v":1},{"$f":"IF('12'!$D29>0,1,0)","v":0},5,11]
["Jürgen Will",{"$f":"IF('Wettkampf 1'!D30>0,1,0)","v":1},{"$f":"IF('2'!$D30>0,1,0)","v":1},{"$f":"IF('3'!$D30>0,1,0)","v":1},{"$f":"IF('4'!$D30>0,1,0)","v":1},{"$f":"IF(' 5'!$D30>0,1,0)","v":1},{"$f":"IF(' 6'!$D30>0,1,0)","v":1},6,{"$f":"IF('7'!$D30>0,1,0)","v":1},{"$f":"IF('8'!$D30>0,1,0)","v":1},{"$f":"IF('9'!$D30>0,1,0)","v":1},{"$f":"IF(' 10'!$D30>0,1,0)","v":1},{"$f":"IF('11'!$D30>0,1,0)","v":1},{"$f":"IF('12'!$D30>0,1,0)","v":0},5,11]
["Schütze 22",{"$f":"IF('Wettkampf 1'!D31>0,1,0)","v":0},{"$f":"IF('2'!$D31>0,1,0)","v":0},{"$f":"IF('3'!$D31>0,1,0)","v":0},{"$f":"IF('4'!$D31>0,1,0)","v":0},{"$f":"IF(' 5'!$D31>0,1,0)","v":0},{"$f":"IF(' 6'!$D31>0,1,0)","v":0},0,{"$f":"IF('7'!$D31>0,1,0)","v":0},{"$f":"IF('8'!$D31>0,1,0)","v":0},{"$f":"IF('9'!$D31>0,1,0)","v":0},{"$f":"IF(' 10'!$D31>0,1,0)","v":0},{"$f":"IF('11'!$D31>0,1,0)","v":0},{"$f":"IF('12'!$D31>0,1,0)","v":0},0,0]
["Schütze 23",{"$f":"IF('Wettkampf 1'!D32>0,1,0)","v":0},{"$f":"IF('2'!$D32>0,1,0)","v":0},{"$f":"IF('3'!$D32>0,1,0)","v":0},{"$f":"IF('4'!$D32>0,1,0)","v":0},{"$f":"IF(' 5'!$D32>0,1,0)","v":0},{"$f":"IF(' 6'!$D32>0,1,0)","v":0},0,{"$f":"IF('7'!$D32>0,1,0)","v":0},{"$f":"IF('8'!$D32>0,1,0)","v":0},{"$f":"IF('9'!$D32>0,1,0)","v":0},{"$f":"IF(' 10'!$D32>0,1,0)","v":0},{"$f":"IF('11'!$D32>0,1,0)","v":0},{"$f":"IF('12'!$D32>0,1,0)","v":0},0,0]
["Norbert Jansen",{"$f":"IF('Wettkampf 1'!D33>0,1,0)","v":1},{"$f":"IF('2'!$D33>0,1,0)","v":1},{"$f":"IF('3'!$D33>0,1,0)","v":1},{"$f":"IF('4'!$D33>0,1,0)","v":1},{"$f":"IF(' 5'!$D33>0,1,0)","v":1},{"$f":"IF(' 6'!$D33>0,1,0)","v":1},6,{"$f":"IF('7'!$D33>0,1,0)","v":1},{"$f":"IF('8'!$D33>0,1,0)","v":1},{"$f":"IF('9'!$D33>0,1,0)","v":1},{"$f":"IF(' 10'!$D33>0,1,0)","v":1},{"$f":"IF('11'!$D33>0,1,0)","v":1},{"$f":"IF('12'!$D33>0,1,0)","v":0},5,11]
["Werner Jansen",{"$f":"IF('Wettkampf 1'!D34>0,1,0)","v":1},{"$f":"IF('2'!$D34>0,1,0)","v":1},{"$f":"IF('3'!$D34>0,1,0)","v":1},{"$f":"IF('4'!$D34>0,1,0)","v":1},{"$f":"IF(' 5'!$D34>0,1,0)","v":1},{"$f":"IF(' 6'!$D34>0,1,0)","v":1},6,{"$f":"IF('7'!$D34>0,1,0)","v":1},{"$f":"IF('8'!$D34>0,1,0)","v":1},{"$f":"IF('9'!$D34>0,1,0)","v":1},{"$f":"IF(' 10'!$D34>0,1,0)","v":1},{"$f":"IF('11'!$D34>0,1,0)","v":1},{"$f":"IF('12'!$D34>0,1,0)","v":0},5,11]
["Alfons Plüster",{"$f":"IF('Wettkampf 1'!D35>0,1,0)","v":1},{"$f":"IF('2'!$D35>0,1,0)","v":1},{"$f":"IF('3'!$D35>0,1,0)","v":1},{"$f":"IF('4'!$D35>0,1,0)","v":1},{"$f":"IF(' 5'!$D35>0,1,0)","v":1},{"$f":"IF(' 6'!$D35>0,1,0)","v":1},6,{"$f":"IF('7'!$D35>0,1,0)","v":1},{"$f":"IF('8'!$D35>0,1,0)","v":1},{"$f":"IF('9'!$D35>0,1,0)","v":1},{"$f":"IF(' 10'!$D35>0,1,0)","v":1},{"$f":"IF('11'!$D35>0,1,0)","v":1},{"$f":"IF('12'!$D35>0,1,0)","v":0},5,11]
["Johannes Oldiges",{"$f":"IF('Wettkampf 1'!D36>0,1,0)","v":1},{"$f":"IF('2'!$D36>0,1,0)","v":1},{"$f":"IF('3'!$D36>0,1,0)","v":1},{"$f":"IF('4'!$D36>0,1,0)","v":1},{"$f":"IF(' 5'!$D36>0,1,0)","v":1},{"$f":"IF(' 6'!$D36>0,1,0)","v":1},6,{"$f":"IF('7'!$D36>0,1,0)","v":1},{"$f":"IF('8'!$D36>0,1,0)","v":1},{"$f":"IF('9'!$D36>0,1,0)","v":1},{"$f":"IF(' 10'!$D36>0,1,0)","v":1},{"$f":"IF('11'!$D36>0,1,0)","v":1},{"$f":"IF('12'!$D36>0,1,0)","v":0},5,11]
["Hans Plüster",{"$f":"IF('Wettkampf 1'!D37>0,1,0)","v":1},{"$f":"IF('2'!$D37>0,1,0)","v":1},{"$f":"IF('3'!$D37>0,1,0)","v":1},{"$f":"IF('4'!$D37>0,1,0)","v":1},{"$f":"IF(' 5'!$D37>0,1,0)","v":1},{"$f":"IF(' 6'!$D37>0,1,0)","v":1},6,{"$f":"IF('7'!$D37>0,1,0)","v":1},{"$f":"IF('8'!$D37>0,1,0)","v":1},{"$f":"IF('9'!$D37>0,1,0)","v":1},{"$f":"IF(' 10'!$D37>0,1,0)","v":1},{"$f":"IF('11'!$D37>0,1,0)","v":1},{"$f":"IF('12'!$D37>0,1,0)","v":0},5,11]
["Josef Wübben ",{"$f":"IF('Wettkampf 1'!D38>0,1,0)","v":1},{"$f":"IF('2'!$D38>0,1,0)","v":1},{"$f":"IF('3'!$D38>0,1,0)","v":1},{"$f":"IF('4'!$D38>0,1,0)","v":1},{"$f":"IF(' 5'!$D38>0,1,0)","v":1},{"$f":"IF(' 6'!$D38>0,1,0)","v":1},6,{"$f":"IF('7'!$D38>0,1,0)","v":1},{"$f":"IF('8'!$D38>0,1,0)","v":1},{"$f":"IF('9'!$D38>0,1,0)","v":1},{"$f":"IF(' 10'!$D38>0,1,0)","v":1},{"$f":"IF('11'!$D38>0,1,0)","v":1},{"$f":"IF('12'!$D38>0,1,0)","v":0},5,11]
["Thomas Niermann",{"$f":"IF('Wettkampf 1'!D39>0,1,0)","v":1},{"$f":"IF('2'!$D39>0,1,0)","v":1},{"$f":"IF('3'!$D39>0,1,0)","v":1},{"$f":"IF('4'!$D39>0,1,0)","v":1},{"$f":"IF(' 5'!$D39>0,1,0)","v":1},{"$f":"IF(' 6'!$D39>0,1,0)","v":1},6,{"$f":"IF('7'!$D39>0,1,0)","v":1},{"$f":"IF('8'!$D39>0,1,0)","v":1},{"$f":"IF('9'!$D39>0,1,0)","v":1},{"$f":"IF(' 10'!$D39>0,1,0)","v":1},{"$f":"IF('11'!$D39>0,1,0)","v":1},{"$f":"IF('12'!$D39>0,1,0)","v":0},5,11]
["Bernd Thien",{"$f":"IF('Wettkampf 1'!D40>0,1,0)","v":1},{"$f":"IF('2'!$D40>0,1,0)","v":1},{"$f":"IF('3'!$D40>0,1,0)","v":1},{"$f":"IF('4'!$D40>0,1,0)","v":1},{"$f":"IF(' 5'!$D40>0,1,0)","v":1},{"$f":"IF(' 6'!$D40>0,1,0)","v":1},{"$f":"B39+C39+D39+E39+F39+G39","v":6},{"$f":"IF('7'!$D40>0,1,0)","v":1},{"$f":"IF('8'!$D40>0,1,0)","v":1},{"$f":"IF('9'!$D40>0,1,0)","v":1},{"$f":"IF(' 10'!$D40>0,1,0)","v":1},{"$f":"IF('11'!$D40>0,1,0)","v":1},{"$f":"IF('12'!$D40>0,1,0)","v":0},{"$f":"I39+J39+K39+L39+M39+N39","v":5},{"$f":"O39+H39","v":11}]
["Norbert Grünloh ",{"$f":"IF('Wettkampf 1'!D41>0,1,0)","v":1},{"$f":"IF('2'!$D41>0,1,0)","v":1},{"$f":"IF('3'!$D41>0,1,0)","v":1},{"$f":"IF('4'!$D41>0,1,0)","v":1},{"$f":"IF(' 5'!$D41>0,1,0)","v":1},{"$f":"IF(' 6'!$D41>0,1,0)","v":1},6,{"$f":"IF('7'!$D41>0,1,0)","v":1},{"$f":"IF('8'!$D41>0,1,0)","v":1},{"$f":"IF('9'!$D41>0,1,0)","v":1},{"$f":"IF(' 10'!$D41>0,1,0)","v":1},{"$f":"IF('11'!$D41>0,1,0)","v":1},{"$f":"IF('12'!$D41>0,1,0)","v":0},5,11]
["Andreas Thoben ",{"$f":"IF('Wettkampf 1'!D42>0,1,0)","v":1},{"$f":"IF('2'!$D42>0,1,0)","v":1},{"$f":"IF('3'!$D42>0,1,0)","v":1},{"$f":"IF('4'!$D42>0,1,0)","v":1},{"$f":"IF(' 5'!$D42>0,1,0)","v":1},{"$f":"IF(' 6'!$D42>0,1,0)","v":1},6,{"$f":"IF('7'!$D42>0,1,0)","v":1},{"$f":"IF('8'!$D42>0,1,0)","v":1},{"$f":"IF('9'!$D42>0,1,0)","v":1},{"$f":"IF(' 10'!$D42>0,1,0)","v":1},{"$f":"IF('11'!$D42>0,1,0)","v":1},{"$f":"IF('12'!$D42>0,1,0)","v":0},5,11]
["Hermann Krone ",{"$f":"IF('Wettkampf 1'!D43>0,1,0)","v":1},{"$f":"IF('2'!$D43>0,1,0)","v":1},{"$f":"IF('3'!$D43>0,1,0)","v":1},{"$f":"IF('4'!$D43>0,1,0)","v":1},{"$f":"IF(' 5'!$D43>0,1,0)","v":1},{"$f":"IF(' 6'!$D43>0,1,0)","v":1},6,{"$f":"IF('7'!$D43>0,1,0)","v":1},{"$f":"IF('8'!$D43>0,1,0)","v":1},{"$f":"IF('9'!$D43>0,1,0)","v":1},{"$f":"IF(' 10'!$D43>0,1,0)","v":1},{"$f":"IF('11'!$D43>0,1,0)","v":1},{"$f":"IF('12'!$D43>0,1,0)","v":0},5,11]
["Michael Freitag ",{"$f":"IF('Wettkampf 1'!D44>0,1,0)","v":1},{"$f":"IF('2'!$D44>0,1,0)","v":1},{"$f":"IF('3'!$D44>0,1,0)","v":1},{"$f":"IF('4'!$D44>0,1,0)","v":1},{"$f":"IF(' 5'!$D44>0,1,0)","v":1},{"$f":"IF(' 6'!$D44>0,1,0)","v":1},6,{"$f":"IF('7'!$D44>0,1,0)","v":1},{"$f":"IF('8'!$D44>0,1,0)","v":1},{"$f":"IF('9'!$D44>0,1,0)","v":1},{"$f":"IF(' 10'!$D44>0,1,0)","v":0},{"$f":"IF('11'!$D44>0,1,0)","v":1},{"$f":"IF('12'!$D44>0,1,0)","v":0},4,10]
["Joachim Niermann",{"$f":"IF('Wettkampf 1'!D45>0,1,0)","v":1},{"$f":"IF('2'!$D45>0,1,0)","v":1},{"$f":"IF('3'!$D45>0,1,0)","v":1},{"$f":"IF('4'!$D45>0,1,0)","v":1},{"$f":"IF(' 5'!$D45>0,1,0)","v":1},{"$f":"IF(' 6'!$D45>0,1,0)","v":1},6,{"$f":"IF('7'!$D45>0,1,0)","v":1},{"$f":"IF('8'!$D45>0,1,0)","v":1},{"$f":"IF('9'!$D45>0,1,0)","v":1},{"$f":"IF(' 10'!$D45>0,1,0)","v":1},{"$f":"IF('11'!$D45>0,1,0)","v":1},{"$f":"IF('12'!$D45>0,1,0)","v":0},5,11]
[null,{"$f":"SUM(B9:B44)","v":{"v":33,"d":"33.00"}},{"$f":"SUM(C9:C44)","v":{"v":33,"d":"33.00"}},{"v":34,"d":"34.00"},{"v":34,"d":"34.00"},{"v":33,"d":"33.00"},{"v":33,"d":"33.00"},{"$f":"SUM(H9:H38)","v":{"v":164,"d":"164.00"}},{"$f":"SUM(I9:I44)","v":{"v":34,"d":"34.00"}},{"$f":"SUM(J9:J44)","v":{"v":33,"d":"33.00"}},{"v":33,"d":"33.00"},{"v":32,"d":"32.00"},{"v":33,"d":"33.00"},{"v":0,"d":"0.00"},{"$f":"SUM(O9:O44)","v":{"v":165,"d":"165.00"}},{"$f":"SUM(P9:P44)","v":{"v":365,"d":"365.00"}}]

{"sheet":"Übersicht Gruppen","index":17,"n_rows":7,"n_cols":20,"rows_kept":7,"hidden":true}
[]
[null,"Ostenwalde II",{"$f":"VLOOKUP($B$2:$B$7,'Wettkampf 1'!$B$2:$D$7,3,FALSE)","v":937.2},{"$f":"VLOOKUP($B$2:$B$7,'2'!$B$2:$D$7,3,FALSE)","v":942.8},{"$f":"VLOOKUP($B$2:$B$7,'3'!$B$2:$D$7,3,FALSE)","v":{"v":945.0999999999999,"d":"945.1"}},{"$f":"VLOOKUP($B$2:$B$7,'4'!$B$2:$D$7,3,FALSE)","v":933.7},{"$f":"VLOOKUP($B$2:$B$7,' 5'!$B$2:$D$7,3,FALSE)","v":{"v":946.5000000000001,"d":"946.5"}},{"$f":"VLOOKUP($B$2:$B$7,' 6'!$B$2:$D$7,3,FALSE)","v":{"v":941,"d":"941.0"}},{"$f":"J2/Formelhilfe!H7","v":{"v":941.0500000000001,"d":"941.1"}},{"$f":"SUM(C2:H2)","v":{"v":5646.3,"d":"5,646.3"}},{"$f":"VLOOKUP($B$2:$B$7,'7'!$B$2:$D$7,3,FALSE)","v":938.8},{"$f":"VLOOKUP($B$2:$B$7,'8'!$B$2:$D$7,3,FALSE)","v":938.7},{"$f":"VLOOKUP($B$2:$B$7,'9'!$B$2:$D$7,3,FALSE)","v":943.5},{"$f":"VLOOKUP($B$2:$B$7,' 10'!$B$2:$D$7,3,FALSE)","v":{"v":934.3000000000001,"d":"934.3"}},{"$f":"VLOOKUP($B$2:$B$7,'11'!$B$2:$D$7,3,FALSE)","v":940.4},{"$f":"VLOOKUP($B$2:$B$7,'12'!$B$2:$D$7,3,FALSE)","v":{"v":0,"d":"0.0"}},{"$f":"R2/Formelhilfe!O7","v":{"v":939.14,"d":"939.1"}},{"$f":"SUM(K2:P2)","v":{"v":4695.7,"d":"4,695.7"}},{"$f":"T2/Formelhilfe!P7","v":{"v":940.181818181818,"d":"940.2"}},{"$f":"SUM(C2:H2,K2:P2)","v":{"v":10341.999999999998,"d":"10,342.0"}}]
[null,"Werlte III",{"$f":"VLOOKUP($B$2:$B$7,'Wettkampf 1'!$B$2:$D$7,3,FALSE)","v":{"v":938.3000000000001,"d":"938.3"}},{"$f":"VLOOKUP($B$2:$B$7,'2'!$B$2:$D$7,3,FALSE)","v":{"v":938.0999999999999,"d":"938.1"}},{"$f":"VLOOKUP($B$2:$B$7,'3'!$B$2:$D$7,3,FALSE)","v":943.1},{"$f":"VLOOKUP($B$2:$B$7,'4'!$B$2:$D$7,3,FALSE)","v":938.8},{"$f":"VLOOKUP($B$2:$B$7,' 5'!$B$2:$D$7,3,FALSE)","v":{"v":938.9000000000001,"d":"938.9"}},{"$f":"VLOOKUP($B$2:$B$7,' 6'!$B$2:$D$7,3,FALSE)","v":935.6},{"$f":"J3/Formelhilfe!H3","v":{"v":938.8000000000002,"d":"938.8"}},{"v":5632.800000000001,"d":"5,632.8"},{"$f":"VLOOKUP($B$2:$B$7,'7'!$B$2:$D$7,3,FALSE)","v":937.2},{"$f":"VLOOKUP($B$2:$B$7,'8'!$B$2:$D$7,3,FALSE)","v":{"v":942.0999999999999,"d":"942.1"}},{"$f":"VLOOKUP($B$2:$B$7,'9'!$B$2:$D$7,3,FALSE)","v":940.5},{"$f":"VLOOKUP($B$2:$B$7,' 10'!$B$2:$D$7,3,FALSE)","v":932.3},{"$f":"VLOOKUP($B$2:$B$7,'11'!$B$2:$D$7,3,FALSE)","v":936.3},{"$f":"VLOOKUP($B$2:$B$7,'12'!$B$2:$D$7,3,FALSE)","v":{"v":0,"d":"0.0"}},{"$f":"R3/Formelhilfe!O3","v":{"v":937.6800000000001,"d":"937.7"}},{"v":4688.400000000001,"d":"4,688.4"},{"$f":"T3/Formelhilfe!P3","v":{"v":938.2909090909089,"d":"938.3"}},{"v":10321.199999999999,"d":"10,321.2"}]
[null,"Lorup III",{"$f":"VLOOKUP($B$2:$B$7,'Wettkampf 1'!$B$2:$D$7,3,FALSE)","v":{"v":936.0999999999999,"d":"936.1"}},{"$f":"VLOOKUP($B$2:$B$7,'2'!$B$2:$D$7,3,FALSE)","v":933.3},{"$f":"VLOOKUP($B$2:$B$7,'3'!$B$2:$D$7,3,FALSE)","v":938.5},{"$f":"VLOOKUP($B$2:$B$7,'4'!$B$2:$D$7,3,FALSE)","v":937.2},{"$f":"VLOOKUP($B$2:$B$7,' 5'!$B$2:$D$7,3,FALSE)","v":931.3},{"$f":"VLOOKUP($B$2:$B$7,' 6'!$B$2:$D$7,3,FALSE)","v":932.1},{"$f":"J4/Formelhilfe!H5","v":{"v":934.75,"d":"934.8"}},{"v":5608.5,"d":"5,608.5"},{"$f":"VLOOKUP($B$2:$B$7,'7'!$B$2:$D$7,3,FALSE)","v":{"v":937,"d":"937.0"}},{"$f":"VLOOKUP($B$2:$B$7,'8'!$B$2:$D$7,3,FALSE)","v":932.8},{"$f":"VLOOKUP($B$2:$B$7,'9'!$B$2:$D$7,3,FALSE)","v":{"v":933.8999999999999,"d":"933.9"}},{"$f":"VLOOKUP($B$2:$B$7,' 10'!$B$2:$D$7,3,FALSE)","v":936.7},{"$f":"VLOOKUP($B$2:$B$7,'11'!$B$2:$D$7,3,FALSE)","v":{"v":936,"d":"936.0"}},{"$f":"VLOOKUP($B$2:$B$7,'12'!$B$2:$D$7,3,FALSE)","v":{"v":0,"d":"0.0"}},{"$f":"R4/Formelhilfe!O5","v":{"v":935.28,"d":"935.3"}},{"v":4676.4,"d":"4,676.4"},{"$f":"T4/Formelhilfe!P5","v":{"v":934.9909090909092,"d":"935.0"}},{"v":10284.900000000001,"d":"10,284.9"}]
[null,"Breddenb.-Heid. III",{"$f":"VLOOKUP($B$2:$B$7,'Wettkampf 1'!$B$2:$D$7,3,FALSE)","v":{"v":924.5999999999999,"d":"924.6"}},{"$f":"VLOOKUP($B$2:$B$7,'2'!$B$2:$D$7,3,FALSE)","v":933.5},{"$f":"VLOOKUP($B$2:$B$7,'3'!$B$2:$D$7,3,FALSE)","v":{"v":935.1999999999999,"d":"935.2"}},{"$f":"VLOOKUP($B$2:$B$7,'4'!$B$2:$D$7,3,FALSE)","v":{"v":930,"d":"930.0"}},{"$f":"VLOOKUP($B$2:$B$7,' 5'!$B$2:$D$7,3,FALSE)","v":932.5},{"$f":"VLOOKUP($B$2:$B$7,' 6'!$B$2:$D$7,3,FALSE)","v":{"v":927.5999999999999,"d":"927.6"}},{"$f":"J5/Formelhilfe!H2","v":{"v":930.5666666666666,"d":"930.6"}},{"v":5583.4,"d":"5,583.4"},{"$f":"VLOOKUP($B$2:$B$7,'7'!$B$2:$D$7,3,FALSE)","v":{"v":938.0000000000001,"d":"938.0"}},{"$f":"VLOOKUP($B$2:$B$7,'8'!$B$2:$D$7,3,FALSE)","v":{"v":930,"d":"930.0"}},{"$f":"VLOOKUP($B$2:$B$7,'9'!$B$2:$D$7,3,FALSE)","v":938.2},{"$f":"VLOOKUP($B$2:$B$7,' 10'!$B$2:$D$7,3,FALSE)","v":{"v":924.9000000000001,"d":"924.9"}},{"$f":"VLOOKUP($B$2:$B$7,'11'!$B$2:$D$7,3,FALSE)","v":934.4},{"$f":"VLOOKUP($B$2:$B$7,'12'!$B$2:$D$7,3,FALSE)","v":{"v":0,"d":"0.0"}},{"$f":"R5/Formelhilfe!O2","v":933.1},{"v":4665.5,"d":"4,665.5"},{"$f":"T5/Formelhilfe!P2","v":{"v":931.7181818181817,"d":"931.7"}},{"v":10248.9,"d":"10,248.9"}]
[null,"Börgermoor II",{"$f":"VLOOKUP($B$2:$B$7,'Wettkampf 1'!$B$2:$D$7,3,FALSE)","v":931.7},{"$f":"VLOOKUP($B$2:$B$7,'2'!$B$2:$D$7,3,FALSE)","v":926.2},{"$f":"VLOOKUP($B$2:$B$7,'3'!$B$2:$D$7,3,FALSE)","v":{"v":936,"d":"936.0"}},{"$f":"VLOOKUP($B$2:$B$7,'4'!$B$2:$D$7,3,FALSE)","v":{"v":929.4000000000001,"d":"929.4"}},{"$f":"VLOOKUP($B$2:$B$7,' 5'!$B$2:$D$7,3,FALSE)","v":{"v":927.9000000000001,"d":"927.9"}},{"$f":"VLOOKUP($B$2:$B$7,' 6'!$B$2:$D$7,3,FALSE)","v":{"v":929,"d":"929.0"}},{"$f":"J6/Formelhilfe!H6","v":{"v":930.0333333333334,"d":"930.0"}},{"v":5580.200000000001,"d":"5,580.2"},{"$f":"VLOOKUP($B$2:$B$7,'7'!$B$2:$D$7,3,FALSE)","v":933.2},{"$f":"VLOOKUP($B$2:$B$7,'8'!$B$2:$D$7,3,FALSE)","v":{"v":927.3000000000001,"d":"927.3"}},{"$f":"VLOOKUP($B$2:$B$7,'9'!$B$2:$D$7,3,FALSE)","v":934.4},{"$f":"VLOOKUP($B$2:$B$7,' 10'!$B$2:$D$7,3,FALSE)","v":{"v":932.1999999999999,"d":"932.2"}},{"$f":"VLOOKUP($B$2:$B$7,'11'!$B$2:$D$7,3,FALSE)","v":932.3},{"$f":"VLOOKUP($B$2:$B$7,'12'!$B$2:$D$7,3,FALSE)","v":{"v":0,"d":"0.0"}},{"$f":"R6/Formelhilfe!O6","v":{"v":931.8799999999999,"d":"931.9"}},{"v":4659.4,"d":"4,659.4"},{"$f":"T6/Formelhilfe!P6","v":{"v":930.8727272727273,"d":"930.9"}},{"v":10239.6,"d":"10,239.6"}]
[null,"Breddenb.-Heid. I",{"$f":"VLOOKUP($B$2:$B$7,'Wettkampf 1'!$B$2:$D$7,3,FALSE)","v":926.7},{"$f":"VLOOKUP($B$2:$B$7,'2'!$B$2:$D$7,3,FALSE)","v":928.4},{"$f":"VLOOKUP($B$2:$B$7,'3'!$B$2:$D$7,3,FALSE)","v":{"v":927.6999999999999,"d":"927.7"}},{"$f":"VLOOKUP($B$2:$B$7,'4'!$B$2:$D$7,3,FALSE)","v":929.8},{"$f":"VLOOKUP($B$2:$B$7,' 5'!$B$2:$D$7,3,FALSE)","v":924.8},{"$f":"VLOOKUP($B$2:$B$7,' 6'!$B$2:$D$7,3,FALSE)","v":{"v":929.1999999999999,"d":"929.2"}},{"$f":"J7/Formelhilfe!H4","v":{"v":927.7666666666665,"d":"927.8"}},{"v":5566.599999999999,"d":"5,566.6"},{"$f":"VLOOKUP($B$2:$B$7,'7'!$B$2:$D$7,3,FALSE)","v":931.1},{"$f":"VLOOKUP($B$2:$B$7,'8'!$B$2:$D$7,3,FALSE)","v":{"v":927.6000000000001,"d":"927.6"}},{"$f":"VLOOKUP($B$2:$B$7,'9'!$B$2:$D$7,3,FALSE)","v":934.3},{"$f":"VLOOKUP($B$2:$B$7,' 10'!$B$2:$D$7,3,FALSE)","v":{"v":930.6999999999999,"d":"930.7"}},{"$f":"VLOOKUP($B$2:$B$7,'11'!$B$2:$D$7,3,FALSE)","v":930.9},{"$f":"VLOOKUP($B$2:$B$7,'12'!$B$2:$D$7,3,FALSE)","v":{"v":0,"d":"0.0"}},{"$f":"R7/Formelhilfe!O4","v":{"v":930.9199999999998,"d":"930.9"}},{"v":4654.599999999999,"d":"4,654.6"},{"$f":"T7/Formelhilfe!P4","v":929.2},{"v":10221.2,"d":"10,221.2"}]