{"text_format":"3","workbook":"xlsx","n_sheets":18,"sheets":["Übersicht","Wettkampf 1","2","3","4","5","6","7","8","9","10","11","12","Ausdruck","Ausdruck blank","Übersicht Schützen","Formelhilfe","Übersicht Gruppen"],"not_rendered":{"images":3,"macros":1,"defined_names":12,"comments":3},"read":"whole","date_system":"1900"}

{"sheet":"Übersicht","index":0,"n_rows":54,"n_cols":22,"rows_kept":54,"merged":[[0,10,0,11],[0,12,0,14],[0,15,0,16],[2,9,2,10],[2,17,2,18],[2,19,2,20],[3,1,3,2],[3,21,5,21],[5,1,5,2],[6,1,6,2],[7,1,7,2],[8,1,8,2],[9,1,9,2],[10,1,10,2],[14,9,14,10],[14,17,14,18],[14,19,14,20],[14,21,16,21]]}
[{"$nulls":3},"Kreisrundenwettkampf",{"$nulls":5},"Saison","2019/2020",null,"2. Kreisklasse",null,null,"Damen"]
[]
[null,null,"Wettkampftag:","22.09.","13.10","27.10.","17.11.","01.12.","15.12.","Hinrunde",null,"12.01.","26.01.","09.02.","23.02.","08.03.","22.03.","Rückrunde",null,"Serie komplett"]
["Pos.","Verein / Gruppe",null,"Börger","Esterwegen","Neuvrees","Lahn","Lahn","Börger","Schnitt","Gesamt ",{"$f":"D4","v":"Börger"},"Esterwegen","Neuvrees","Börger","Lahn","Lahn","Schnitt","Gesamt ","Schnitt","Gesamt","Differenz"]
[]
[1,{"$f":"'Übersicht Gruppen'!B2","v":"Esterwegen V"},null,{"$f":"'Übersicht Gruppen'!C2","v":{"v":931.0999999999999,"d":"931.1"}},{"$f":"'Übersicht Gruppen'!D2","v":940.1},{"$f":"'Übersicht Gruppen'!E2","v":934.7},{"$f":"'Übersicht Gruppen'!F2","v":{"v":934,"d":"934.0"}},{"$f":"'Übersicht Gruppen'!G2","v":{"v":935.8000000000001,"d":"935.8"}},{"$f":"'Übersicht Gruppen'!H2","v":933.2},{"$f":"'Übersicht Gruppen'!I2","v":{"v":934.8166666666666,"d":"934.82"}},{"$f":"SUM(D6:I6)","v":{"v":5608.9,"d":"5,608.9"}},{"$f":"'Übersicht Gruppen'!K2","v":938.1},{"$f":"'Übersicht Gruppen'!L2","v":938.2},{"$f":"'Übersicht Gruppen'!M2","v":932.4},{"$f":"'Übersicht Gruppen'!N2","v":937.8},{"$f":"'Übersicht Gruppen'!O2","v":934.2},{"$f":"'Übersicht Gruppen'!P2","v":{"v":0,"d":"0.0"}},{"$f":"IF(Formelhilfe!O2=0,0,'Übersicht Gruppen'!Q2)","v":936.14},{"$f":"SUM(L6:Q6)","v":{"v":4680.7,"d":"4,680.7"}},{"$f":"'Übersicht Gruppen'!S2","v":{"v":935.4181818181819,"d":"935.42"}},{"$f":"SUM(S6+K6)","v":{"v":10289.599999999999,"d":"10,289.6"}}]
[2,{"$f":"'Übersicht Gruppen'!B3","v":"Lahn III"},null,{"$f":"'Übersicht Gruppen'!C3","v":928.5},{"$f":"'Übersicht Gruppen'!D3","v":{"v":919.0000000000001,"d":"919.0"}},{"$f":"'Übersicht Gruppen'!E3","v":922.7},{"$f":"'Übersicht Gruppen'!F3","v":{"v":933.4000000000001,"d":"933.4"}},{"$f":"'Übersicht Gruppen'!G3","v":937.2},{"$f":"'Übersicht Gruppen'!H3","v":{"v":923.5999999999999,"d":"923.6"}},{"$f":"'Übersicht Gruppen'!I3","v":{"v":927.4,"d":"927.40"}},{"v":5564.4,"d":"5,564.4"},{"$f":"'Übersicht Gruppen'!K3","v":{"v":931.4999999999999,"d":"931.5"}},{"$f":"'Übersicht Gruppen'!L3","v":{"v":922.0000000000001,"d":"922.0"}},{"$f":"'Übersicht Gruppen'!M3","v":{"v":921.6999999999999,"d":"921.7"}},{"$f":"'Übersicht Gruppen'!N3","v":928.8},{"$f":"'Übersicht Gruppen'!O3","v":{"v":923.9000000000001,"d":"923.9"}},{"$f":"'Übersicht Gruppen'!P3","v":{"v":0,"d":"0.0"}},{"$f":"IF(Formelhilfe!O3=0,0,'Übersicht Gruppen'!Q3)","v":{"v":925.5799999999999,"d":"925.58"}},{"v":4627.9,"d":"4,627.9"},{"$f":"'Übersicht Gruppen'!S3","v":{"v":926.5727272727272,"d":"926.57"}},{"$f":"SUM(S7+K7)","v":{"v":10192.3,"d":"10,192.3"}},{"$f":"(U6-U7)*-1","v":{"v":-97.29999999999927,"d":"-97.3"}}]
[3,{"$f":"'Übersicht Gruppen'!B4","v":"Lahn IV"},null,{"$f":"'Übersicht Gruppen'!C4","v":922.7},{"$f":"'Übersicht Gruppen'!D4","v":919.2},{"$f":"'Übersicht Gruppen'!E4","v":{"v":920.0999999999999,"d":"920.1"}},{"$f":"'Übersicht Gruppen'!F4","v":{"v":925.4000000000001,"d":"925.4"}},{"$f":"'Übersicht Gruppen'!G4","v":930.5},{"$f":"'Übersicht Gruppen'!H4","v":929.6},{"$f":"'Übersicht Gruppen'!I4","v":{"v":924.5833333333334,"d":"924.58"}},{"v":5547.5,"d":"5,547.5"},{"$f":"'Übersicht Gruppen'!K4","v":{"v":925.5999999999999,"d":"925.6"}},{"$f":"'Übersicht Gruppen'!L4","v":924.4},{"$f":"'Übersicht Gruppen'!M4","v":928.4},{"$f":"'Übersicht Gruppen'!N4","v":{"v":935,"d":"935.0"}},{"$f":"'Übersicht Gruppen'!O4","v":{"v":925,"d":"925.0"}},{"$f":"'Übersicht Gruppen'!P4","v":{"v":0,"d":"0.0"}},{"$f":"IF(Formelhilfe!O4=0,0,'Übersicht Gruppen'!Q4)","v":927.68},{"v":4638.4,"d":"4,638.4"},{"$f":"'Übersicht Gruppen'!S4","v":{"v":925.9909090909091,"d":"925.99"}},{"v":10185.9,"d":"10,185.9"},{"$f":"(U7-U8)*-1","v":{"v":-6.399999999999636,"d":"-6.4"}}]
[4,{"$f":"'Übersicht Gruppen'!B5","v":"Neuvrees II"},null,{"$f":"'Übersicht Gruppen'!C5","v":919.3},{"$f":"'Übersicht Gruppen'!D5","v":923.3},{"$f":"'Übersicht Gruppen'!E5","v":{"v":925.0999999999999,"d":"925.1"}},{"$f":"'Übersicht Gruppen'!F5","v":{"v":925.1999999999999,"d":"925.2"}},{"$f":"'Übersicht Gruppen'!G5","v":923.2},{"$f":"'Übersicht Gruppen'!H5","v":920.9},{"$f":"'Übersicht Gruppen'!I5","v":{"v":922.8333333333331,"d":"922.83"}},{"v":5536.999999999999,"d":"5,537.0"},{"$f":"'Übersicht Gruppen'!K5","v":{"v":922.5999999999999,"d":"922.6"}},{"$f":"'Übersicht Gruppen'!L5","v":{"v":916.3000000000001,"d":"916.3"}},{"$f":"'Übersicht Gruppen'!M5","v":925.6},{"$f":"'Übersicht Gruppen'!N5","v":924.4},{"$f":"'Übersicht Gruppen'!O5","v":932.8},{"$f":"'Übersicht Gruppen'!P5","v":{"v":0,"d":"0.0"}},{"$f":"IF(Formelhilfe!O5=0,0,'Übersicht Gruppen'!Q5)","v":{"v":924.3399999999999,"d":"924.34"}},{"v":4621.7,"d":"4,621.7"},{"$f":"'Übersicht Gruppen'!S5","v":{"v":923.5181818181816,"d":"923.52"}},{"v":10158.699999999999,"d":"10,158.7"},{"v":-27.200000000000728,"d":"-27.2"}]
[5,{"$f":"'Übersicht Gruppen'!B6","v":"Börger II"},null,{"$f":"'Übersicht Gruppen'!C6","v":{"v":925.9999999999999,"d":"926.0"}},{"$f":"'Übersicht Gruppen'!D6","v":916.2},{"$f":"'Übersicht Gruppen'!E6","v":911.7},{"$f":"'Übersicht Gruppen'!F6","v":922.4},{"$f":"'Übersicht Gruppen'!G6","v":925.5},{"$f":"'Übersicht Gruppen'!H6","v":930.4},{"$f":"'Übersicht Gruppen'!I6","v":{"v":922.0333333333332,"d":"922.03"}},{"v":5532.199999999999,"d":"5,532.2"},{"$f":"'Übersicht Gruppen'!K6","v":923.6},{"$f":"'Übersicht Gruppen'!L6","v":{"v":923.1999999999999,"d":"923.2"}},{"$f":"'Übersicht Gruppen'!M6","v":{"v":919.5999999999999,"d":"919.6"}},{"$f":"'Übersicht Gruppen'!N6","v":{"v":922.0999999999999,"d":"922.1"}},{"$f":"'Übersicht Gruppen'!O6","v":{"v":929.4000000000001,"d":"929.4"}},{"$f":"'Übersicht Gruppen'!P6","v":{"v":0,"d":"0.0"}},{"$f":"IF(Formelhilfe!O6=0,0,'Übersicht Gruppen'!Q6)","v":{"v":923.5799999999999,"d":"923.58"}},{"v":4617.9,"d":"4,617.9"},{"$f":"'Übersicht Gruppen'!S6","v":{"v":922.7363636363635,"d":"922.74"}},{"v":10150.099999999999,"d":"10,150.1"},{"v":-8.600000000000364,"d":"-8.6"}]
[6,{"$f":"'Übersicht Gruppen'!B7","v":"Börger III"},null,{"$f":"'Übersicht Gruppen'!C7","v":924.8},{"$f":"'Übersicht Gruppen'!D7","v":{"v":924,"d":"924.0"}},{"$f":"'Übersicht Gruppen'!E7","v":910.6},{"$f":"'Übersicht Gruppen'!F7","v":920.3},{"$f":"'Übersicht Gruppen'!G7","v":925.2},{"$f":"'Übersicht Gruppen'!H7","v":{"v":917,"d":"917.0"}},{"$f":"'Übersicht Gruppen'!I7","v":{"v":920.3166666666666,"d":"920.32"}},{"v":5521.9,"d":"5,521.9"},{"$f":"'Übersicht Gruppen'!K7","v":924.8},{"$f":"'Übersicht Gruppen'!L7","v":913.1},{"$f":"'Übersicht Gruppen'!M7","v":{"v":925.4000000000001,"d":"925.4"}},{"$f":"'Übersicht Gruppen'!N7","v":915.2},{"$f":"'Übersicht Gruppen'!O7","v":{"v":919.6999999999999,"d":"919.7"}},{"$f":"'Übersicht Gruppen'!P7","v":{"v":0,"d":"0.0"}},{"$f":"IF(Formelhilfe!O7=0,0,'Übersicht Gruppen'!Q7)","v":919.64},{"v":4598.2,"d":"4,598.2"},{"$f":"'Übersicht Gruppen'!S7","v":{"v":920.0090909090911,"d":"920.01"}},{"v":10120.099999999999,"d":"10,120.1"},{"v":-30,"d":"-30.0"}]
[]
[null,null,"Schnitt:",{"$f":"AVERAGE(D6:D11)","v":{"v":925.4000000000001,"d":"925.4"}},{"$f":"AVERAGE(E6:E11)","v":{"v":923.6333333333333,"d":"923.6"}},{"v":920.8166666666667,"d":"920.8"},{"v":926.7833333333333,"d":"926.8"},{"v":929.5666666666666,"d":"929.6"},{"v":925.7833333333333,"d":"925.8"},{"v":925.3305555555554,"d":"925.33"},{"$f":"SUM(K6:K11)/6","v":{"v":5551.983333333334,"d":"5,552.0"}},{"v":927.6999999999999,"d":"927.7"},{"v":922.8666666666668,"d":"922.9"},{"v":925.5166666666668,"d":"925.5"},{"v":927.2166666666667,"d":"927.2"},{"v":927.5000000000001,"d":"927.5"},{"v":0,"d":"0.0"},926.16,4630.8,{"v":925.7075757575758,"d":"925.71"},{"v":10182.783333333331,"d":"10,182.8"}]
[]
[{"$nulls":9},"Hinrunde",{"$nulls":7},"Rückrunde",null,"Serie komplett",null,"Differenz"]
["Pos.","Vorname Name","Verein / Gruppe",{"$nulls":6},"Schnitt","Gesamt",{"$nulls":6},"Schnitt","Gesamt","Schnitt","Gesamt"]
[1,{"$f":"'Übersicht Schützen'!A2","v":"Lindemann, Rita"},{"$f":"'Übersicht Schützen'!B2","v":"Esterwegen V"},{"$f":"'Übersicht Schützen'!C2","v":313.4},{"$f":"'Übersicht Schützen'!D2","v":317.5},{"$f":"'Übersicht Schützen'!E2","v":314.5},{"$f":"'Übersicht Schützen'!F2","v":{"v":315,"d":"315.0"}},{"$f":"'Übersicht Schützen'!G2","v":316.6},{"$f":"'Übersicht Schützen'!H2","v":315.6},{"$f":"'Übersicht Schützen'!I2","v":{"v":315.43333333333334,"d":"315.43"}},{"$f":"SUM(D17:I17)","v":{"v":1892.6,"d":"1,892.6"}},{"$f":"'Übersicht Schützen'!L2","v":316.1},{"$f":"'Übersicht Schützen'!M2","v":{"v":315,"d":"315.0"}},{"$f":"'Übersicht Schützen'!N2","v":317.2},{"$f":"'Übersicht Schützen'!O2","v":313.7},{"$f":"'Übersicht Schützen'!P2","v":316.8},{"$f":"'Übersicht Schützen'!Q2","v":{"v":0,"d":"0.0"}},315.76,{"$f":"SUM(L17:Q17)","v":{"v":1578.8,"d":"1,578.8"}},{"$f":"'Übersicht Schützen'!U2","v":{"v":315.58181818181816,"d":"315.58"}},{"$f":"SUM(K17+S17)","v":{"v":3471.3999999999996,"d":"3,471.4"}}]
[2,{"$f":"'Übersicht Schützen'!A3","v":"Schlarmann, Lena"},{"$f":"'Übersicht Schützen'!B3","v":"Esterwegen V"},{"$f":"'Übersicht Schützen'!C3","v":311.4},{"$f":"'Übersicht Schützen'!D3","v":{"v":312,"d":"312.0"}},{"$f":"'Übersicht Schützen'!E3","v":309.8},{"$f":"'Übersicht Schützen'!F3","v":{"v":310,"d":"310.0"}},{"$f":"'Übersicht Schützen'!G3","v":311.3},{"$f":"'Übersicht Schützen'!H3","v":{"v":311,"d":"311.0"}},{"$f":"'Übersicht Schützen'!I3","v":{"v":310.9166666666667,"d":"310.92"}},{"$f":"SUM(D18:I18)","v":{"v":1865.5,"d":"1,865.5"}},{"$f":"'Übersicht Schützen'!L3","v":311.5},{"$f":"'Übersicht Schützen'!M3","v":312.6},{"$f":"'Übersicht Schützen'!N3","v":304.5},{"$f":"'Übersicht Schützen'!O3","v":312.6},{"$f":"'Übersicht Schützen'!P3","v":309.2},{"$f":"'Übersicht Schützen'!Q3","v":{"v":0,"d":"0.0"}},{"$f":"IF(Formelhilfe!O10=0,0,'Übersicht Schützen'!R3)","v":{"v":310.08000000000004,"d":"310.08"}},{"$f":"SUM(L18:Q18)","v":{"v":1550.4,"d":"1,550.4"}},{"$f":"'Übersicht Schützen'!U3","v":{"v":310.5363636363636,"d":"310.54"}},{"$f":"SUM(K18+S18)","v":{"v":3415.9,"d":"3,415.9"}},{"$f":"(U17-U18)*-1","v":{"v":-55.499999999999545,"d":"-55.5"}}]
[3,{"$f":"'Übersicht Schützen'!A4","v":"Thien, Marita"},{"$f":"'Übersicht Schützen'!B4","v":"Lahn IV"},{"$f":"'Übersicht Schützen'!C4","v":308.6},{"$f":"'Übersicht Schützen'!D4","v":306.7},{"$f":"'Übersicht Schützen'!E4","v":306.4},{"$f":"'Übersicht Schützen'!F4","v":{"v":309,"d":"309.0"}},{"$f":"'Übersicht Schützen'!G4","v":311.7},{"$f":"'Übersicht Schützen'!H4","v":309.5},{"$f":"'Übersicht Schützen'!I4","v":308.65},{"$f":"SUM(D19:I19)","v":{"v":1851.8999999999999,"d":"1,851.9"}},{"$f":"'Übersicht Schützen'!L4","v":311.2},{"$f":"'Übersicht Schützen'!M4","v":312.3},{"$f":"'Übersicht Schützen'!N4","v":310.3},{"$f":"'Übersicht Schützen'!O4","v":311.7},{"$f":"'Übersicht Schützen'!P4","v":{"v":312,"d":"312.0"}},{"$f":"'Übersicht Schützen'!Q4","v":{"v":0,"d":"0.0"}},{"$f":"IF(Formelhilfe!O11=0,0,'Übersicht Schützen'!R4)","v":{"v":311.5,"d":"311.50"}},{"v":1557.5,"d":"1,557.5"},{"$f":"'Übersicht Schützen'!U4","v":{"v":309.94545454545454,"d":"309.95"}},{"v":3409.3999999999996,"d":"3,409.4"},{"$f":"(U18-U19)*-1","v":{"v":-6.500000000000455,"d":"-6.5"}}]
[4,{"$f":"'Übersicht Schützen'!A5","v":"Willoh, Henrika"},{"$f":"'Übersicht Schützen'!B5","v":"Lahn III"},{"$f":"'Übersicht Schützen'!C5","v":309.3},{"$f":"'Übersicht Schützen'!D5","v":309.3},{"$f":"'Übersicht Schützen'!E5","v":308.1},{"$f":"'Übersicht Schützen'!F5","v":310.7},{"$f":"'Übersicht Schützen'!G5","v":310.3},{"$f":"'Übersicht Schützen'!H5","v":309.2},{"$f":"'Übersicht Schützen'!I5","v":{"v":309.48333333333335,"d":"309.48"}},{"v":1856.9,"d":"1,856.9"},{"$f":"'Übersicht Schützen'!L5","v":306.4},{"$f":"'Übersicht Schützen'!M5","v":309.8},{"$f":"'Übersicht Schützen'!N5","v":310.4},{"$f":"'Übersicht Schützen'!O5","v":312.2},{"$f":"'Übersicht Schützen'!P5","v":311.1},{"$f":"'Übersicht Schützen'!Q5","v":{"v":0,"d":"0.0"}},{"$f":"IF(Formelhilfe!O12=0,0,'Übersicht Schützen'!R5)","v":309.98},{"v":1549.9,"d":"1,549.9"},{"$f":"'Übersicht Schützen'!U5","v":{"v":309.70909090909095,"d":"309.71"}},{"v":3406.8,"d":"3,406.8"},{"v":-2.5999999999994543,"d":"-2.6"}]
[5,{"$f":"'Übersicht Schützen'!A6","v":"Terhalle, Johanna"},{"$f":"'Übersicht Schützen'!B6","v":"Börger III"},{"$f":"'Übersicht Schützen'!C6","v":311.4},{"$f":"'Übersicht Schützen'!D6","v":308.8},{"$f":"'Übersicht Schützen'!E6","v":305.2},{"$f":"'Übersicht Schützen'!F6","v":309.4},{"$f":"'Übersicht Schützen'!G6","v":311.4},{"$f":"'Übersicht Schützen'!H6","v":{"v":309,"d":"309.0"}},{"$f":"'Übersicht Schützen'!I6","v":{"v":309.20000000000005,"d":"309.20"}},{"v":1855.2000000000003,"d":"1,855.2"},{"$f":"'Übersicht Schützen'!L6","v":311.9},{"$f":"'Übersicht Schützen'!M6","v":309.3},{"$f":"'Übersicht Schützen'!N6","v":309.1},{"$f":"'Übersicht Schützen'!O6","v":304.5},{"$f":"'Übersicht Schützen'!P6","v":309.4},{"$f":"'Übersicht Schützen'!Q6","v":{"v":0,"d":"0.0"}},{"$f":"IF(Formelhilfe!O13=0,0,'Übersicht Schützen'!R6)","v":{"v":308.84000000000003,"d":"308.84"}},{"v":1544.2000000000003,"d":"1,544.2"},{"$f":"'Übersicht Schützen'!U6","v":{"v":309.03636363636366,"d":"309.04"}},{"v":3399.4000000000005,"d":"3,399.4"},{"v":-7.399999999999636,"d":"-7.4"}]
[6,{"$f":"'Übersicht Schützen'!A7","v":"Pohlgeers, Margret"},{"$f":"'Übersicht Schützen'!B7","v":"Börger II"},{"$f":"'Übersicht Schützen'!C7","v":307.4},{"$f":"'Übersicht Schützen'!D7","v":307.7},{"$f":"'Übersicht Schützen'!E7","v":308.1},{"$f":"'Übersicht Schützen'!F7","v":307.5},{"$f":"'Übersicht Schützen'!G7","v":309.3},{"$f":"'Übersicht Schützen'!H7","v":312.4},{"$f":"'Übersicht Schützen'!I7","v":{"v":308.7333333333333,"d":"308.73"}},{"v":1852.3999999999996,"d":"1,852.4"},{"$f":"'Übersicht Schützen'!L7","v":308.6},{"$f":"'Übersicht Schützen'!M7","v":308.7},{"$f":"'Übersicht Schützen'!N7","v":{"v":309,"d":"309.0"}},{"$f":"'Übersicht Schützen'!O7","v":309.2},{"$f":"'Übersicht Schützen'!P7","v":311.4},{"$f":"'Übersicht Schützen'!Q7","v":{"v":0,"d":"0.0"}},309.38,{"v":1546.9,"d":"1,546.9"},{"$f":"'Übersicht Schützen'!U7","v":{"v":309.02727272727265,"d":"309.03"}},{"v":3399.2999999999997,"d":"3,399.3"},{"v":-0.10000000000081855,"d":"-0.1"}]
[7,{"$f":"'Übersicht Schützen'!A8","v":"Thunert, Silvia"},{"$f":"'Übersicht Schützen'!B8","v":"Neuvrees II"},{"$f":"'Übersicht Schützen'!C8","v":310.8},{"$f":"'Übersicht Schützen'!D8","v":307.4},{"$f":"'Übersicht Schützen'!E8","v":310.9},{"$f":"'Übersicht Schützen'!F8","v":308.4},{"$f":"'Übersicht Schützen'!G8","v":308.3},{"$f":"'Übersicht Schützen'!H8","v":306.7},{"$f":"'Übersicht Schützen'!I8","v":308.75},{"v":1852.5,"d":"1,852.5"},{"$f":"'Übersicht Schützen'!L8","v":309.5},{"$f":"'Übersicht Schützen'!M8","v":306.6},{"$f":"'Übersicht Schützen'!N8","v":306.9},{"$f":"'Übersicht Schützen'!O8","v":307.9},{"$f":"'Übersicht Schützen'!P8","v":313.9},{"$f":"'Übersicht Schützen'!Q8","v":{"v":0,"d":"0.0"}},{"$f":"IF(Formelhilfe!O15=0,0,'Übersicht Schützen'!R8)","v":{"v":308.96000000000004,"d":"308.96"}},{"v":1544.8000000000002,"d":"1,544.8"},{"$f":"'Übersicht Schützen'!U8","v":{"v":308.8454545454546,"d":"308.85"}},{"v":3397.3,"d":"3,397.3"},{"v":-1.9999999999995453,"d":"-2.0"}]
[8,{"$f":"'Übersicht Schützen'!A9","v":"Lindemann, Kerstin"},{"$f":"'Übersicht Schützen'!B9","v":"Esterwegen V"},{"$f":"'Übersicht Schützen'!C9","v":306.3},{"$f":"'Übersicht Schützen'!D9","v":310.6},{"$f":"'Übersicht Schützen'!E9","v":310.4},{"$f":"'Übersicht Schützen'!F9","v":{"v":309,"d":"309.0"}},{"$f":"'Übersicht Schützen'!G9","v":307.9},{"$f":"'Übersicht Schützen'!H9","v":306.6},{"$f":"'Übersicht Schützen'!I9","v":{"v":308.4666666666667,"d":"308.47"}},{"v":1850.8000000000002,"d":"1,850.8"},{"$f":"'Übersicht Schützen'!L9","v":310.5},{"$f":"'Übersicht Schützen'!M9","v":309.3},{"$f":"'Übersicht Schützen'!N9","v":307.5},{"$f":"'Übersicht Schützen'!O9","v":311.5},{"$f":"'Übersicht Schützen'!P9","v":305.7},{"$f":"'Übersicht Schützen'!Q9","v":{"v":0,"d":"0.0"}},{"$f":"IF(Formelhilfe!O16=0,0,'Übersicht Schützen'!R9)","v":{"v":308.9,"d":"308.90"}},{"v":1544.5,"d":"1,544.5"},{"$f":"'Übersicht Schützen'!U9","v":{"v":308.6636363636364,"d":"308.66"}},{"v":3395.3,"d":"3,395.3"},{"v":-2,"d":"-2.0"}]
[9,{"$f":"'Übersicht Schützen'!A10","v":"Reinelt, Michaela"},{"$f":"'Übersicht Schützen'!B10","v":"Lahn IV"},{"$f":"'Übersicht Schützen'!C10","v":310.8},{"$f":"'Übersicht Schützen'!D10","v":303.6},{"$f":"'Übersicht Schützen'!E10","v":307.4},{"$f":"'Übersicht Schützen'!F10","v":309.1},{"$f":"'Übersicht Schützen'!G10","v":310.8},{"$f":"'Übersicht Schützen'!H10","v":310.3},{"$f":"'Übersicht Schützen'!I10","v":{"v":308.6666666666667,"d":"308.67"}},{"v":1852,"d":"1,852.0"},{"$f":"'Übersicht Schützen'!L10","v":308.2},{"$f":"'Übersicht Schützen'!M10","v":307.7},{"$f":"'Übersicht Schützen'!N10","v":310.2},{"$f":"'Übersicht Schützen'!O10","v":308.8},{"$f":"'Übersicht Schützen'!P10","v":308.2},{"$f":"'Übersicht Schützen'!Q10","v":{"v":0,"d":"0.0"}},{"$f":"IF(Formelhilfe!O17=0,0,'Übersicht Schützen'!R10)","v":308.62},{"v":1543.1,"d":"1,543.1"},{"$f":"'Übersicht Schützen'!U10","v":{"v":308.64545454545447,"d":"308.65"}},{"v":3395.1,"d":"3,395.1"},{"v":-0.20000000000027285,"d":"-0.2"}]
[10,{"$f":"'Übersicht Schützen'!A11","v":"Thyen, Christel"},{"$f":"'Übersicht Schützen'!B11","v":"Lahn III"},{"$f":"'Übersicht Schützen'!C11","v":309.9},{"$f":"'Übersicht Schützen'!D11","v":{"v":299,"d":"299.0"}},{"$f":"'Übersicht Schützen'!E11","v":307.2},{"$f":"'Übersicht Schützen'!F11","v":{"v":313,"d":"313.0"}},{"$f":"'Übersicht Schützen'!G11","v":314.8},{"$f":"'Übersicht Schützen'!H11","v":308.1},{"$f":"'Übersicht Schützen'!I11","v":{"v":308.6666666666667,"d":"308.67"}},{"v":1852,"d":"1,852.0"},{"$f":"'Übersicht Schützen'!L11","v":313.4},{"$f":"'Übersicht Schützen'!M11","v":306.1},{"$f":"'Übersicht Schützen'!N11","v":305.7},{"$f":"'Übersicht Schützen'!O11","v":308.8},{"$f":"'Übersicht Schützen'!P11","v":305.8},{"$f":"'Übersicht Schützen'!Q11","v":{"v":0,"d":"0.0"}},{"$f":"IF(Formelhilfe!O18=0,0,'Übersicht Schützen'!R11)","v":307.96},{"v":1539.8,"d":"1,539.8"},{"$f":"'Übersicht Schützen'!U11","v":{"v":308.3454545454546,"d":"308.35"}},{"v":3391.8,"d":"3,391.8"},{"v":-3.299999999999727,"d":"-3.3"}]
[11,{"$f":"'Übersicht Schützen'!A12","v":"Robben, Anja"},{"$f":"'Übersicht Schützen'!B12","v":"Lahn IV"},{"$f":"'Übersicht Schützen'!C12","v":308.9},{"$f":"'Übersicht Schützen'!D12","v":307.7},{"$f":"'Übersicht Schützen'!E12","v":306.3},{"$f":"'Übersicht Schützen'!F12","v":307.3},{"$f":"'Übersicht Schützen'!G12","v":{"v":308,"d":"308.0"}},{"$f":"'Übersicht Schützen'!H12","v":{"v":309,"d":"309.0"}},{"$f":"'Übersicht Schützen'!I12","v":{"v":307.8666666666666,"d":"307.87"}},{"v":1847.1999999999998,"d":"1,847.2"},{"$f":"'Übersicht Schützen'!L12","v":306.2},{"$f":"'Übersicht Schützen'!M12","v":304.4},{"$f":"'Übersicht Schützen'!N12","v":307.9},{"$f":"'Übersicht Schützen'!O12","v":314.5},{"$f":"'Übersicht Schützen'!P12","v":304.8},{"$f":"'Übersicht Schützen'!Q12","v":{"v":0,"d":"0.0"}},{"$f":"IF(Formelhilfe!O19=0,0,'Übersicht Schützen'!R12)","v":307.56},{"v":1537.8,"d":"1,537.8"},{"$f":"'Übersicht Schützen'!U12","v":{"v":307.72727272727275,"d":"307.73"}},{"v":3385,"d":"3,385.0"},{"v":-6.800000000000182,"d":"-6.8"}]
[12,{"$f":"'Übersicht Schützen'!A13","v":"Jansen, Elisabeth"},{"$f":"'Übersicht Schützen'!B13","v":"Börger II"},{"$f":"'Übersicht Schützen'!C13","v":308.4},{"$f":"'Übersicht Schützen'!D13","v":303.7},{"$f":"'Übersicht Schützen'!E13","v":301.8},{"$f":"'Übersicht Schützen'!F13","v":307.5},{"$f":"'Übersicht Schützen'!G13","v":306.7},{"$f":"'Übersicht Schützen'!H13","v":311.6},{"$f":"'Übersicht Schützen'!I13","v":{"v":306.6166666666666,"d":"306.62"}},{"v":1839.6999999999998,"d":"1,839.7"},{"$f":"'Übersicht Schützen'!L13","v":306.6},{"$f":"'Übersicht Schützen'!M13","v":308.9},{"$f":"'Übersicht Schützen'!N13","v":307.3},{"$f":"'Übersicht Schützen'!O13","v":306.6},{"$f":"'Übersicht Schützen'!P13","v":306.7},{"$f":"'Übersicht Schützen'!Q13","v":{"v":0,"d":"0.0"}},307.22,{"v":1536.1000000000001,"d":"1,536.1"},{"$f":"'Übersicht Schützen'!U13","v":{"v":306.8909090909091,"d":"306.89"}},{"v":3375.8,"d":"3,375.8"},{"v":-9.199999999999818,"d":"-9.2"}]
[13,{"$f":"'Übersicht Schützen'!A14","v":"Kuchta, Gertrud"},{"$f":"'Übersicht Schützen'!B14","v":"Börger III"},{"$f":"'Übersicht Schützen'!C14","v":311.3},{"$f":"'Übersicht Schützen'!D14","v":308.9},{"$f":"'Übersicht Schützen'!E14","v":{"v":305,"d":"305.0"}},{"$f":"'Übersicht Schützen'!F14","v":299.6},{"$f":"'Übersicht Schützen'!G14","v":306.5},{"$f":"'Übersicht Schützen'!H14","v":304.3},{"$f":"'Übersicht Schützen'!I14","v":{"v":305.93333333333334,"d":"305.93"}},{"v":1835.6000000000001,"d":"1,835.6"},{"$f":"'Übersicht Schützen'!L14","v":306.7},{"$f":"'Übersicht Schützen'!M14","v":303.4},{"$f":"'Übersicht Schützen'!N14","v":311.1},{"$f":"'Übersicht Schützen'!O14","v":{"v":307,"d":"307.0"}},{"$f":"'Übersicht Schützen'!P14","v":308.4},{"$f":"'Übersicht Schützen'!Q14","v":{"v":0,"d":"0.0"}},{"$f":"IF(Formelhilfe!O21=0,0,'Übersicht Schützen'!R14)","v":307.32},{"v":1536.6,"d":"1,536.6"},{"$f":"'Übersicht Schützen'!U14","v":{"v":306.56363636363636,"d":"306.56"}},{"v":3372.2,"d":"3,372.2"},{"v":-3.600000000000364,"d":"-3.6"}]
[14,{"$f":"'Übersicht Schützen'!A15","v":"Wilken, Elena"},{"$f":"'Übersicht Schützen'!B15","v":"Lahn III"},{"$f":"'Übersicht Schützen'!C15","v":310.9},{"$f":"'Übersicht Schützen'!D15","v":304.6},{"$f":"'Übersicht Schützen'!E15","v":302.2},{"$f":"'Übersicht Schützen'!F15","v":309.7},{"$f":"'Übersicht Schützen'!G15","v":306.8},{"$f":"'Übersicht Schützen'!H15","v":304.1},{"$f":"'Übersicht Schützen'!I15","v":{"v":306.3833333333334,"d":"306.38"}},{"v":1838.3000000000002,"d":"1,838.3"},{"$f":"'Übersicht Schützen'!L15","v":311.7},{"$f":"'Übersicht Schützen'!M15","v":{"v":305,"d":"305.0"}},{"$f":"'Übersicht Schützen'!N15","v":308.5},{"$f":"'Übersicht Schützen'!O15","v":301.4},{"$f":"'Übersicht Schützen'!P15","v":{"v":307,"d":"307.0"}},{"$f":"'Übersicht Schützen'!Q15","v":{"v":0,"d":"0.0"}},{"$f":"IF(Formelhilfe!O22=0,0,'Übersicht Schützen'!R15)","v":{"v":306.71999999999997,"d":"306.72"}},{"v":1533.6,"d":"1,533.6"},{"$f":"'Übersicht Schützen'!U15","v":{"v":306.53636363636366,"d":"306.54"}},{"v":3371.9,"d":"3,371.9"},{"v":-0.29999999999972715,"d":"-0.3"}]
[15,{"$f":"'Übersicht Schützen'!A16","v":"Pohlgeers, Silvia"},{"$f":"'Übersicht Schützen'!B16","v":"Börger II"},{"$f":"'Übersicht Schützen'!C16","v":302.3},{"$f":"'Übersicht Schützen'!D16","v":305.9},{"$f":"'Übersicht Schützen'!E16","v":302.6},{"$f":"'Übersicht Schützen'!F16","v":310.9},{"$f":"'Übersicht Schützen'!G16","v":308.4},{"$f":"'Übersicht Schützen'!H16","v":306.4},{"$f":"'Übersicht Schützen'!I16","v":{"v":306.0833333333333,"d":"306.08"}},{"v":1836.5,"d":"1,836.5"},{"$f":"'Übersicht Schützen'!L16","v":308.4},{"$f":"'Übersicht Schützen'!M16","v":305.6},{"$f":"'Übersicht Schützen'!N16","v":303.3},{"$f":"'Übersicht Schützen'!O16","v":306.3},{"$f":"'Übersicht Schützen'!P16","v":311.3},{"$f":"'Übersicht Schützen'!Q16","v":{"v":0,"d":"0.0"}},{"$f":"IF(Formelhilfe!O23=0,0,'Übersicht Schützen'!R16)","v":{"v":306.97999999999996,"d":"306.98"}},{"v":1534.8999999999999,"d":"1,534.9"},{"$f":"'Übersicht Schützen'!U16","v":{"v":306.49090909090916,"d":"306.49"}},{"v":3371.3999999999996,"d":"3,371.4"},{"v":-0.5000000000004547,"d":"-0.5"}]
[16,{"$f":"'Übersicht Schützen'!A17","v":"Hackstette, Lena"},{"$f":"'Übersicht Schützen'!B17","v":"Lahn III"},{"$f":"'Übersicht Schützen'!C17","v":308.9},{"$f":"'Übersicht Schützen'!D17","v":303.8},{"$f":"'Übersicht Schützen'!E17","v":310.2},{"$f":"'Übersicht Schützen'!F17","v":301.9},{"$f":"'Übersicht Schützen'!G17","v":307.4},{"$f":"'Übersicht Schützen'!H17","v":{"v":306,"d":"306.0"}},{"$f":"'Übersicht Schützen'!I17","v":{"v":306.36666666666673,"d":"306.37"}},{"v":1838.2000000000003,"d":"1,838.2"},{"$f":"'Übersicht Schützen'!L17","v":301.9},{"$f":"'Übersicht Schützen'!M17","v":309.4},{"$f":"'Übersicht Schützen'!N17","v":305.6},{"$f":"'Übersicht Schützen'!O17","v":307.8},{"$f":"'Übersicht Schützen'!P17","v":304.6},{"$f":"'Übersicht Schützen'!Q17","v":{"v":0,"d":"0.0"}},{"$f":"IF(Formelhilfe!O24=0,0,'Übersicht Schützen'!R17)","v":305.86},{"v":1529.3000000000002,"d":"1,529.3"},{"$f":"'Übersicht Schützen'!U17","v":{"v":306.1363636363637,"d":"306.14"}},{"v":3367.5000000000005,"d":"3,367.5"},{"v":-3.8999999999991815,"d":"-3.9"}]
[17,{"$f":"'Übersicht Schützen'!A18","v":"Pohlmann, Margret"},{"$f":"'Übersicht Schützen'!B18","v":"Neuvrees II"},{"$f":"'Übersicht Schützen'!C18","v":{"v":297,"d":"297.0"}},{"$f":"'Übersicht Schützen'!D18","v":305.5},{"$f":"'Übersicht Schützen'!E18","v":303.5},{"$f":"'Übersicht Schützen'!F18","v":307.8},{"$f":"'Übersicht Schützen'!G18","v":309.1},{"$f":"'Übersicht Schützen'!H18","v":{"v":303,"d":"303.0"}},{"$f":"'Übersicht Schützen'!I18","v":{"v":304.31666666666666,"d":"304.32"}},{"v":1825.9,"d":"1,825.9"},{"$f":"'Übersicht Schützen'!L18","v":309.9},{"$f":"'Übersicht Schützen'!M18","v":305.1},{"$f":"'Übersicht Schützen'!N18","v":308.4},{"$f":"'Übersicht Schützen'!O18","v":308.6},{"$f":"'Übersicht Schützen'!P18","v":306.4},{"$f":"'Übersicht Schützen'!Q18","v":{"v":0,"d":"0.0"}},{"$f":"IF(Formelhilfe!O25=0,0,'Übersicht Schützen'!R18)","v":307.68},{"v":1538.4,"d":"1,538.4"},{"$f":"'Übersicht Schützen'!U18","v":{"v":305.8454545454546,"d":"305.85"}},{"v":3364.3,"d":"3,364.3"},{"v":-3.200000000000273,"d":"-3.2"}]
[18,{"$f":"'Übersicht Schützen'!A19","v":"Ostermann, Hildegard"},{"$f":"'Übersicht Schützen'!B19","v":"Lahn III"},{"$f":"'Übersicht Schützen'!C19","v":309.3},{"$f":"'Übersicht Schützen'!D19","v":305.1},{"$f":"'Übersicht Schützen'!E19","v":307.4},{"$f":"'Übersicht Schützen'!F19","v":309.7},{"$f":"'Übersicht Schützen'!G19","v":312.1},{"$f":"'Übersicht Schützen'!H19","v":306.3},{"$f":"'Übersicht Schützen'!I19","v":{"v":308.31666666666666,"d":"308.32"}},{"v":1849.8999999999999,"d":"1,849.9"},{"$f":"'Übersicht Schützen'!L19","v":299.3},{"$f":"'Übersicht Schützen'!M19","v":306.1},{"$f":"'Übersicht Schützen'!N19","v":301.4},{"$f":"'Übersicht Schützen'!O19","v":302.8},{"$f":"'Übersicht Schützen'!P19","v":302.7},{"$f":"'Übersicht Schützen'!Q19","v":{"v":0,"d":"0.0"}},{"$f":"IF(Formelhilfe!O26=0,0,'Übersicht Schützen'!R19)","v":{"v":302.46000000000004,"d":"302.46"}},{"v":1512.3000000000002,"d":"1,512.3"},{"$f":"'Übersicht Schützen'!U19","v":{"v":305.6545454545454,"d":"305.65"}},{"v":3362.2,"d":"3,362.2"},{"v":-2.100000000000364,"d":"-2.1"}]
[19,{"$f":"'Übersicht Schützen'!A20","v":"Hanneken, Doris"},{"$f":"'Übersicht Schützen'!B20","v":"Lahn IV"},{"$f":"'Übersicht Schützen'!C20","v":305.2},{"$f":"'Übersicht Schützen'!D20","v":304.8},{"$f":"'Übersicht Schützen'!E20","v":305.7},{"$f":"'Übersicht Schützen'!F20","v":{"v":307,"d":"307.0"}},{"$f":"'Übersicht Schützen'!G20","v":307.5},{"$f":"'Übersicht Schützen'!H20","v":309.8},{"$f":"'Übersicht Schützen'!I20","v":{"v":306.6666666666667,"d":"306.67"}},{"v":1840,"d":"1,840.0"},{"$f":"'Übersicht Schützen'!L20","v":{"v":300,"d":"300.0"}},{"$f":"'Übersicht Schützen'!M20","v":302.8},{"$f":"'Übersicht Schützen'!N20","v":303.9},{"$f":"'Übersicht Schützen'!O20","v":296.9},{"$f":"'Übersicht Schützen'!P20","v":303.4},{"$f":"'Übersicht Schützen'!Q20","v":{"v":0,"d":"0.0"}},{"$f":"IF(Formelhilfe!O27=0,0,'Übersicht Schützen'!R20)","v":{"v":301.4,"d":"301.40"}},{"v":1507,"d":"1,507.0"},{"$f":"'Übersicht Schützen'!U20","v":{"v":304.2727272727273,"d":"304.27"}},{"v":3347,"d":"3,347.0"},{"v":-15.199999999999818,"d":"-15.2"}]
[20,{"$f":"'Übersicht Schützen'!A21","v":"Müller, Anita"},{"$f":"'Übersicht Schützen'!B21","v":"Lahn III"},{"$f":"'Übersicht Schützen'!C21","v":306.6},{"$f":"'Übersicht Schützen'!D21","v":298.5},{"$f":"'Übersicht Schützen'!E21","v":299.5},{"$f":"'Übersicht Schützen'!F21","v":305.3},{"$f":"'Übersicht Schützen'!G21","v":305.4},{"$f":"'Übersicht Schützen'!H21","v":{"v":304,"d":"304.0"}},{"$f":"'Übersicht Schützen'!I21","v":{"v":303.2166666666667,"d":"303.22"}},{"v":1819.3000000000002,"d":"1,819.3"},{"$f":"'Übersicht Schützen'!L21","v":301.3},{"$f":"'Übersicht Schützen'!M21","v":306.6},{"$f":"'Übersicht Schützen'!N21","v":{"v":304,"d":"304.0"}},{"$f":"'Übersicht Schützen'!O21","v":305.1},{"$f":"'Übersicht Schützen'!P21","v":305.7},{"$f":"'Übersicht Schützen'!Q21","v":{"v":0,"d":"0.0"}},{"$f":"IF(Formelhilfe!O28=0,0,'Übersicht Schützen'!R21)","v":304.54},{"v":1522.7,"d":"1,522.7"},{"$f":"'Übersicht Schützen'!U21","v":{"v":303.8181818181818,"d":"303.82"}},{"v":3342,"d":"3,342.0"},{"v":-5,"d":"-5.0"}]
[21,{"$f":"'Übersicht Schützen'!A22","v":"Büter, Daniela"},{"$f":"'Übersicht Schützen'!B22","v":"Esterwegen V"},{"$f":"'Übersicht Schützen'!C22","v":297.2},{"$f":"'Übersicht Schützen'!D22","v":302.8},{"$f":"'Übersicht Schützen'!E22","v":303.4},{"$f":"'Übersicht Schützen'!F22","v":309.3},{"$f":"'Übersicht Schützen'!G22","v":306.5},{"$f":"'Übersicht Schützen'!H22","v":300.6},{"$f":"'Übersicht Schützen'!I22","v":{"v":303.3,"d":"303.30"}},{"v":1819.8000000000002,"d":"1,819.8"},{"$f":"'Übersicht Schützen'!L22","v":303.6},{"$f":"'Übersicht Schützen'!M22","v":308.5},{"$f":"'Übersicht Schützen'!N22","v":295.8},{"$f":"'Übersicht Schützen'!O22","v":304.4},{"$f":"'Übersicht Schützen'!P22","v":308.2},{"$f":"'Übersicht Schützen'!Q22","v":{"v":0,"d":"0.0"}},{"$f":"IF(Formelhilfe!O29=0,0,'Übersicht Schützen'!R22)","v":{"v":304.1,"d":"304.10"}},{"v":1520.5000000000002,"d":"1,520.5"},{"$f":"'Übersicht Schützen'!U22","v":{"v":303.6636363636364,"d":"303.66"}},{"v":3340.3,"d":"3,340.3"},{"v":-1.699999999999818,"d":"-1.7"}]
[22,{"$f":"'Übersicht Schützen'!A23","v":"Geers, Christa"},{"$f":"'Übersicht Schützen'!B23","v":"Börger III"},{"$f":"'Übersicht Schützen'!C23","v":304.5},{"$f":"'Übersicht Schützen'!D23","v":297.1},{"$f":"'Übersicht Schützen'!E23","v":302.1},{"$f":"'Übersicht Schützen'!F23","v":{"v":311,"d":"311.0"}},{"$f":"'Übersicht Schützen'!G23","v":307.3},{"$f":"'Übersicht Schützen'!H23","v":303.7},{"$f":"'Übersicht Schützen'!I23","v":{"v":304.28333333333336,"d":"304.28"}},{"v":1825.7,"d":"1,825.7"},{"$f":"'Übersicht Schützen'!L23","v":306.2},{"$f":"'Übersicht Schützen'!M23","v":299.1},{"$f":"'Übersicht Schützen'!N23","v":305.2},{"$f":"'Übersicht Schützen'!O23","v":296.4},{"$f":"'Übersicht Schützen'!P23","v":301.9},{"$f":"'Übersicht Schützen'!Q23","v":{"v":0,"d":"0.0"}},{"$f":"IF(Formelhilfe!O30=0,0,'Übersicht Schützen'!R23)","v":{"v":301.76000000000005,"d":"301.76"}},{"v":1508.8000000000002,"d":"1,508.8"},{"$f":"'Übersicht Schützen'!U23","v":{"v":303.1363636363636,"d":"303.14"}},{"v":3334.5,"d":"3,334.5"},{"v":-5.800000000000182,"d":"-5.8"}]
[23,{"$f":"'Übersicht Schützen'!A24","v":"Jungsthöfel, Sabine"},{"$f":"'Übersicht Schützen'!B24","v":"Börger III"},{"$f":"'Übersicht Schützen'!C24","v":306.7},{"$f":"'Übersicht Schützen'!D24","v":306.3},{"$f":"'Übersicht Schützen'!E24","v":300.4},{"$f":"'Übersicht Schützen'!F24","v":299.9},{"$f":"'Übersicht Schützen'!G24","v":304.8},{"$f":"'Übersicht Schützen'!H24","v":299.2},{"$f":"'Übersicht Schützen'!I24","v":{"v":302.8833333333333,"d":"302.88"}},{"v":1817.3,"d":"1,817.3"},{"$f":"'Übersicht Schützen'!L24","v":307.4},{"$f":"'Übersicht Schützen'!M24","v":300.4},{"$f":"'Übersicht Schützen'!N24","v":298.1},{"$f":"'Übersicht Schützen'!O24","v":303.7},{"$f":"'Übersicht Schützen'!P24","v":296.4},{"$f":"'Übersicht Schützen'!Q24","v":{"v":0,"d":"0.0"}},{"$f":"IF(Formelhilfe!O31=0,0,'Übersicht Schützen'!R24)","v":{"v":301.2,"d":"301.20"}},{"v":1506,"d":"1,506.0"},{"$f":"'Übersicht Schützen'!U24","v":{"v":302.11818181818177,"d":"302.12"}},{"v":3323.3,"d":"3,323.3"},{"v":-11.199999999999818,"d":"-11.2"}]
[24,{"$f":"'Übersicht Schützen'!A25","v":"Evers, Claudia"},{"$f":"'Übersicht Schützen'!B25","v":"Neuvrees II"},{"$f":"'Übersicht Schützen'!C25","v":300.8},{"$f":"'Übersicht Schützen'!D25","v":306.3},{"$f":"'Übersicht Schützen'!E25","v":303.3},{"$f":"'Übersicht Schützen'!F25","v":299.9},{"$f":"'Übersicht Schützen'!G25","v":303.2},{"$f":"'Übersicht Schützen'!H25","v":300.9},{"$f":"'Übersicht Schützen'!I25","v":{"v":302.40000000000003,"d":"302.40"}},{"v":1814.4,"d":"1,814.4"},{"$f":"'Übersicht Schützen'!L25","v":301.3},{"$f":"'Übersicht Schützen'!M25","v":297.9},{"$f":"'Übersicht Schützen'!N25","v":302.6},{"$f":"'Übersicht Schützen'!O25","v":301.2},{"$f":"'Übersicht Schützen'!P25","v":303.7},{"$f":"'Übersicht Schützen'!Q25","v":{"v":0,"d":"0.0"}},{"$f":"IF(Formelhilfe!O32=0,0,'Übersicht Schützen'!R25)","v":{"v":301.34000000000003,"d":"301.34"}},{"v":1506.7,"d":"1,506.7"},{"$f":"'Übersicht Schützen'!U25","v":{"v":301.91818181818184,"d":"301.92"}},{"v":3321.1000000000004,"d":"3,321.1"},{"v":-2.199999999999818,"d":"-2.2"}]
[25,{"$f":"'Übersicht Schützen'!A26","v":"Oldopp, Maria"},{"$f":"'Übersicht Schützen'!B26","v":"Lahn IV"},{"$f":"'Übersicht Schützen'!C26","v":298.6},{"$f":"'Übersicht Schützen'!D26","v":{"v":301,"d":"301.0"}},{"$f":"'Übersicht Schützen'!E26","v":301.2},{"$f":"'Übersicht Schützen'!F26","v":299.6},{"$f":"'Übersicht Schützen'!G26","v":297.2},{"$f":"'Übersicht Schützen'!H26","v":{"v":299,"d":"299.0"}},{"$f":"'Übersicht Schützen'!I26","v":{"v":299.43333333333334,"d":"299.43"}},{"v":1796.6000000000001,"d":"1,796.6"},{"$f":"'Übersicht Schützen'!L26","v":300.2},{"$f":"'Übersicht Schützen'!M26","v":299.1},{"$f":"'Übersicht Schützen'!N26","v":{"v":302,"d":"302.0"}},{"$f":"'Übersicht Schützen'!O26","v":300.7},{"$f":"'Übersicht Schützen'!P26","v":298.2},{"$f":"'Übersicht Schützen'!Q26","v":{"v":0,"d":"0.0"}},{"$f":"IF(Formelhilfe!O33=0,0,'Übersicht Schützen'!R26)","v":300.04},{"v":1500.2,"d":"1,500.2"},{"$f":"'Übersicht Schützen'!U26","v":{"v":299.7090909090909,"d":"299.71"}},{"v":3296.8,"d":"3,296.8"},{"v":-24.300000000000182,"d":"-24.3"}]
[26,{"$f":"'Übersicht Schützen'!A27","v":"Krömer, Monika"},{"$f":"'Übersicht Schützen'!B27","v":"Börger II"},{"$f":"'Übersicht Schützen'!C27","v":302.4},{"$f":"'Übersicht Schützen'!D27","v":302.2},{"$f":"'Übersicht Schützen'!E27","v":301.8},{"$f":"'Übersicht Schützen'!F27","v":297.8},{"$f":"'Übersicht Schützen'!G27","v":294.7},{"$f":"'Übersicht Schützen'!H27","v":{"v":301,"d":"301.0"}},{"$f":"'Übersicht Schützen'!I27","v":{"v":299.9833333333333,"d":"299.98"}},{"v":1799.8999999999999,"d":"1,799.9"},{"$f":"'Übersicht Schützen'!L27","v":299.7},{"$f":"'Übersicht Schützen'!M27","v":292.8},{"$f":"'Übersicht Schützen'!N27","v":290.4},{"$f":"'Übersicht Schützen'!O27","v":292.8},{"$f":"'Übersicht Schützen'!P27","v":298.7},{"$f":"'Übersicht Schützen'!Q27","v":{"v":0,"d":"0.0"}},{"$f":"IF(Formelhilfe!O34=0,0,'Übersicht Schützen'!R27)","v":294.88},{"v":1474.4,"d":"1,474.4"},{"$f":"'Übersicht Schützen'!U27","v":{"v":297.6636363636364,"d":"297.66"}},{"v":3274.3,"d":"3,274.3"},-22.5]
[27,{"$f":"'Übersicht Schützen'!A28","v":"Junge, Silvia"},{"$f":"'Übersicht Schützen'!B28","v":"Neuvrees II"},{"$f":"'Übersicht Schützen'!C28","v":290.6},{"$f":"'Übersicht Schützen'!D28","v":302.2},{"$f":"'Übersicht Schützen'!E28","v":295.7},{"$f":"'Übersicht Schützen'!F28","v":279.3},{"$f":"'Übersicht Schützen'!G28","v":295.1},{"$f":"'Übersicht Schützen'!H28","v":298.9},{"$f":"'Übersicht Schützen'!I28","v":{"v":293.6333333333334,"d":"293.63"}},{"v":1761.8000000000002,"d":"1,761.8"},{"$f":"'Übersicht Schützen'!L28","v":292.8},{"$f":"'Übersicht Schützen'!M28","v":287.4},{"$f":"'Übersicht Schützen'!N28","v":305.4},{"$f":"'Übersicht Schützen'!O28","v":287.2},{"$f":"'Übersicht Schützen'!P28","v":{"v":292,"d":"292.0"}},{"$f":"'Übersicht Schützen'!Q28","v":{"v":0,"d":"0.0"}},{"$f":"IF(Formelhilfe!O35=0,0,'Übersicht Schützen'!R28)","v":292.96},{"v":1464.8,"d":"1,464.8"},{"$f":"'Übersicht Schützen'!U28","v":{"v":293.32727272727277,"d":"293.33"}},{"v":3226.6000000000004,"d":"3,226.6"},{"v":-47.69999999999982,"d":"-47.7"}]
[28,{"$f":"'Übersicht Schützen'!A29","v":"Lindemann, Stefanie"},{"$f":"'Übersicht Schützen'!B29","v":"Esterwegen V"},{"$f":"'Übersicht Schützen'!C29","v":306.1},{"$f":"'Übersicht Schützen'!D29","v":305.3},{"$f":"'Übersicht Schützen'!E29","v":308.4},{"$f":"'Übersicht Schützen'!F29","v":298.4},{"$f":"'Übersicht Schützen'!G29","v":303.1},{"$f":"'Übersicht Schützen'!H29","v":306.8},{"$f":"'Übersicht Schützen'!I29","v":{"v":304.68333333333334,"d":"304.68"}},{"v":1828.1000000000001,"d":"1,828.1"},{"$f":"'Übersicht Schützen'!L29","v":306.6},{"$f":"'Übersicht Schützen'!M29","v":310.6},{"$f":"'Übersicht Schützen'!N29","v":307.7},{"$f":"'Übersicht Schützen'!O29","v":300.9},{"$f":"'Übersicht Schützen'!P29","v":{"v":0,"d":"0.0"}},{"$f":"'Übersicht Schützen'!Q29","v":{"v":0,"d":"0.0"}},{"$f":"IF(Formelhilfe!O36=0,0,'Übersicht Schützen'!R29)","v":{"v":306.45000000000005,"d":"306.45"}},{"v":1225.8000000000002,"d":"1,225.8"},{"$f":"'Übersicht Schützen'!U29","v":305.39},{"v":3053.9000000000005,"d":"3,053.9"},{"v":-172.69999999999982,"d":"-172.7"}]
[29,{"$f":"'Übersicht Schützen'!A30","v":"Schwarte, Gundula"},{"$f":"'Übersicht Schützen'!B30","v":"Börger III"},{"$f":"'Übersicht Schützen'!C30","v":306.8},{"$f":"'Übersicht Schützen'!D30","v":304.3},{"$f":"'Übersicht Schützen'!E30","v":299.7},{"$f":"'Übersicht Schützen'!F30","v":{"v":0,"d":"0.0"}},{"$f":"'Übersicht Schützen'!G30","v":300.8},{"$f":"'Übersicht Schützen'!H30","v":302.4},{"$f":"'Übersicht Schützen'!I30","v":{"v":302.8,"d":"302.80"}},{"v":1514,"d":"1,514.0"},{"$f":"'Übersicht Schützen'!L30","v":300.6},{"$f":"'Übersicht Schützen'!M30","v":306.5},{"$f":"'Übersicht Schützen'!N30","v":301.9},{"$f":"'Übersicht Schützen'!O30","v":299.4},{"$f":"'Übersicht Schützen'!P30","v":303.8},{"$f":"'Übersicht Schützen'!Q30","v":{"v":0,"d":"0.0"}},{"$f":"IF(Formelhilfe!O37=0,0,'Übersicht Schützen'!R30)","v":302.44},{"v":1512.2,"d":"1,512.2"},{"$f":"'Übersicht Schützen'!U30","v":302.62},{"v":3026.2,"d":"3,026.2"},{"v":-27.700000000000728,"d":"-27.7"}]
[30,{"$f":"'Übersicht Schützen'!A31","v":"Remmers, Tanja"},{"$f":"'Übersicht Schützen'!B31","v":"Börger III"},{"$f":"'Übersicht Schützen'!C31","v":292.9},{"$f":"'Übersicht Schützen'!D31","v":294.5},{"$f":"'Übersicht Schützen'!E31","v":275.8},{"$f":"'Übersicht Schützen'!F31","v":290.6},{"$f":"'Übersicht Schützen'!G31","v":289.2},{"$f":"'Übersicht Schützen'!H31","v":{"v":0,"d":"0.0"}},{"$f":"'Übersicht Schützen'!I31","v":{"v":288.6,"d":"288.60"}},{"v":1443.0000000000002,"d":"1,443.0"},{"$f":"'Übersicht Schützen'!L31","v":290.7},{"$f":"'Übersicht Schützen'!M31","v":{"v":286,"d":"286.0"}},{"$f":"'Übersicht Schützen'!N31","v":301.8},{"$f":"'Übersicht Schützen'!O31","v":{"v":297,"d":"297.0"}},{"$f":"'Übersicht Schützen'!P31","v":297.2},{"$f":"'Übersicht Schützen'!Q31","v":{"v":0,"d":"0.0"}},{"$f":"IF(Formelhilfe!O38=0,0,'Übersicht Schützen'!R31)","v":294.54},{"v":1472.7,"d":"1,472.7"},{"$f":"'Übersicht Schützen'!U31","v":{"v":291.57000000000005,"d":"291.57"}},{"v":2915.7000000000003,"d":"2,915.7"},{"v":-110.49999999999955,"d":"-110.5"}]
[31,{"$f":"'Übersicht Schützen'!A32","v":"Preut, Susanne"},{"$f":"'Übersicht Schützen'!B32","v":"Neuvrees II"},{"$f":"'Übersicht Schützen'!C32","v":299.3},{"$f":"'Übersicht Schützen'!D32","v":304.9},{"$f":"'Übersicht Schützen'!E32","v":304.5},{"$f":"'Übersicht Schützen'!F32","v":308.4},{"$f":"'Übersicht Schützen'!G32","v":{"v":0,"d":"0.0"}},{"$f":"'Übersicht Schützen'!H32","v":300.4},{"$f":"'Übersicht Schützen'!I32","v":{"v":303.5,"d":"303.50"}},{"v":1517.5,"d":"1,517.5"},{"$f":"'Übersicht Schützen'!L32","v":303.2},{"$f":"'Übersicht Schützen'!M32","v":304.6},{"$f":"'Übersicht Schützen'!N32","v":{"v":0,"d":"0.0"}},{"$f":"'Übersicht Schützen'!O32","v":307.9},{"$f":"'Übersicht Schützen'!P32","v":297.8},{"$f":"'Übersicht Schützen'!Q32","v":{"v":0,"d":"0.0"}},{"$f":"IF(Formelhilfe!O39=0,0,'Übersicht Schützen'!R32)","v":{"v":303.375,"d":"303.38"}},{"v":1213.5,"d":"1,213.5"},{"$f":"'Übersicht Schützen'!U32","v":{"v":303.4444444444445,"d":"303.44"}},{"v":2731,"d":"2,731.0"},{"$f":"(U46-U47)*-1","v":{"v":-184.70000000000027,"d":"-184.7"}}]
[32,{"$f":"'Übersicht Schützen'!A33","v":"Eilermann, Saskia"},{"$f":"'Übersicht Schützen'!B33","v":"Neuvrees II"},{"$f":"'Übersicht Schützen'!C33","v":309.2},{"$f":"'Übersicht Schützen'!D33","v":310.2},{"$f":"'Übersicht Schützen'!E33","v":309.7},{"$f":"'Übersicht Schützen'!F33","v":{"v":0,"d":"0.0"}},{"$f":"'Übersicht Schützen'!G33","v":{"v":0,"d":"0.0"}},{"$f":"'Übersicht Schützen'!H33","v":311.2},{"$f":"'Übersicht Schützen'!I33","v":{"v":310.075,"d":"310.08"}},{"v":1240.3,"d":"1,240.3"},{"$f":"'Übersicht Schützen'!L33","v":{"v":0,"d":"0.0"}},{"$f":"'Übersicht Schützen'!M33","v":{"v":0,"d":"0.0"}},{"$f":"'Übersicht Schützen'!N33","v":310.3},{"$f":"'Übersicht Schützen'!O33","v":{"v":0,"d":"0.0"}},{"$f":"'Übersicht Schützen'!P33","v":312.5},{"$f":"'Übersicht Schützen'!Q33","v":{"v":0,"d":"0.0"}},{"$f":"IF(Formelhilfe!O40=0,0,'Übersicht Schützen'!R33)","v":{"v":311.4,"d":"311.40"}},622.8,{"$f":"'Übersicht Schützen'!U33","v":{"v":310.51666666666665,"d":"310.52"}},{"v":1863.1,"d":"1,863.1"},{"v":-867.9000000000001,"d":"-867.9"}]
[33,{"$f":"'Übersicht Schützen'!A34","v":"Schulte, Christina"},{"$f":"'Übersicht Schützen'!B34","v":"Neuvrees II"},{"$f":"'Übersicht Schützen'!C34","v":310.4},{"$f":"'Übersicht Schützen'!D34","v":305.7},{"$f":"'Übersicht Schützen'!E34","v":304.3},{"$f":"'Übersicht Schützen'!F34","v":308.4},{"$f":"'Übersicht Schützen'!G34","v":305.8},{"$f":"'Übersicht Schützen'!H34","v":{"v":0,"d":"0.0"}},{"$f":"'Übersicht Schützen'!I34","v":{"v":306.91999999999996,"d":"306.92"}},{"v":1534.5999999999997,"d":"1,534.6"},{"$f":"'Übersicht Schützen'!L34","v":303.1},{"$f":"'Übersicht Schützen'!M34","v":{"v":0,"d":"0.0"}},{"$f":"'Übersicht Schützen'!N34","v":{"v":0,"d":"0.0"}},{"$f":"'Übersicht Schützen'!O34","v":{"v":0,"d":"0.0"}},{"$f":"'Übersicht Schützen'!P34","v":{"v":0,"d":"0.0"}},{"$f":"'Übersicht Schützen'!Q34","v":{"v":0,"d":"0.0"}},{"$f":"IF(Formelhilfe!O41=0,0,'Übersicht Schützen'!R34)","v":{"v":303.1,"d":"303.10"}},303.1,{"$f":"'Übersicht Schützen'!U34","v":{"v":306.2833333333333,"d":"306.28"}},{"v":1837.6999999999998,"d":"1,837.7"},{"v":-25.40000000000009,"d":"-25.4"}]
[34,{"$f":"'Übersicht Schützen'!A35","v":"Kossenjans, Annegret"},{"$f":"'Übersicht Schützen'!B35","v":"Börger II"},{"$f":"'Übersicht Schützen'!C35","v":310.2},{"$f":"'Übersicht Schützen'!D35","v":304.8},{"$f":"'Übersicht Schützen'!E35","v":298.6},{"$f":"'Übersicht Schützen'!F35","v":307.4},{"$f":"'Übersicht Schützen'!G35","v":307.8},{"$f":"'Übersicht Schützen'!H35","v":301.9},{"$f":"'Übersicht Schützen'!I35","v":{"v":305.1166666666666,"d":"305.12"}},{"v":1830.6999999999998,"d":"1,830.7"},{"$f":"'Übersicht Schützen'!L35","v":{"v":0,"d":"0.0"}},{"$f":"'Übersicht Schützen'!M35","v":{"v":0,"d":"0.0"}},{"$f":"'Übersicht Schützen'!N35","v":{"v":0,"d":"0.0"}},{"$f":"'Übersicht Schützen'!O35","v":{"v":0,"d":"0.0"}},{"$f":"'Übersicht Schützen'!P35","v":{"v":0,"d":"0.0"}},{"$f":"'Übersicht Schützen'!Q35","v":{"v":0,"d":"0.0"}},{"v":0,"d":"0.00"},{"v":0,"d":"0.0"},{"$f":"'Übersicht Schützen'!U35","v":{"v":305.1166666666666,"d":"305.12"}},{"v":1830.6999999999998,"d":"1,830.7"},{"v":-7,"d":"-7.0"}]
[35,{"$f":"'Übersicht Schützen'!A36","v":"Lindemann, Annemarie"},{"$f":"'Übersicht Schützen'!B36","v":"Esterwegen V"},{"$f":"'Übersicht Schützen'!C36","v":297.9},{"$f":"'Übersicht Schützen'!D36","v":302.8},{"$f":"'Übersicht Schützen'!E36","v":302.7},{"$f":"'Übersicht Schützen'!F36","v":305.5},{"$f":"'Übersicht Schützen'!G36","v":306.3},{"$f":"'Übersicht Schützen'!H36","v":{"v":0,"d":"0.0"}},{"$f":"'Übersicht Schützen'!I36","v":303.04},{"v":1515.2,"d":"1,515.2"},{"$f":"'Übersicht Schützen'!L36","v":{"v":0,"d":"0.0"}},{"$f":"'Übersicht Schützen'!M36","v":{"v":0,"d":"0.0"}},{"$f":"'Übersicht Schützen'!N36","v":{"v":0,"d":"0.0"}},{"$f":"'Übersicht Schützen'!O36","v":{"v":0,"d":"0.0"}},{"$f":"'Übersicht Schützen'!P36","v":{"v":0,"d":"0.0"}},{"$f":"'Übersicht Schützen'!Q36","v":{"v":0,"d":"0.0"}},{"v":0,"d":"0.00"},{"v":0,"d":"0.0"},{"$f":"'Übersicht Schützen'!U36","v":303.04},{"v":1515.2,"d":"1,515.2"},{"$f":"(U50-U51)*-1","v":{"v":-315.4999999999998,"d":"-315.5"}}]
[36,{"$f":"'Übersicht Schützen'!A37","v":"Schwarte, Annette"},{"$f":"'Übersicht Schützen'!B37","v":"Börger II"},{"$f":"'Übersicht Schützen'!C37","v":{"v":0,"d":"0.0"}},{"$f":"'Übersicht Schützen'!D37","v":{"v":0,"d":"0.0"}},{"$f":"'Übersicht Schützen'!E37","v":{"v":0,"d":"0.0"}},{"$f":"'Übersicht Schützen'!F37","v":{"v":0,"d":"0.0"}},{"$f":"'Übersicht Schützen'!G37","v":{"v":0,"d":"0.0"}},{"$f":"'Übersicht Schützen'!H37","v":{"v":0,"d":"0.0"}},{"v":0,"d":"0.00"},{"v":0,"d":"0.0"},{"$f":"'Übersicht Schützen'!L37","v":{"v":0,"d":"0.0"}},{"$f":"'Übersicht Schützen'!M37","v":{"v":0,"d":"0.0"}},{"$f":"'Übersicht Schützen'!N37","v":{"v":0,"d":"0.0"}},{"$f":"'Übersicht Schützen'!O37","v":{"v":0,"d":"0.0"}},{"$f":"'Übersicht Schützen'!P37","v":{"v":0,"d":"0.0"}},{"$f":"'Übersicht Schützen'!Q37","v":{"v":0,"d":"0.0"}},{"v":0,"d":"0.00"},{"v":0,"d":"0.0"},{"v":0,"d":"0.00"},{"v":0,"d":"0.0"},{"v":-1515.2,"d":"-1,515.2"}]
[]
[null,null,"Schnitt:",{"$f":"SUM(D17:D52)/Formelhilfe!B45","v":{"v":305.7628571428572,"d":"305.8"}},{"$f":"SUM(E17:E52)/Formelhilfe!C45","v":{"v":305.1857142857143,"d":"305.2"}},{"$f":"SUM(F17:F52)/Formelhilfe!D45","v":{"v":304.10857142857145,"d":"304.1"}},{"$f":"SUM(G17:G52)/Formelhilfe!E45","v":{"v":305.5545454545454,"d":"305.6"}},{"$f":"SUM(H17:H52)/Formelhilfe!F45","v":{"v":306.4272727272727,"d":"306.4"}},{"$f":"SUM(I17:I52)/Formelhilfe!G45","v":{"v":305.90312499999993,"d":"305.9"}},{"$f":"AVERAGE(J17:J52)","v":{"v":296.92736111111117,"d":"296.93"}},{"$f":"AVERAGE(K17:K52)","v":{"v":1722.5361111111113,"d":"1722.54"}},{"$f":"SUM(L17:L52)/Formelhilfe!I45","v":{"v":305.459375,"d":"305.5"}},{"$f":"SUM(M17:M52)/Formelhilfe!J45","v":{"v":304.7612903225807,"d":"304.8"}},{"$f":"SUM(N17:N52)/Formelhilfe!K45","v":{"v":305.59354838709675,"d":"305.6"}},{"$f":"SUM(O17:O52)/Formelhilfe!L45","v":{"v":304.8225806451613,"d":"304.8"}},{"$f":"SUM(P17:P52)/Formelhilfe!M45","v":{"v":305.6419354838709,"d":"305.6"}},{"$f":"SUM(Q17:Q52)/Formelhilfe!N45","v":{"$error":"#DIV/0!"}},{"$f":"AVERAGE(R17:R52)","v":{"v":279.86958333333337,"d":"279.87"}},{"$f":"AVERAGE(S17:S52)","v":{"v":1322.7805555555556,"d":"1322.78"}},{"$f":"AVERAGE(T17:T52)","v":{"v":296.8830611672279,"d":"296.88"}},{"$f":"(K54+S54)","v":{"v":3045.3166666666666,"d":"3,045.32 "}}]

{"sheet":"Wettkampf 1","index":1,"n_rows":47,"n_cols":29,"rows_kept":47,"merged":[[0,24,0,25],[1,24,1,25],[4,24,4,25],[5,24,5,25],[6,24,6,25],[8,22,8,25]]}
[null,"Verein / Gruppe",null,"Ergebnisse",{"$nulls":19},"Austragungsort:",{"$f":"Übersicht!D4","v":"Börger"}]
[1,"Börger II",null,{"$f":"G46","v":{"v":925.9999999999999,"d":"926.0"}},{"$f":"IF(H46>4,\"Es sind zu viele Schützen in Wertung!\",\" \")","v":" "},{"$nulls":18},"Wettkampftag:",{"$f":"Übersicht!D3","v":"22.09."}]
[2,"Esterwegen V",null,{"$f":"I46","v":{"v":931.0999999999999,"d":"931.1"}},{"$f":"IF(J46>4,\"Es sind zu viele Schützen in Wertung!\",\" \")","v":" "}]
[3,"Neuvrees II",null,{"$f":"K46","v":919.3},{"$f":"IF(L46>4,\"Es sind zu viele Schützen in Wertung!\",\" \")","v":" "},{"$nulls":20},"Ansprechpartner für Rückfragen:"]
[4,"Lahn IV",null,{"$f":"M46","v":922.7},{"$f":"IF(N46>4,\"Es sind zu viele Schützen in Wertung!\",\" \")","v":" "},{"$nulls":18},"Name:","Pohlgeers, Margret"]
[5,"Börger III",null,{"$f":"O46","v":924.8},{"$f":"IF(P46>4,\"Es sind zu viele Schützen in Wertung!\",\" \")","v":" "},{"$nulls":18},"Tel:","059538976"]
[6,"Lahn III",null,{"$f":"Q46","v":928.5},{"$f":"IF(R46>4,\"Es sind zu viele Schützen in Wertung!\",\" \")","v":" "},{"$nulls":18},"Standaufsicht:","Pohlgeers, Margret"]
[]
[null,"Einzelergebnisse:","Verein/Gruppe (per Dropdown-Feld einzutragen)","Ergebnisse","AW? Dann x eintippen",null,"Verein 1",null,"Verein 2",null,"Verein 3",null,"Verein 4",null,"Verein 5",null,"Verein 6",{"$nulls":3},"Geburtsdatum",null,"Proberechnung bei Streifen:"]
[1,"Kossenjans, Annegret",{"$f":"B2","v":"Börger II"},310.2,null,{"$f":"IF(E10=\"x\",\"0\",D10)","v":310.2},{"$f":"IF(C10=$B$2,F10,0)","v":310.2},{"$f":"(IF(AND($E10=\"\",$C10=$B$2),1,0))","v":1},{"$f":"IF($C10=$B$3,F10,0)","v":0},{"$f":"(IF(AND($E10=\"\",$C10=$B$3),1,0))","v":0},{"$f":"IF($C10=$B$4,F10,0)","v":0},{"$f":"(IF(AND($E10=\"\",$C10=$B$4),1,0))","v":0},{"$f":"IF($C10=$B$5,F10,0)","v":0},{"$f":"(IF(AND($E10=\"\",$C10=$B$5),1,0))","v":0},{"$f":"IF($C10=$B$6,F10,0)","v":0},{"$f":"(IF(AND($E10=\"\",$C10=$B$6),1,0))","v":0},{"$f":"IF($C10=$B$7,F10,0)","v":0},{"$f":"(IF(AND($E10=\"\",$C10=$B$7),1,0))","v":0},{"$nulls":7},{"$f":"W10+X10+Y10","v":{"v":0,"d":"0.0"}},{"$f":"IF(Z10=D10,1,0)","v":0},{"$f":"IF(Z10=0,0,1)","v":0},{"$f":"IF(AA10+AB10=2,\"Korrekt\",\"\")","v":""}]
[2,"Jansen, Elisabeth",{"$f":"B2","v":"Börger II"},308.4,null,{"$f":"IF(E11=\"x\",\"0\",D11)","v":308.4},{"$f":"IF(C11=$B$2,F11,0)","v":308.4},{"$f":"(IF(AND($E11=\"\",$C11=$B$2),1,0))","v":1},{"$f":"IF($C11=$B$3,F11,0)","v":0},{"$f":"(IF(AND($E11=\"\",$C11=$B$3),1,0))","v":0},{"$f":"IF($C11=$B$4,F11,0)","v":0},{"$f":"(IF(AND($E11=\"\",$C11=$B$4),1,0))","v":0},{"$f":"IF($C11=$B$5,F11,0)","v":0},{"$f":"(IF(AND($E11=\"\",$C11=$B$5),1,0))","v":0},{"$f":"IF($C11=$B$6,F11,0)","v":0},{"$f":"(IF(AND($E11=\"\",$C11=$B$6),1,0))","v":0},{"$f":"IF($C11=$B$7,F11,0)","v":0},{"$f":"(IF(AND($E11=\"\",$C11=$B$7),1,0))","v":0},{"$nulls":7},{"$f":"W11+X11+Y11","v":{"v":0,"d":"0.0"}},{"$f":"IF(Z11=D11,1,0)","v":0},{"$f":"IF(Z11=0,0,1)","v":0},{"$f":"IF(AA11+AB11=2,\"Korrekt\",\"\")","v":""}]
[3,"Krömer, Monika",{"$f":"B2","v":"Börger II"},302.4,null,302.4,302.4,1,0,0,0,0,0,0,0,0,0,0,{"$nulls":7},{"v":0,"d":"0.0"},0,0,""]
[4,"Pohlgeers, Margret",{"$f":"B2","v":"Börger II"},307.4,null,307.4,307.4,1,0,0,0,0,0,0,0,0,0,0,{"$nulls":7},{"v":0,"d":"0.0"},0,0,""]
[5,"Pohlgeers, Silvia",{"$f":"B2","v":"Börger II"},302.3,"x","0","0",0,0,0,0,0,0,0,0,0,0,0,{"$nulls":7},{"v":0,"d":"0.0"},0,0,""]
[6,"Schwarte, Annette",{"$f":"B2","v":"Börger II"},null,"x","0","0",0,0,0,0,0,0,0,0,0,0,0,{"$nulls":7},{"v":0,"d":"0.0"},1,0,""]
[7,"Lindemann, Kerstin",{"$f":"B3","v":"Esterwegen V"},306.3,null,306.3,0,0,306.3,1,0,0,0,0,0,0,0,0,{"$nulls":7},{"v":0,"d":"0.0"},0,0,""]
[8,"Schlarmann, Lena",{"$f":"B3","v":"Esterwegen V"},311.4,null,311.4,0,0,311.4,1,0,0,0,0,0,0,0,0,{"$nulls":7},{"v":0,"d":"0.0"},0,0,""]
[9,"Lindemann, Stefanie",{"$f":"B3","v":"Esterwegen V"},306.1,null,306.1,0,0,306.1,1,0,0,0,0,0,0,0,0,{"$nulls":7},{"v":0,"d":"0.0"},0,0,""]
[10,"Lindemann, Rita",{"$f":"B3","v":"Esterwegen V"},313.4,null,313.4,0,0,313.4,1,0,0,0,0,0,0,0,0,{"$nulls":7},{"v":0,"d":"0.0"},0,0,""]
[11,"Büter, Daniela",{"$f":"B3","v":"Esterwegen V"},297.2,"x","0",0,0,"0",0,0,0,0,0,0,0,0,0,{"$nulls":7},{"v":0,"d":"0.0"},0,0,""]
[12,"Lindemann, Annemarie",{"$f":"B3","v":"Esterwegen V"},297.9,"x","0",0,0,"0",0,0,0,0,0,0,0,0,0,{"$nulls":7},{"v":0,"d":"0.0"},0,0,""]
[13,"Preut, Susanne",{"$f":"B4","v":"Neuvrees II"},299.3,null,299.3,0,0,0,0,299.3,1,0,0,0,0,0,0,{"$nulls":7},{"v":0,"d":"0.0"},0,0,""]
[14,"Thunert, Silvia",{"$f":"B4","v":"Neuvrees II"},310.8,null,310.8,0,0,0,0,310.8,1,0,0,0,0,0,0,{"$nulls":7},{"v":0,"d":"0.0"},0,0,""]
[15,"Pohlmann, Margret",{"$f":"B4","v":"Neuvrees II"},{"v":297,"d":"297.0"},null,297,0,0,0,0,297,1,0,0,0,0,0,0,{"$nulls":7},{"v":0,"d":"0.0"},0,0,""]
[16,"Eilermann, Saskia",{"$f":"B4","v":"Neuvrees II"},309.2,null,309.2,0,0,0,0,309.2,1,0,0,0,0,0,0,{"$nulls":7},{"v":0,"d":"0.0"},0,0,""]
[17,"Junge, Silvia",{"$f":"B4","v":"Neuvrees II"},290.6,"x","0",0,0,0,0,"0",0,0,0,0,0,0,0,{"$nulls":7},{"v":0,"d":"0.0"},0,0,""]
[18,"Evers, Claudia",{"$f":"B4","v":"Neuvrees II"},300.8,"x","0",0,0,0,0,"0",0,0,0,0,0,0,0,{"$nulls":7},{"v":0,"d":"0.0"},0,0,""]
[19,"Schulte, Christina","Neuvrees II",310.4,"x","0",0,0,0,0,"0",0,0,0,0,0,0,0,{"$nulls":7},{"v":0,"d":"0.0"},0,0,""]
[20,"Reinelt, Michaela","Lahn IV",310.8,"x","0",0,0,0,0,0,0,"0",0,0,0,0,0,{"$nulls":7},{"v":0,"d":"0.0"},0,0,""]
[21,"Thien, Marita",{"$f":"B5","v":"Lahn IV"},308.6,null,308.6,0,0,0,0,0,0,308.6,1,0,0,0,0,{"$nulls":7},{"v":0,"d":"0.0"},0,0,""]
[22,"Robben, Anja",{"$f":"B5","v":"Lahn IV"},308.9,null,308.9,0,0,0,0,0,0,308.9,1,0,0,0,0,{"$nulls":7},{"v":0,"d":"0.0"},0,0,""]
[23,"Oldopp, Maria",{"$f":"B5","v":"Lahn IV"},298.6,null,298.6,0,0,0,0,0,0,298.6,1,0,0,0,0,{"$nulls":7},{"v":0,"d":"0.0"},0,0,""]
[24,"Hanneken, Doris",{"$f":"B5","v":"Lahn IV"},305.2,null,305.2,0,0,0,0,0,0,305.2,1,0,0,0,0,{"$nulls":7},{"v":0,"d":"0.0"},0,0,""]
[25,"Kuchta, Gertrud",{"$f":"B6","v":"Börger III"},311.3,null,311.3,0,0,0,0,0,0,0,0,311.3,1,0,0,{"$nulls":7},{"v":0,"d":"0.0"},0,0,""]
[26,"Jungsthöfel, Sabine",{"$f":"B6","v":"Börger III"},306.7,null,306.7,0,0,0,0,0,0,0,0,306.7,1,0,0,{"$nulls":7},{"v":0,"d":"0.0"},0,0,""]
[27,"Schwarte, Gundula",{"$f":"B6","v":"Börger III"},306.8,null,306.8,0,0,0,0,0,0,0,0,306.8,1,0,0,{"$nulls":7},{"v":0,"d":"0.0"},0,0,""]
[28,"Geers, Christa",{"$f":"B6","v":"Börger III"},304.5,null,304.5,0,0,0,0,0,0,0,0,304.5,1,0,0,{"$nulls":7},{"v":0,"d":"0.0"},0,0,""]
[29,"Remmers, Tanja",{"$f":"B6","v":"Börger III"},292.9,"x","0",0,0,0,0,0,0,0,0,"0",0,0,0,{"$nulls":7},{"v":0,"d":"0.0"},0,0,""]
[30,"Terhalle, Johanna",{"$f":"B6","v":"Börger III"},311.4,"x","0",0,0,0,0,0,0,0,0,"0",0,0,0,{"$nulls":7},{"v":0,"d":"0.0"},0,0,""]
[31,"Hackstette, Lena",{"$f":"B7","v":"Lahn III"},308.9,null,308.9,0,0,0,0,0,0,0,0,0,0,308.9,1,{"$nulls":7},{"$f":"W40+X40+Y40","v":{"v":0,"d":"0.0"}},{"$f":"IF(Z40=D40,1,0)","v":0},{"$f":"IF(Z40=0,0,1)","v":0},{"$f":"IF(AA40+AB40=2,\"Korrekt\",\"\")","v":""}]
[32,"Thyen, Christel",{"$f":"B7","v":"Lahn III"},309.9,null,309.9,0,0,0,0,0,0,0,0,0,0,309.9,1,{"$nulls":7},{"v":0,"d":"0.0"},0,0,""]
[33,"Ostermann, Hildegard",{"$f":"B7","v":"Lahn III"},309.3,null,309.3,0,0,0,0,0,0,0,0,0,0,309.3,1,{"$nulls":7},{"v":0,"d":"0.0"},0,0,""]
[34,"Willoh, Henrika",{"$f":"B7","v":"Lahn III"},309.3,null,309.3,0,0,0,0,0,0,0,0,0,0,309.3,1,{"$nulls":7},{"v":0,"d":"0.0"},0,0,""]
[35,"Müller, Anita",{"$f":"B7","v":"Lahn III"},306.6,"x","0",0,0,0,0,0,0,0,0,0,0,"0",0,{"$nulls":7},{"v":0,"d":"0.0"},0,0,""]
[36,"Wilken, Elena",{"$f":"B7","v":"Lahn III"},310.9,"x","0",0,0,0,0,0,0,0,0,0,0,"0",0,{"$nulls":7},{"$f":"W45+X45+Y45","v":{"v":0,"d":"0.0"}},{"$f":"IF(Z45=D45,1,0)","v":0},{"$f":"IF(Z45=0,0,1)","v":0},{"$f":"IF(AA45+AB45=2,\"Korrekt\",\"\")","v":""}]
[{"$nulls":6},{"$f":"LARGE(G10:G45,1)+LARGE(G10:G45,2)+LARGE(G10:G45,3)","v":925.9999999999999},{"$f":"SUM(H10:H45)","v":4},{"$f":"LARGE(I10:I45,1)+LARGE(I10:I45,2)+LARGE(I10:I45,3)","v":931.0999999999999},{"$f":"SUM(J10:J45)","v":4},{"$f":"LARGE(K10:K45,1)+LARGE(K10:K45,2)+LARGE(K10:K45,3)","v":919.3},{"$f":"SUM(L10:L45)","v":4},{"$f":"LARGE(M10:M45,1)+LARGE(M10:M45,2)+LARGE(M10:M45,3)","v":922.7},{"$f":"SUM(N10:N45)","v":4},{"$f":"LARGE(O10:O45,1)+LARGE(O10:O45,2)+LARGE(O10:O45,3)","v":924.8},{"$f":"SUM(P10:P45)","v":4},{"$f":"LARGE(Q10:Q45,1)+LARGE(Q10:Q45,2)+LARGE(Q10:Q45,3)","v":928.5},{"$f":"SUM(R10:S45)","v":4}]
[null,null,"per Email an: sk-huemmling@gmx.de"]

{"sheet":"2","index":2,"n_rows":47,"n_cols":27,"rows_kept":47,"merged":[[0,22,0,23],[1,22,1,23],[4,22,4,23],[5,22,5,23],[6,22,6,23],[8,20,8,23]]}
[null,"Verein / Gruppe",null,"Ergebnisse",{"$nulls":17},"Austragungsort:",{"$f":"Übersicht!E4","v":"Esterwegen"}]
[1,{"$f":"'Wettkampf 1'!B2","v":"Börger II"},null,{"$f":"G46","v":916.2},{"$f":"IF(H46>4,\"Es sind zu viele Schützen in Wertung!\",\" \")","v":" "},{"$nulls":16},"Wettkampftag:",{"$f":"Übersicht!E3","v":"13.10"}]
[2,{"$f":"'Wettkampf 1'!B3","v":"Esterwegen V"},null,{"$f":"I46","v":940.1},{"$f":"IF(J46>4,\"Es sind zu viele Schützen in Wertung!\",\" \")","v":" "}]
[3,{"$f":"'Wettkampf 1'!B4","v":"Neuvrees II"},null,{"$f":"K46","v":923.3},{"$f":"IF(L46>4,\"Es sind zu viele Schützen in Wertung!\",\" \")","v":" "},{"$nulls":18},"Ansprechpartner für Rückfragen:"]
[4,{"$f":"'Wettkampf 1'!B5","v":"Lahn IV"},null,{"$f":"M46","v":919.2},{"$f":"IF(N46>4,\"Es sind zu viele Schützen in Wertung!\",\" \")","v":" "},{"$nulls":16},"Name:","Rita Lindemann"]
[5,{"$f":"'Wettkampf 1'!B6","v":"Börger III"},null,{"$f":"O46","v":{"v":924,"d":"924.0"}},{"$f":"IF(P46>4,\"Es sind zu viele Schützen in Wertung!\",\" \")","v":" "},{"$nulls":16},"Tel:","01737565170"]
[6,{"$f":"'Wettkampf 1'!B7","v":"Lahn III"},null,{"$f":"Q46","v":{"v":919.0000000000001,"d":"919.0"}},{"$f":"IF(R46>4,\"Es sind zu viele Schützen in Wertung!\",\" \")","v":" "},{"$nulls":16},"Standaufsicht:","Klaus Lindemann"]
[]
[null,"Einzelergebnisse:","Verein / Gruppe","Ergebnisse (mindestens 0 eintragen)","AW? Dann x eintippen",null,"Verein 1",null,"Verein 2",null,"Verein 3",null,"Verein 4",null,"Verein 5",null,"Verein 6",{"$nulls":3},"Proberechnung bei Streifen:"]
[1,{"$f":"'Wettkampf 1'!B10","v":"Kossenjans, Annegret"},{"$f":"'Wettkampf 1'!C10","v":"Börger II"},304.8,null,{"$f":"IF(E10=\"x\",\"0\",D10)","v":304.8},{"$f":"IF(C10=$B$2,F10,0)","v":304.8},{"$f":"(IF(AND($E10=\"\",$C10=$B$2),1,0))","v":1},{"$f":"IF($C10=$B$3,F10,0)","v":0},{"$f":"(IF(AND($E10=\"\",$C10=$B$3),1,0))","v":0},{"$f":"IF($C10=$B$4,F10,0)","v":0},{"$f":"(IF(AND($E10=\"\",$C10=$B$4),1,0))","v":0},{"$f":"IF($C10=$B$5,F10,0)","v":0},{"$f":"(IF(AND($E10=\"\",$C10=$B$5),1,0))","v":0},{"$f":"IF($C10=$B$6,F10,0)","v":0},{"$f":"(IF(AND($E10=\"\",$C10=$B$6),1,0))","v":0},{"$f":"IF($C10=$B$7,F10,0)","v":0},{"$f":"(IF(AND($E10=\"\",$C10=$B$7),1,0))","v":0},{"$nulls":5},{"$f":"U10+V10+W10","v":{"v":0,"d":"0.0"}},{"$f":"IF(X10=D10,1,0)","v":0},{"$f":"IF(X10=0,0,1)","v":0},{"$f":"IF(Y10+Z10=2,\"Korrekt\",\"\")","v":""}]
[2,{"$f":"'Wettkampf 1'!B11","v":"Jansen, Elisabeth"},{"$f":"'Wettkampf 1'!C11","v":"Börger II"},303.7,null,{"$f":"IF(E11=\"x\",\"0\",D11)","v":303.7},{"$f":"IF(C11=$B$2,F11,0)","v":303.7},{"$f":"(IF(AND($E11=\"\",$C11=$B$2),1,0))","v":1},{"$f":"IF($C11=$B$3,F11,0)","v":0},{"$f":"(IF(AND($E11=\"\",$C11=$B$3),1,0))","v":0},{"$f":"IF($C11=$B$4,F11,0)","v":0},{"$f":"(IF(AND($E11=\"\",$C11=$B$4),1,0))","v":0},{"$f":"IF($C11=$B$5,F11,0)","v":0},{"$f":"(IF(AND($E11=\"\",$C11=$B$5),1,0))","v":0},{"$f":"IF($C11=$B$6,F11,0)","v":0},{"$f":"(IF(AND($E11=\"\",$C11=$B$6),1,0))","v":0},{"$f":"IF($C11=$B$7,F11,0)","v":0},{"$f":"(IF(AND($E11=\"\",$C11=$B$7),1,0))","v":0},{"$nulls":5},{"$f":"U11+V11+W11","v":{"v":0,"d":"0.0"}},{"$f":"IF(X11=D11,1,0)","v":0},{"$f":"IF(X11=0,0,1)","v":0},{"$f":"IF(Y11+Z11=2,\"Korrekt\",\"\")","v":""}]
[3,{"$f":"'Wettkampf 1'!B12","v":"Krömer, Monika"},{"$f":"'Wettkampf 1'!C12","v":"Börger II"},302.2,null,302.2,302.2,1,0,0,0,0,0,0,0,0,0,0,{"$nulls":5},{"v":0,"d":"0.0"},0,0,""]
[4,{"$f":"'Wettkampf 1'!B13","v":"Pohlgeers, Margret"},{"$f":"'Wettkampf 1'!C13","v":"Börger II"},307.7,null,307.7,307.7,1,0,0,0,0,0,0,0,0,0,0,{"$nulls":5},{"v":0,"d":"0.0"},0,0,""]
[5,{"$f":"'Wettkampf 1'!B14","v":"Pohlgeers, Silvia"},{"$f":"'Wettkampf 1'!C14","v":"Börger II"},305.9,"x","0","0",0,0,0,0,0,0,0,0,0,0,0,{"$nulls":5},{"v":0,"d":"0.0"},0,0,""]
[6,{"$f":"'Wettkampf 1'!B15","v":"Schwarte, Annette"},{"$f":"'Wettkampf 1'!C15","v":"Börger II"},{"v":0,"d":"0.0"},"x","0","0",0,0,0,0,0,0,0,0,0,0,0,{"$nulls":5},{"v":0,"d":"0.0"},1,0,""]
[7,{"$f":"'Wettkampf 1'!B16","v":"Lindemann, Kerstin"},{"$f":"'Wettkampf 1'!C16","v":"Esterwegen V"},310.6,null,310.6,0,0,310.6,1,0,0,0,0,0,0,0,0,{"$nulls":5},{"v":0,"d":"0.0"},0,0,""]
[8,{"$f":"'Wettkampf 1'!B17","v":"Schlarmann, Lena"},{"$f":"'Wettkampf 1'!C17","v":"Esterwegen V"},{"v":312,"d":"312.0"},null,{"v":312,"d":"312.0"},0,0,312,1,0,0,0,0,0,0,0,0,{"$nulls":5},{"v":0,"d":"0.0"},0,0,""]
[9,{"$f":"'Wettkampf 1'!B18","v":"Lindemann, Stefanie"},{"$f":"'Wettkampf 1'!C18","v":"Esterwegen V"},305.3,null,305.3,0,0,305.3,1,0,0,0,0,0,0,0,0,{"$nulls":5},{"v":0,"d":"0.0"},0,0,""]
[10,{"$f":"'Wettkampf 1'!B19","v":"Lindemann, Rita"},{"$f":"'Wettkampf 1'!C19","v":"Esterwegen V"},317.5,null,317.5,0,0,317.5,1,0,0,0,0,0,0,0,0,{"$nulls":5},{"v":0,"d":"0.0"},0,0,""]
[11,{"$f":"'Wettkampf 1'!B20","v":"Büter, Daniela"},{"$f":"'Wettkampf 1'!C20","v":"Esterwegen V"},302.8,"x","0",0,0,"0",0,0,0,0,0,0,0,0,0,{"$nulls":5},{"v":0,"d":"0.0"},0,0,""]
[12,{"$f":"'Wettkampf 1'!B21","v":"Lindemann, Annemarie"},{"$f":"'Wettkampf 1'!C21","v":"Esterwegen V"},302.8,"x","0",0,0,"0",0,0,0,0,0,0,0,0,0,{"$nulls":5},{"v":0,"d":"0.0"},0,0,""]
[13,{"$f":"'Wettkampf 1'!B22","v":"Preut, Susanne"},{"$f":"'Wettkampf 1'!C22","v":"Neuvrees II"},304.9,null,304.9,0,0,0,0,304.9,1,0,0,0,0,0,0,{"$nulls":5},{"v":0,"d":"0.0"},0,0,""]
[14,{"$f":"'Wettkampf 1'!B23","v":"Thunert, Silvia"},{"$f":"'Wettkampf 1'!C23","v":"Neuvrees II"},307.4,null,307.4,0,0,0,0,307.4,1,0,0,0,0,0,0,{"$nulls":5},{"v":0,"d":"0.0"},0,0,""]
[15,{"$f":"'Wettkampf 1'!B24","v":"Pohlmann, Margret"},{"$f":"'Wettkampf 1'!C24","v":"Neuvrees II"},305.5,"x","0",0,0,0,0,"0",0,0,0,0,0,0,0,{"$nulls":5},{"v":0,"d":"0.0"},0,0,""]
[16,{"$f":"'Wettkampf 1'!B25","v":"Eilermann, Saskia"},{"$f":"'Wettkampf 1'!C25","v":"Neuvrees II"},310.2,null,310.2,0,0,0,0,310.2,1,0,0,0,0,0,0,{"$nulls":5},{"v":0,"d":"0.0"},0,0,""]
[17,{"$f":"'Wettkampf 1'!B26","v":"Junge, Silvia"},{"$f":"'Wettkampf 1'!C26","v":"Neuvrees II"},302.2,"x","0",0,0,0,0,"0",0,0,0,0,0,0,0,{"$nulls":5},{"v":0,"d":"0.0"},0,0,""]
[18,{"$f":"'Wettkampf 1'!B27","v":"Evers, Claudia"},{"$f":"'Wettkampf 1'!C27","v":"Neuvrees II"},306.3,"x","0",0,0,0,0,"0",0,0,0,0,0,0,0,{"$nulls":5},{"v":0,"d":"0.0"},0,0,""]
[19,{"$f":"'Wettkampf 1'!B28","v":"Schulte, Christina"},{"$f":"'Wettkampf 1'!C28","v":"Neuvrees II"},305.7,null,305.7,0,0,0,0,305.7,1,0,0,0,0,0,0,{"$nulls":5},{"v":0,"d":"0.0"},0,0,""]
[20,{"$f":"'Wettkampf 1'!B29","v":"Reinelt, Michaela"},{"$f":"'Wettkampf 1'!C29","v":"Lahn IV"},303.6,null,303.6,0,0,0,0,0,0,303.6,1,0,0,0,0,{"$nulls":5},{"v":0,"d":"0.0"},0,0,""]
[21,{"$f":"'Wettkampf 1'!B30","v":"Thien, Marita"},{"$f":"'Wettkampf 1'!C30","v":"Lahn IV"},306.7,null,306.7,0,0,0,0,0,0,306.7,1,0,0,0,0,{"$nulls":5},{"v":0,"d":"0.0"},0,0,""]
[22,{"$f":"'Wettkampf 1'!B31","v":"Robben, Anja"},{"$f":"'Wettkampf 1'!C31","v":"Lahn IV"},307.7,null,307.7,0,0,0,0,0,0,307.7,1,0,0,0,0,{"$nulls":5},{"v":0,"d":"0.0"},0,0,""]
[23,{"$f":"'Wettkampf 1'!B32","v":"Oldopp, Maria"},{"$f":"'Wettkampf 1'!C32","v":"Lahn IV"},{"v":301,"d":"301.0"},"x","0",0,0,0,0,0,0,"0",0,0,0,0,0,{"$nulls":5},{"v":0,"d":"0.0"},0,0,""]
[24,{"$f":"'Wettkampf 1'!B33","v":"Hanneken, Doris"},{"$f":"'Wettkampf 1'!C33","v":"Lahn IV"},304.8,null,304.8,0,0,0,0,0,0,304.8,1,0,0,0,0,{"$nulls":5},{"v":0,"d":"0.0"},0,0,""]
[25,{"$f":"'Wettkampf 1'!B34","v":"Kuchta, Gertrud"},{"$f":"'Wettkampf 1'!C34","v":"Börger III"},308.9,null,308.9,0,0,0,0,0,0,0,0,308.9,1,0,0,{"$nulls":5},{"v":0,"d":"0.0"},0,0,""]
[26,{"$f":"'Wettkampf 1'!B35","v":"Jungsthöfel, Sabine"},{"$f":"'Wettkampf 1'!C35","v":"Börger III"},306.3,null,306.3,0,0,0,0,0,0,0,0,306.3,1,0,0,{"$nulls":5},{"v":0,"d":"0.0"},0,0,""]
[27,{"$f":"'Wettkampf 1'!B36","v":"Schwarte, Gundula"},{"$f":"'Wettkampf 1'!C36","v":"Börger III"},304.3,null,304.3,0,0,0,0,0,0,0,0,304.3,1,0,0,{"$nulls":5},{"v":0,"d":"0.0"},0,0,""]
[28,{"$f":"'Wettkampf 1'!B37","v":"Geers, Christa"},{"$f":"'Wettkampf 1'!C37","v":"Börger III"},297.1,"x","0",0,0,0,0,0,0,0,0,"0",0,0,0,{"$nulls":5},{"v":0,"d":"0.0"},0,0,""]
[29,{"$f":"'Wettkampf 1'!B38","v":"Remmers, Tanja"},{"$f":"'Wettkampf 1'!C38","v":"Börger III"},294.5,"x","0",0,0,0,0,0,0,0,0,"0",0,0,0,{"$nulls":5},{"v":0,"d":"0.0"},0,0,""]
[30,{"$f":"'Wettkampf 1'!B39","v":"Terhalle, Johanna"},{"$f":"'Wettkampf 1'!C39","v":"Börger III"},308.8,null,308.8,0,0,0,0,0,0,0,0,308.8,1,0,0,{"$nulls":5},{"v":0,"d":"0.0"},0,0,""]
[31,{"$f":"'Wettkampf 1'!B40","v":"Hackstette, Lena"},{"$f":"'Wettkampf 1'!C40","v":"Lahn III"},303.8,"x","0",0,0,0,0,0,0,0,0,0,0,"0",0,{"$nulls":5},{"$f":"U40+V40+W40","v":{"v":0,"d":"0.0"}},{"$f":"IF(X40=D40,1,0)","v":0},{"$f":"IF(X40=0,0,1)","v":0},{"$f":"IF(Y40+Z40=2,\"Korrekt\",\"\")","v":""}]
[32,{"$f":"'Wettkampf 1'!B41","v":"Thyen, Christel"},{"$f":"'Wettkampf 1'!C41","v":"Lahn III"},{"v":299,"d":"299.0"},null,{"v":299,"d":"299.0"},0,0,0,0,0,0,0,0,0,0,299,1,{"$nulls":5},{"v":0,"d":"0.0"},0,0,""]
[33,{"$f":"'Wettkampf 1'!B42","v":"Ostermann, Hildegard"},{"$f":"'Wettkampf 1'!C42","v":"Lahn III"},305.1,null,305.1,0,0,0,0,0,0,0,0,0,0,305.1,1,{"$nulls":5},{"v":0,"d":"0.0"},0,0,""]
[34,{"$f":"'Wettkampf 1'!B43","v":"Willoh, Henrika"},{"$f":"'Wettkampf 1'!C43","v":"Lahn III"},309.3,null,309.3,0,0,0,0,0,0,0,0,0,0,309.3,1,{"$nulls":5},{"v":0,"d":"0.0"},0,0,""]
[35,{"$f":"'Wettkampf 1'!B44","v":"Müller, Anita"},{"$f":"'Wettkampf 1'!C44","v":"Lahn III"},298.5,"x","0",0,0,0,0,0,0,0,0,0,0,"0",0,{"$nulls":5},{"v":0,"d":"0.0"},0,0,""]
[36,{"$f":"'Wettkampf 1'!B45","v":"Wilken, Elena"},{"$f":"'Wettkampf 1'!C45","v":"Lahn III"},304.6,null,304.6,0,0,0,0,0,0,0,0,0,0,304.6,1,{"$nulls":5},{"$f":"U45+V45+W45","v":{"v":0,"d":"0.0"}},{"$f":"IF(X45=D45,1,0)","v":0},{"$f":"IF(X45=0,0,1)","v":0},{"$f":"IF(Y45+Z45=2,\"Korrekt\",\"\")","v":""}]
[{"$nulls":6},{"$f":"LARGE(G10:G45,1)+LARGE(G10:G45,2)+LARGE(G10:G45,3)","v":916.2},{"$f":"SUM(H10:H45)","v":4},{"$f":"LARGE(I10:I45,1)+LARGE(I10:I45,2)+LARGE(I10:I45,3)","v":940.1},{"$f":"SUM(J10:J45)","v":4},{"$f":"LARGE(K10:K45,1)+LARGE(K10:K45,2)+LARGE(K10:K45,3)","v":923.3},{"$f":"SUM(L10:L45)","v":4},{"$f":"LARGE(M10:M45,1)+LARGE(M10:M45,2)+LARGE(M10:M45,3)","v":919.2},{"$f":"SUM(N10:N45)","v":4},{"$f":"LARGE(O10:O45,1)+LARGE(O10:O45,2)+LARGE(O10:O45,3)","v":924},{"$f":"SUM(P10:P45)","v":4},{"$f":"LARGE(Q10:Q45,1)+LARGE(Q10:Q45,2)+LARGE(Q10:Q45,3)","v":919.0000000000001},{"$f":"SUM(R10:S45)","v":4}]
[null,null,"per Email an: sk-huemmling@gmx.de"]

{"sheet":"3","index":3,"n_rows":47,"n_cols":27,"rows_kept":47,"merged":[[0,22,0,23],[1,22,1,23],[4,22,4,23],[5,22,5,23],[6,22,6,23],[8,20,8,23]]}
[null,"Verein / Gruppe",null,"Ergebnisse",{"$nulls":17},"Austragungsort:",{"$f":"Übersicht!F4","v":"Neuvrees"}]
[1,{"$f":"'Wettkampf 1'!B2","v":"Börger II"},null,{"$f":"G46","v":911.7},{"$f":"IF(H46>4,\"Es sind zu viele Schützen in Wertung!\",\" \")","v":" "},{"$nulls":16},"Wettkampftag:",{"$f":"Übersicht!F3","v":"27.10."}]
[2,{"$f":"'Wettkampf 1'!B3","v":"Esterwegen V"},null,{"$f":"I46","v":934.7},{"$f":"IF(J46>4,\"Es sind zu viele Schützen in Wertung!\",\" \")","v":" "}]
[3,{"$f":"'Wettkampf 1'!B4","v":"Neuvrees II"},null,{"$f":"K46","v":{"v":925.0999999999999,"d":"925.1"}},{"$f":"IF(L46>4,\"Es sind zu viele Schützen in Wertung!\",\" \")","v":" "},{"$nulls":18},"Ansprechpartner für Rückfragen:"]
[4,{"$f":"'Wettkampf 1'!B5","v":"Lahn IV"},null,{"$f":"M46","v":{"v":920.0999999999999,"d":"920.1"}},{"$f":"IF(N46>4,\"Es sind zu viele Schützen in Wertung!\",\" \")","v":" "},{"$nulls":16},"Name:","Silvia Thunert"]
[5,{"$f":"'Wettkampf 1'!B6","v":"Börger III"},null,{"$f":"O46","v":910.6},{"$f":"IF(P46>4,\"Es sind zu viele Schützen in Wertung!\",\" \")","v":" "},{"$nulls":16},"Tel:","04493-998686"]
[6,{"$f":"'Wettkampf 1'!B7","v":"Lahn III"},null,{"$f":"Q46","v":922.7},{"$f":"IF(R46>4,\"Es sind zu viele Schützen in Wertung!\",\" \")","v":" "},{"$nulls":16},"Standaufsicht:","Silvia Thunert"]
[]
[null,"Einzelergebnisse:","Verein / Gruppe","Ergebnisse (mindestens 0 eintragen)","AW? Dann x eintippen",null,"Verein 1",null,"Verein 2",null,"Verein 3",null,"Verein 4",null,"Verein 5",null,"Verein 6",{"$nulls":3},"Proberechnung bei Streifen:"]
[1,{"$f":"'Wettkampf 1'!B10","v":"Kossenjans, Annegret"},{"$f":"'Wettkampf 1'!C10","v":"Börger II"},298.6,null,{"$f":"IF(E10=\"x\",\"0\",D10)","v":298.6},{"$f":"IF(C10=$B$2,F10,0)","v":298.6},{"$f":"(IF(AND($E10=\"\",$C10=$B$2),1,0))","v":1},{"$f":"IF($C10=$B$3,F10,0)","v":0},{"$f":"(IF(AND($E10=\"\",$C10=$B$3),1,0))","v":0},{"$f":"IF($C10=$B$4,F10,0)","v":0},{"$f":"(IF(AND($E10=\"\",$C10=$B$4),1,0))","v":0},{"$f":"IF($C10=$B$5,F10,0)","v":0},{"$f":"(IF(AND($E10=\"\",$C10=$B$5),1,0))","v":0},{"$f":"IF($C10=$B$6,F10,0)","v":0},{"$f":"(IF(AND($E10=\"\",$C10=$B$6),1,0))","v":0},{"$f":"IF($C10=$B$7,F10,0)","v":0},{"$f":"(IF(AND($E10=\"\",$C10=$B$7),1,0))","v":0},{"$nulls":5},{"$f":"U10+V10+W10","v":{"v":0,"d":"0.0"}},{"$f":"IF(X10=D10,1,0)","v":0},{"$f":"IF(X10=0,0,1)","v":0},{"$f":"IF(Y10+Z10=2,\"Korrekt\",\"\")","v":""}]
[2,{"$f":"'Wettkampf 1'!B11","v":"Jansen, Elisabeth"},{"$f":"'Wettkampf 1'!C11","v":"Börger II"},301.8,null,{"$f":"IF(E11=\"x\",\"0\",D11)","v":301.8},{"$f":"IF(C11=$B$2,F11,0)","v":301.8},{"$f":"(IF(AND($E11=\"\",$C11=$B$2),1,0))","v":1},{"$f":"IF($C11=$B$3,F11,0)","v":0},{"$f":"(IF(AND($E11=\"\",$C11=$B$3),1,0))","v":0},{"$f":"IF($C11=$B$4,F11,0)","v":0},{"$f":"(IF(AND($E11=\"\",$C11=$B$4),1,0))","v":0},{"$f":"IF($C11=$B$5,F11,0)","v":0},{"$f":"(IF(AND($E11=\"\",$C11=$B$5),1,0))","v":0},{"$f":"IF($C11=$B$6,F11,0)","v":0},{"$f":"(IF(AND($E11=\"\",$C11=$B$6),1,0))","v":0},{"$f":"IF($C11=$B$7,F11,0)","v":0},{"$f":"(IF(AND($E11=\"\",$C11=$B$7),1,0))","v":0},{"$nulls":5},{"$f":"U11+V11+W11","v":{"v":0,"d":"0.0"}},{"$f":"IF(X11=D11,1,0)","v":0},{"$f":"IF(X11=0,0,1)","v":0},{"$f":"IF(Y11+Z11=2,\"Korrekt\",\"\")","v":""}]
[3,{"$f":"'Wettkampf 1'!B12","v":"Krömer, Monika"},{"$f":"'Wettkampf 1'!C12","v":"Börger II"},301.8,null,301.8,301.8,1,0,0,0,0,0,0,0,0,0,0,{"$nulls":5},{"v":0,"d":"0.0"},0,0,""]
[4,{"$f":"'Wettkampf 1'!B13","v":"Pohlgeers, Margret"},{"$f":"'Wettkampf 1'!C13","v":"Börger II"},308.1,null,308.1,308.1,1,0,0,0,0,0,0,0,0,0,0,{"$nulls":5},{"v":0,"d":"0.0"},0,0,""]
[5,{"$f":"'Wettkampf 1'!B14","v":"Pohlgeers, Silvia"},{"$f":"'Wettkampf 1'!C14","v":"Börger II"},302.6,"x","0","0",0,0,0,0,0,0,0,0,0,0,0,{"$nulls":5},{"v":0,"d":"0.0"},0,0,""]
[6,{"$f":"'Wettkampf 1'!B15","v":"Schwarte, Annette"},{"$f":"'Wettkampf 1'!C15","v":"Börger II"},null,"x","0","0",0,0,0,0,0,0,0,0,0,0,0,{"$nulls":5},{"v":0,"d":"0.0"},1,0,""]
[7,{"$f":"'Wettkampf 1'!B16","v":"Lindemann, Kerstin"},{"$f":"'Wettkampf 1'!C16","v":"Esterwegen V"},310.4,null,310.4,0,0,310.4,1,0,0,0,0,0,0,0,0,{"$nulls":5},{"v":0,"d":"0.0"},0,0,""]
[8,{"$f":"'Wettkampf 1'!B17","v":"Schlarmann, Lena"},{"$f":"'Wettkampf 1'!C17","v":"Esterwegen V"},309.8,null,309.8,0,0,309.8,1,0,0,0,0,0,0,0,0,{"$nulls":5},{"v":0,"d":"0.0"},0,0,""]
[9,{"$f":"'Wettkampf 1'!B18","v":"Lindemann, Stefanie"},{"$f":"'Wettkampf 1'!C18","v":"Esterwegen V"},308.4,null,308.4,0,0,308.4,1,0,0,0,0,0,0,0,0,{"$nulls":5},{"v":0,"d":"0.0"},0,0,""]
[10,{"$f":"'Wettkampf 1'!B19","v":"Lindemann, Rita"},{"$f":"'Wettkampf 1'!C19","v":"Esterwegen V"},314.5,null,314.5,0,0,314.5,1,0,0,0,0,0,0,0,0,{"$nulls":5},{"v":0,"d":"0.0"},0,0,""]
[11,{"$f":"'Wettkampf 1'!B20","v":"Büter, Daniela"},{"$f":"'Wettkampf 1'!C20","v":"Esterwegen V"},303.4,"x","0",0,0,"0",0,0,0,0,0,0,0,0,0,{"$nulls":5},{"v":0,"d":"0.0"},0,0,""]
[12,{"$f":"'Wettkampf 1'!B21","v":"Lindemann, Annemarie"},{"$f":"'Wettkampf 1'!C21","v":"Esterwegen V"},302.7,"x","0",0,0,"0",0,0,0,0,0,0,0,0,0,{"$nulls":5},{"v":0,"d":"0.0"},0,0,""]
[13,{"$f":"'Wettkampf 1'!B22","v":"Preut, Susanne"},{"$f":"'Wettkampf 1'!C22","v":"Neuvrees II"},304.5,null,304.5,0,0,0,0,304.5,1,0,0,0,0,0,0,{"$nulls":5},{"v":0,"d":"0.0"},0,0,""]
[14,{"$f":"'Wettkampf 1'!B23","v":"Thunert, Silvia"},{"$f":"'Wettkampf 1'!C23","v":"Neuvrees II"},310.9,null,310.9,0,0,0,0,310.9,1,0,0,0,0,0,0,{"$nulls":5},{"v":0,"d":"0.0"},0,0,""]
[15,{"$f":"'Wettkampf 1'!B24","v":"Pohlmann, Margret"},{"$f":"'Wettkampf 1'!C24","v":"Neuvrees II"},303.5,"x","0",0,0,0,0,"0",0,0,0,0,0,0,0,{"$nulls":5},{"v":0,"d":"0.0"},0,0,""]
[16,{"$f":"'Wettkampf 1'!B25","v":"Eilermann, Saskia"},{"$f":"'Wettkampf 1'!C25","v":"Neuvrees II"},309.7,null,309.7,0,0,0,0,309.7,1,0,0,0,0,0,0,{"$nulls":5},{"v":0,"d":"0.0"},0,0,""]
[17,{"$f":"'Wettkampf 1'!B26","v":"Junge, Silvia"},{"$f":"'Wettkampf 1'!C26","v":"Neuvrees II"},295.7,"x","0",0,0,0,0,"0",0,0,0,0,0,0,0,{"$nulls":5},{"v":0,"d":"0.0"},0,0,""]
[18,{"$f":"'Wettkampf 1'!B27","v":"Evers, Claudia"},{"$f":"'Wettkampf 1'!C27","v":"Neuvrees II"},303.3,"x","0",0,0,0,0,"0",0,0,0,0,0,0,0,{"$nulls":5},{"v":0,"d":"0.0"},0,0,""]
[19,{"$f":"'Wettkampf 1'!B28","v":"Schulte, Christina"},{"$f":"'Wettkampf 1'!C28","v":"Neuvrees II"},304.3,null,304.3,0,0,0,0,304.3,1,0,0,0,0,0,0,{"$nulls":5},{"v":0,"d":"0.0"},0,0,""]
[20,{"$f":"'Wettkampf 1'!B29","v":"Reinelt, Michaela"},{"$f":"'Wettkampf 1'!C29","v":"Lahn IV"},307.4,null,307.4,0,0,0,0,0,0,307.4,1,0,0,0,0,{"$nulls":5},{"v":0,"d":"0.0"},0,0,""]
[21,{"$f":"'Wettkampf 1'!B30","v":"Thien, Marita"},{"$f":"'Wettkampf 1'!C30","v":"Lahn IV"},306.4,null,306.4,0,0,0,0,0,0,306.4,1,0,0,0,0,{"$nulls":5},{"v":0,"d":"0.0"},0,0,""]
[22,{"$f":"'Wettkampf 1'!B31","v":"Robben, Anja"},{"$f":"'Wettkampf 1'!C31","v":"Lahn IV"},306.3,null,306.3,0,0,0,0,0,0,306.3,1,0,0,0,0,{"$nulls":5},{"v":0,"d":"0.0"},0,0,""]
[23,{"$f":"'Wettkampf 1'!B32","v":"Oldopp, Maria"},{"$f":"'Wettkampf 1'!C32","v":"Lahn IV"},301.2,"x","0",0,0,0,0,0,0,"0",0,0,0,0,0,{"$nulls":5},{"v":0,"d":"0.0"},0,0,""]
[24,{"$f":"'Wettkampf 1'!B33","v":"Hanneken, Doris"},{"$f":"'Wettkampf 1'!C33","v":"Lahn IV"},305.7,null,305.7,0,0,0,0,0,0,305.7,1,0,0,0,0,{"$nulls":5},{"v":0,"d":"0.0"},0,0,""]
[25,{"$f":"'Wettkampf 1'!B34","v":"Kuchta, Gertrud"},{"$f":"'Wettkampf 1'!C34","v":"Börger III"},{"v":305,"d":"305.0"},null,{"v":305,"d":"305.0"},0,0,0,0,0,0,0,0,305,1,0,0,{"$nulls":5},{"v":0,"d":"0.0"},0,0,""]
[26,{"$f":"'Wettkampf 1'!B35","v":"Jungsthöfel, Sabine"},{"$f":"'Wettkampf 1'!C35","v":"Börger III"},300.4,null,300.4,0,0,0,0,0,0,0,0,300.4,1,0,0,{"$nulls":5},{"v":0,"d":"0.0"},0,0,""]
[27,{"$f":"'Wettkampf 1'!B36","v":"Schwarte, Gundula"},{"$f":"'Wettkampf 1'!C36","v":"Börger III"},299.7,null,299.7,0,0,0,0,0,0,0,0,299.7,1,0,0,{"$nulls":5},{"v":0,"d":"0.0"},0,0,""]
[28,{"$f":"'Wettkampf 1'!B37","v":"Geers, Christa"},{"$f":"'Wettkampf 1'!C37","v":"Börger III"},302.1,"x","0",0,0,0,0,0,0,0,0,"0",0,0,0,{"$nulls":5},{"v":0,"d":"0.0"},0,0,""]
[29,{"$f":"'Wettkampf 1'!B38","v":"Remmers, Tanja"},{"$f":"'Wettkampf 1'!C38","v":"Börger III"},275.8,"x","0",0,0,0,0,0,0,0,0,"0",0,0,0,{"$nulls":5},{"v":0,"d":"0.0"},0,0,""]
[30,{"$f":"'Wettkampf 1'!B39","v":"Terhalle, Johanna"},{"$f":"'Wettkampf 1'!C39","v":"Börger III"},305.2,null,305.2,0,0,0,0,0,0,0,0,305.2,1,0,0,{"$nulls":5},{"v":0,"d":"0.0"},0,0,""]
[31,{"$f":"'Wettkampf 1'!B40","v":"Hackstette, Lena"},{"$f":"'Wettkampf 1'!C40","v":"Lahn III"},310.2,"x","0",0,0,0,0,0,0,0,0,0,0,"0",0,{"$nulls":5},{"v":0,"d":"0.0"},0,0,""]
[32,{"$f":"'Wettkampf 1'!B41","v":"Thyen, Christel"},{"$f":"'Wettkampf 1'!C41","v":"Lahn III"},307.2,null,307.2,0,0,0,0,0,0,0,0,0,0,307.2,1,{"$nulls":5},{"v":0,"d":"0.0"},0,0,""]
[33,{"$f":"'Wettkampf 1'!B42","v":"Ostermann, Hildegard"},{"$f":"'Wettkampf 1'!C42","v":"Lahn III"},307.4,null,307.4,0,0,0,0,0,0,0,0,0,0,307.4,1,{"$nulls":5},{"v":0,"d":"0.0"},0,0,""]
[34,{"$f":"'Wettkampf 1'!B43","v":"Willoh, Henrika"},{"$f":"'Wettkampf 1'!C43","v":"Lahn III"},308.1,null,308.1,0,0,0,0,0,0,0,0,0,0,308.1,1,{"$nulls":5},{"v":0,"d":"0.0"},0,0,""]
[35,{"$f":"'Wettkampf 1'!B44","v":"Müller, Anita"},{"$f":"'Wettkampf 1'!C44","v":"Lahn III"},299.5,"x","0",0,0,0,0,0,0,0,0,0,0,"0",0,{"$nulls":5},{"v":0,"d":"0.0"},0,0,""]
[36,{"$f":"'Wettkampf 1'!B45","v":"Wilken, Elena"},{"$f":"'Wettkampf 1'!C45","v":"Lahn III"},302.2,null,302.2,0,0,0,0,0,0,0,0,0,0,302.2,1,{"$nulls":5},{"v":0,"d":"0.0"},0,0,""]
[{"$nulls":6},{"$f":"LARGE(G10:G45,1)+LARGE(G10:G45,2)+LARGE(G10:G45,3)","v":911.7},{"$f":"SUM(H10:H45)","v":4},{"$f":"LARGE(I10:I45,1)+LARGE(I10:I45,2)+LARGE(I10:I45,3)","v":934.7},{"$f":"SUM(J10:J45)","v":4},{"$f":"LARGE(K10:K45,1)+LARGE(K10:K45,2)+LARGE(K10:K45,3)","v":925.0999999999999},{"$f":"SUM(L10:L45)","v":4},{"$f":"LARGE(M10:M45,1)+LARGE(M10:M45,2)+LARGE(M10:M45,3)","v":920.0999999999999},{"$f":"SUM(N10:N45)","v":4},{"$f":"LARGE(O10:O45,1)+LARGE(O10:O45,2)+LARGE(O10:O45,3)","v":910.6},{"$f":"SUM(P10:P45)","v":4},{"$f":"LARGE(Q10:Q45,1)+LARGE(Q10:Q45,2)+LARGE(Q10:Q45,3)","v":922.7},{"$f":"SUM(R10:S45)","v":4}]
[null,null,"per Email an: sk-huemmling@gmx.de"]

{"sheet":"4","index":4,"n_rows":47,"n_cols":27,"rows_kept":47,"merged":[[0,22,0,23],[1,22,1,23],[4,22,4,23],[5,22,5,23],[6,22,6,23],[8,20,8,23]]}
[null,"Verein / Gruppe",null,"Ergebnisse",{"$nulls":17},"Austragungsort:",{"$f":"Übersicht!G4","v":"Lahn"}]
[1,{"$f":"'Wettkampf 1'!B2","v":"Börger II"},null,{"$f":"G46","v":922.4},{"$f":"IF(H46>4,\"Es sind zu viele Schützen in Wertung!\",\" \")","v":" "},{"$nulls":16},"Wettkampftag:",{"$f":"Übersicht!G3","v":"17.11."}]
[2,{"$f":"'Wettkampf 1'!B3","v":"Esterwegen V"},null,{"$f":"I46","v":{"v":934,"d":"934.0"}},{"$f":"IF(J46>4,\"Es sind zu viele Schützen in Wertung!\",\" \")","v":" "}]
[3,{"$f":"'Wettkampf 1'!B4","v":"Neuvrees II"},null,{"$f":"K46","v":{"v":925.1999999999999,"d":"925.2"}},{"$f":"IF(L46>4,\"Es sind zu viele Schützen in Wertung!\",\" \")","v":" "},{"$nulls":18},"Ansprechpartner für Rückfragen:"]
[4,{"$f":"'Wettkampf 1'!B5","v":"Lahn IV"},null,{"$f":"M46","v":{"v":925.4000000000001,"d":"925.4"}},{"$f":"IF(N46>4,\"Es sind zu viele Schützen in Wertung!\",\" \")","v":" "},{"$nulls":16},"Name:","Doris Hanneken"]
[5,{"$f":"'Wettkampf 1'!B6","v":"Börger III"},null,{"$f":"O46","v":920.3},{"$f":"IF(P46>4,\"Es sind zu viele Schützen in Wertung!\",\" \")","v":" "},{"$nulls":16},"Tel:","0176-42215241"]
[6,{"$f":"'Wettkampf 1'!B7","v":"Lahn III"},null,{"$f":"Q46","v":{"v":933.4000000000001,"d":"933.4"}},{"$f":"IF(R46>4,\"Es sind zu viele Schützen in Wertung!\",\" \")","v":" "},{"$nulls":16},"Standaufsicht:","Doris Hanneken"]
[]
[null,"Einzelergebnisse:","Verein / Gruppe","Ergebnisse (mindestens 0 eintragen)","AW? Dann x eintippen",null,"Verein 1",null,"Verein 2",null,"Verein 3",null,"Verein 4",null,"Verein 5",null,"Verein 6",{"$nulls":3},"Proberechnung bei Streifen:"]
[1,{"$f":"'Wettkampf 1'!B10","v":"Kossenjans, Annegret"},{"$f":"'Wettkampf 1'!C10","v":"Börger II"},307.4,null,{"$f":"IF(E10=\"x\",\"0\",D10)","v":307.4},{"$f":"IF(C10=$B$2,F10,0)","v":307.4},{"$f":"(IF(AND($E10=\"\",$C10=$B$2),1,0))","v":1},{"$f":"IF($C10=$B$3,F10,0)","v":0},{"$f":"(IF(AND($E10=\"\",$C10=$B$3),1,0))","v":0},{"$f":"IF($C10=$B$4,F10,0)","v":0},{"$f":"(IF(AND($E10=\"\",$C10=$B$4),1,0))","v":0},{"$f":"IF($C10=$B$5,F10,0)","v":0},{"$f":"(IF(AND($E10=\"\",$C10=$B$5),1,0))","v":0},{"$f":"IF($C10=$B$6,F10,0)","v":0},{"$f":"(IF(AND($E10=\"\",$C10=$B$6),1,0))","v":0},{"$f":"IF($C10=$B$7,F10,0)","v":0},{"$f":"(IF(AND($E10=\"\",$C10=$B$7),1,0))","v":0},null,null,101.9,100.1,105.4,{"$f":"U10+V10+W10","v":307.4},{"$f":"IF(X10=D10,1,0)","v":1},{"$f":"IF(X10=0,0,1)","v":1},{"$f":"IF(Y10+Z10=2,\"Korrekt\",\"\")","v":"Korrekt"}]
[2,{"$f":"'Wettkampf 1'!B11","v":"Jansen, Elisabeth"},{"$f":"'Wettkampf 1'!C11","v":"Börger II"},307.5,null,{"$f":"IF(E11=\"x\",\"0\",D11)","v":307.5},{"$f":"IF(C11=$B$2,F11,0)","v":307.5},{"$f":"(IF(AND($E11=\"\",$C11=$B$2),1,0))","v":1},{"$f":"IF($C11=$B$3,F11,0)","v":0},{"$f":"(IF(AND($E11=\"\",$C11=$B$3),1,0))","v":0},{"$f":"IF($C11=$B$4,F11,0)","v":0},{"$f":"(IF(AND($E11=\"\",$C11=$B$4),1,0))","v":0},{"$f":"IF($C11=$B$5,F11,0)","v":0},{"$f":"(IF(AND($E11=\"\",$C11=$B$5),1,0))","v":0},{"$f":"IF($C11=$B$6,F11,0)","v":0},{"$f":"(IF(AND($E11=\"\",$C11=$B$6),1,0))","v":0},{"$f":"IF($C11=$B$7,F11,0)","v":0},{"$f":"(IF(AND($E11=\"\",$C11=$B$7),1,0))","v":0},null,null,102.8,102.3,102.4,{"$f":"U11+V11+W11","v":307.5},{"$f":"IF(X11=D11,1,0)","v":1},{"$f":"IF(X11=0,0,1)","v":1},{"$f":"IF(Y11+Z11=2,\"Korrekt\",\"\")","v":"Korrekt"}]
[3,{"$f":"'Wettkampf 1'!B12","v":"Krömer, Monika"},{"$f":"'Wettkampf 1'!C12","v":"Börger II"},297.8,null,297.8,297.8,1,0,0,0,0,0,0,0,0,0,0,null,null,102.1,98.6,97.1,{"v":297.79999999999995,"d":"297.8"},1,1,"Korrekt"]
[4,{"$f":"'Wettkampf 1'!B13","v":"Pohlgeers, Margret"},{"$f":"'Wettkampf 1'!C13","v":"Börger II"},307.5,null,307.5,307.5,1,0,0,0,0,0,0,0,0,0,0,null,null,{"v":102,"d":"102.0"},102.2,103.3,307.5,1,1,"Korrekt"]
[5,{"$f":"'Wettkampf 1'!B14","v":"Pohlgeers, Silvia"},{"$f":"'Wettkampf 1'!C14","v":"Börger II"},310.9,"x","0","0",0,0,0,0,0,0,0,0,0,0,0,null,null,102.3,{"v":105,"d":"105.0"},103.6,310.9,1,1,"Korrekt"]
[6,{"$f":"'Wettkampf 1'!B15","v":"Schwarte, Annette"},{"$f":"'Wettkampf 1'!C15","v":"Börger II"},{"v":0,"d":"0.0"},"x","0","0",0,0,0,0,0,0,0,0,0,0,0,null,null,{"v":0,"d":"0.0"},{"v":0,"d":"0.0"},{"v":0,"d":"0.0"},{"v":0,"d":"0.0"},1,0,""]
[7,{"$f":"'Wettkampf 1'!B16","v":"Lindemann, Kerstin"},{"$f":"'Wettkampf 1'!C16","v":"Esterwegen V"},{"v":309,"d":"309.0"},null,{"v":309,"d":"309.0"},0,0,309,1,0,0,0,0,0,0,0,0,null,null,102.7,103.6,102.7,{"v":309,"d":"309.0"},1,1,"Korrekt"]
[8,{"$f":"'Wettkampf 1'!B17","v":"Schlarmann, Lena"},{"$f":"'Wettkampf 1'!C17","v":"Esterwegen V"},{"v":310,"d":"310.0"},null,{"v":310,"d":"310.0"},0,0,310,1,0,0,0,0,0,0,0,0,null,null,102.8,103.4,103.8,{"v":310,"d":"310.0"},1,1,"Korrekt"]
[9,{"$f":"'Wettkampf 1'!B18","v":"Lindemann, Stefanie"},{"$f":"'Wettkampf 1'!C18","v":"Esterwegen V"},298.4,null,298.4,0,0,298.4,1,0,0,0,0,0,0,0,0,null,null,103.8,98.3,96.3,298.4,1,1,"Korrekt"]
[10,{"$f":"'Wettkampf 1'!B19","v":"Lindemann, Rita"},{"$f":"'Wettkampf 1'!C19","v":"Esterwegen V"},{"v":315,"d":"315.0"},null,{"v":315,"d":"315.0"},0,0,315,1,0,0,0,0,0,0,0,0,null,null,104.7,105.8,104.5,{"v":315,"d":"315.0"},1,1,"Korrekt"]
[11,{"$f":"'Wettkampf 1'!B20","v":"Büter, Daniela"},{"$f":"'Wettkampf 1'!C20","v":"Esterwegen V"},309.3,"x","0",0,0,"0",0,0,0,0,0,0,0,0,0,null,null,103.2,102.2,103.9,309.3,1,1,"Korrekt"]
[12,{"$f":"'Wettkampf 1'!B21","v":"Lindemann, Annemarie"},{"$f":"'Wettkampf 1'!C21","v":"Esterwegen V"},305.5,"x","0",0,0,"0",0,0,0,0,0,0,0,0,0,null,null,100.8,102.6,102.1,305.5,1,1,"Korrekt"]
[13,{"$f":"'Wettkampf 1'!B22","v":"Preut, Susanne"},{"$f":"'Wettkampf 1'!C22","v":"Neuvrees II"},308.4,null,308.4,0,0,0,0,308.4,1,0,0,0,0,0,0,null,null,101.5,103.2,103.7,308.4,1,1,"Korrekt"]
[14,{"$f":"'Wettkampf 1'!B23","v":"Thunert, Silvia"},{"$f":"'Wettkampf 1'!C23","v":"Neuvrees II"},308.4,null,308.4,0,0,0,0,308.4,1,0,0,0,0,0,0,null,null,103.2,101.5,103.7,308.4,1,1,"Korrekt"]
[15,{"$f":"'Wettkampf 1'!B24","v":"Pohlmann, Margret"},{"$f":"'Wettkampf 1'!C24","v":"Neuvrees II"},307.8,"x","0",0,0,0,0,"0",0,0,0,0,0,0,0,null,null,102.8,101.1,103.9,{"v":307.79999999999995,"d":"307.8"},1,1,"Korrekt"]
[16,{"$f":"'Wettkampf 1'!B25","v":"Eilermann, Saskia"},{"$f":"'Wettkampf 1'!C25","v":"Neuvrees II"},{"v":0,"d":"0.0"},"x","0",0,0,0,0,"0",0,0,0,0,0,0,0,null,null,{"v":0,"d":"0.0"},{"v":0,"d":"0.0"},{"v":0,"d":"0.0"},{"v":0,"d":"0.0"},1,0,""]
[17,{"$f":"'Wettkampf 1'!B26","v":"Junge, Silvia"},{"$f":"'Wettkampf 1'!C26","v":"Neuvrees II"},279.3,"x","0",0,0,0,0,"0",0,0,0,0,0,0,0,null,null,91.3,92.9,95.1,{"v":279.29999999999995,"d":"279.3"},1,1,"Korrekt"]
[18,{"$f":"'Wettkampf 1'!B27","v":"Evers, Claudia"},{"$f":"'Wettkampf 1'!C27","v":"Neuvrees II"},299.9,"x","0",0,0,0,0,"0",0,0,0,0,0,0,0,null,null,99.6,97.5,102.8,299.9,1,1,"Korrekt"]
[19,{"$f":"'Wettkampf 1'!B28","v":"Schulte, Christina"},{"$f":"'Wettkampf 1'!C28","v":"Neuvrees II"},308.4,null,308.4,0,0,0,0,308.4,1,0,0,0,0,0,0,null,null,103.2,102.2,{"v":103,"d":"103.0"},308.4,1,1,"Korrekt"]
[20,{"$f":"'Wettkampf 1'!B29","v":"Reinelt, Michaela"},{"$f":"'Wettkampf 1'!C29","v":"Lahn IV"},309.1,null,309.1,0,0,0,0,0,0,309.1,1,0,0,0,0,null,null,102.6,103.3,103.2,{"v":309.09999999999997,"d":"309.1"},1,1,"Korrekt"]
[21,{"$f":"'Wettkampf 1'!B30","v":"Thien, Marita"},{"$f":"'Wettkampf 1'!C30","v":"Lahn IV"},{"v":309,"d":"309.0"},null,{"v":309,"d":"309.0"},0,0,0,0,0,0,309,1,0,0,0,0,null,null,102.8,104.5,101.7,{"v":309,"d":"309.0"},1,1,"Korrekt"]
[22,{"$f":"'Wettkampf 1'!B31","v":"Robben, Anja"},{"$f":"'Wettkampf 1'!C31","v":"Lahn IV"},307.3,null,307.3,0,0,0,0,0,0,307.3,1,0,0,0,0,null,null,102.1,102.9,102.3,307.3,1,1,"Korrekt"]
[23,{"$f":"'Wettkampf 1'!B32","v":"Oldopp, Maria"},{"$f":"'Wettkampf 1'!C32","v":"Lahn IV"},299.6,"x","0",0,0,0,0,0,0,"0",0,0,0,0,0,null,null,100.1,100.1,99.4,299.6,1,1,"Korrekt"]
[24,{"$f":"'Wettkampf 1'!B33","v":"Hanneken, Doris"},{"$f":"'Wettkampf 1'!C33","v":"Lahn IV"},{"v":307,"d":"307.0"},null,{"v":307,"d":"307.0"},0,0,0,0,0,0,307,1,0,0,0,0,null,null,101.9,102.9,102.2,{"v":307,"d":"307.0"},1,1,"Korrekt"]
[25,{"$f":"'Wettkampf 1'!B34","v":"Kuchta, Gertrud"},{"$f":"'Wettkampf 1'!C34","v":"Börger III"},299.6,null,299.6,0,0,0,0,0,0,0,0,299.6,1,0,0,null,null,102.1,104.1,93.4,299.6,1,1,"Korrekt"]
[26,{"$f":"'Wettkampf 1'!B35","v":"Jungsthöfel, Sabine"},{"$f":"'Wettkampf 1'!C35","v":"Börger III"},299.9,null,299.9,0,0,0,0,0,0,0,0,299.9,1,0,0,null,null,98.9,100.5,100.5,299.9,1,1,"Korrekt"]
[27,{"$f":"'Wettkampf 1'!B36","v":"Schwarte, Gundula"},{"$f":"'Wettkampf 1'!C36","v":"Börger III"},{"v":0,"d":"0.0"},"x","0",0,0,0,0,0,0,0,0,"0",0,0,0,null,null,{"v":0,"d":"0.0"},{"v":0,"d":"0.0"},{"v":0,"d":"0.0"},{"v":0,"d":"0.0"},1,0,""]
[28,{"$f":"'Wettkampf 1'!B37","v":"Geers, Christa"},{"$f":"'Wettkampf 1'!C37","v":"Börger III"},{"v":311,"d":"311.0"},null,{"v":311,"d":"311.0"},0,0,0,0,0,0,0,0,311,1,0,0,null,null,103.5,103.5,{"v":104,"d":"104.0"},{"v":311,"d":"311.0"},1,1,"Korrekt"]
[29,{"$f":"'Wettkampf 1'!B38","v":"Remmers, Tanja"},{"$f":"'Wettkampf 1'!C38","v":"Börger III"},290.6,"x","0",0,0,0,0,0,0,0,0,"0",0,0,0,null,null,98.7,99.8,92.1,290.6,1,1,"Korrekt"]
[30,{"$f":"'Wettkampf 1'!B39","v":"Terhalle, Johanna"},{"$f":"'Wettkampf 1'!C39","v":"Börger III"},309.4,null,309.4,0,0,0,0,0,0,0,0,309.4,1,0,0,null,null,102.4,104.1,102.9,309.4,1,1,"Korrekt"]
[31,{"$f":"'Wettkampf 1'!B40","v":"Hackstette, Lena"},{"$f":"'Wettkampf 1'!C40","v":"Lahn III"},301.9,null,301.9,0,0,0,0,0,0,0,0,0,0,301.9,1,null,null,99.6,101.8,100.5,301.9,1,1,"Korrekt"]
[32,{"$f":"'Wettkampf 1'!B41","v":"Thyen, Christel"},{"$f":"'Wettkampf 1'!C41","v":"Lahn III"},{"v":313,"d":"313.0"},null,{"v":313,"d":"313.0"},0,0,0,0,0,0,0,0,0,0,313,1,null,null,104.6,103.1,105.3,{"v":313,"d":"313.0"},1,1,"Korrekt"]
[33,{"$f":"'Wettkampf 1'!B42","v":"Ostermann, Hildegard"},{"$f":"'Wettkampf 1'!C42","v":"Lahn III"},309.7,null,309.7,0,0,0,0,0,0,0,0,0,0,309.7,1,null,null,{"v":104,"d":"104.0"},102.4,103.3,309.7,1,1,"Korrekt"]
[34,{"$f":"'Wettkampf 1'!B43","v":"Willoh, Henrika"},{"$f":"'Wettkampf 1'!C43","v":"Lahn III"},310.7,null,310.7,0,0,0,0,0,0,0,0,0,0,310.7,1,null,null,102.4,103.9,104.4,{"v":310.70000000000005,"d":"310.7"},1,1,"Korrekt"]
[35,{"$f":"'Wettkampf 1'!B44","v":"Müller, Anita"},{"$f":"'Wettkampf 1'!C44","v":"Lahn III"},305.3,"x","0",0,0,0,0,0,0,0,0,0,0,"0",0,null,null,{"v":100,"d":"100.0"},100.9,104.4,305.3,1,1,"Korrekt"]
[36,{"$f":"'Wettkampf 1'!B45","v":"Wilken, Elena"},{"$f":"'Wettkampf 1'!C45","v":"Lahn III"},309.7,"x","0",0,0,0,0,0,0,0,0,0,0,"0",0,null,null,104.9,102.2,102.6,{"v":309.70000000000005,"d":"309.7"},1,1,"Korrekt"]
[{"$nulls":6},{"$f":"LARGE(G10:G45,1)+LARGE(G10:G45,2)+LARGE(G10:G45,3)","v":922.4},{"$f":"SUM(H10:H45)","v":4},{"$f":"LARGE(I10:I45,1)+LARGE(I10:I45,2)+LARGE(I10:I45,3)","v":934},{"$f":"SUM(J10:J45)","v":4},{"$f":"LARGE(K10:K45,1)+LARGE(K10:K45,2)+LARGE(K10:K45,3)","v":925.1999999999999},{"$f":"SUM(L10:L45)","v":3},{"$f":"LARGE(M10:M45,1)+LARGE(M10:M45,2)+LARGE(M10:M45,3)","v":925.4000000000001},{"$f":"SUM(N10:N45)","v":4},{"$f":"LARGE(O10:O45,1)+LARGE(O10:O45,2)+LARGE(O10:O45,3)","v":920.3},{"$f":"SUM(P10:P45)","v":4},{"$f":"LARGE(Q10:Q45,1)+LARGE(Q10:Q45,2)+LARGE(Q10:Q45,3)","v":933.4000000000001},{"$f":"SUM(R10:S45)","v":4}]
[null,null,"per Email an: sk-huemmling@gmx.de"]

{"sheet":"5","index":5,"n_rows":47,"n_cols":27,"rows_kept":47,"merged":[[0,22,0,23],[1,22,1,23],[4,22,4,23],[5,22,5,23],[6,22,6,23],[8,20,8,23]]}
[null,"Verein / Gruppe",null,"Ergebnisse",{"$nulls":17},"Austragungsort:",{"$f":"Übersicht!H4","v":"Lahn"}]
[1,{"$f":"'Wettkampf 1'!B2","v":"Börger II"},null,{"$f":"G46","v":925.5},{"$f":"IF(H46>4,\"Es sind zu viele Schützen in Wertung!\",\" \")","v":" "},{"$nulls":16},"Wettkampftag:",{"$f":"Übersicht!H3","v":"01.12."}]
[2,{"$f":"'Wettkampf 1'!B3","v":"Esterwegen V"},null,{"$f":"I46","v":{"v":935.8000000000001,"d":"935.8"}},{"$f":"IF(J46>4,\"Es sind zu viele Schützen in Wertung!\",\" \")","v":" "}]
[3,{"$f":"'Wettkampf 1'!B4","v":"Neuvrees II"},null,{"$f":"K46","v":923.2},{"$f":"IF(L46>4,\"Es sind zu viele Schützen in Wertung!\",\" \")","v":" "},{"$nulls":18},"Ansprechpartner für Rückfragen:"]
[4,{"$f":"'Wettkampf 1'!B5","v":"Lahn IV"},null,{"$f":"M46","v":930.5},{"$f":"IF(N46>4,\"Es sind zu viele Schützen in Wertung!\",\" \")","v":" "},{"$nulls":16},"Name:","Hildegard Ostermann"]
[5,{"$f":"'Wettkampf 1'!B6","v":"Börger III"},null,{"$f":"O46","v":925.2},{"$f":"IF(P46>4,\"Es sind zu viele Schützen in Wertung!\",\" \")","v":" "},{"$nulls":16},"Tel:"]
[6,{"$f":"'Wettkampf 1'!B7","v":"Lahn III"},null,{"$f":"Q46","v":937.2},{"$f":"IF(R46>4,\"Es sind zu viele Schützen in Wertung!\",\" \")","v":" "},{"$nulls":16},"Standaufsicht:","Hildegard Ostermann"]
[]
[null,"Einzelergebnisse:","Verein / Gruppe","Ergebnisse (mindestens 0 eintragen)","AW? Dann x eintippen",null,"Verein 1",null,"Verein 2",null,"Verein 3",null,"Verein 4",null,"Verein 5",null,"Verein 6",{"$nulls":3},"Proberechnung bei Streifen:"]
[1,{"$f":"'Wettkampf 1'!B10","v":"Kossenjans, Annegret"},{"$f":"'Wettkampf 1'!C10","v":"Börger II"},307.8,null,{"$f":"IF(E10=\"x\",\"0\",D10)","v":307.8},{"$f":"IF(C10=$B$2,F10,0)","v":307.8},{"$f":"(IF(AND($E10=\"\",$C10=$B$2),1,0))","v":1},{"$f":"IF($C10=$B$3,F10,0)","v":0},{"$f":"(IF(AND($E10=\"\",$C10=$B$3),1,0))","v":0},{"$f":"IF($C10=$B$4,F10,0)","v":0},{"$f":"(IF(AND($E10=\"\",$C10=$B$4),1,0))","v":0},{"$f":"IF($C10=$B$5,F10,0)","v":0},{"$f":"(IF(AND($E10=\"\",$C10=$B$5),1,0))","v":0},{"$f":"IF($C10=$B$6,F10,0)","v":0},{"$f":"(IF(AND($E10=\"\",$C10=$B$6),1,0))","v":0},{"$f":"IF($C10=$B$7,F10,0)","v":0},{"$f":"(IF(AND($E10=\"\",$C10=$B$7),1,0))","v":0},{"$nulls":5},{"$f":"U10+V10+W10","v":{"v":0,"d":"0.0"}},{"$f":"IF(X10=D10,1,0)","v":0},{"$f":"IF(X10=0,0,1)","v":0},{"$f":"IF(Y10+Z10=2,\"Korrekt\",\"\")","v":""}]
[2,{"$f":"'Wettkampf 1'!B11","v":"Jansen, Elisabeth"},{"$f":"'Wettkampf 1'!C11","v":"Börger II"},306.7,"x",{"$f":"IF(E11=\"x\",\"0\",D11)","v":"0"},{"$f":"IF(C11=$B$2,F11,0)","v":"0"},{"$f":"(IF(AND($E11=\"\",$C11=$B$2),1,0))","v":0},{"$f":"IF($C11=$B$3,F11,0)","v":0},{"$f":"(IF(AND($E11=\"\",$C11=$B$3),1,0))","v":0},{"$f":"IF($C11=$B$4,F11,0)","v":0},{"$f":"(IF(AND($E11=\"\",$C11=$B$4),1,0))","v":0},{"$f":"IF($C11=$B$5,F11,0)","v":0},{"$f":"(IF(AND($E11=\"\",$C11=$B$5),1,0))","v":0},{"$f":"IF($C11=$B$6,F11,0)","v":0},{"$f":"(IF(AND($E11=\"\",$C11=$B$6),1,0))","v":0},{"$f":"IF($C11=$B$7,F11,0)","v":0},{"$f":"(IF(AND($E11=\"\",$C11=$B$7),1,0))","v":0},{"$nulls":5},{"$f":"U11+V11+W11","v":{"v":0,"d":"0.0"}},{"$f":"IF(X11=D11,1,0)","v":0},{"$f":"IF(X11=0,0,1)","v":0},{"$f":"IF(Y11+Z11=2,\"Korrekt\",\"\")","v":""}]
[3,{"$f":"'Wettkampf 1'!B12","v":"Krömer, Monika"},{"$f":"'Wettkampf 1'!C12","v":"Börger II"},294.7,null,294.7,294.7,1,0,0,0,0,0,0,0,0,0,0,{"$nulls":5},{"v":0,"d":"0.0"},0,0,""]
[4,{"$f":"'Wettkampf 1'!B13","v":"Pohlgeers, Margret"},{"$f":"'Wettkampf 1'!C13","v":"Börger II"},309.3,null,309.3,309.3,1,0,0,0,0,0,0,0,0,0,0,{"$nulls":5},{"v":0,"d":"0.0"},0,0,""]
[5,{"$f":"'Wettkampf 1'!B14","v":"Pohlgeers, Silvia"},{"$f":"'Wettkampf 1'!C14","v":"Börger II"},308.4,null,308.4,308.4,1,0,0,0,0,0,0,0,0,0,0,{"$nulls":5},{"v":0,"d":"0.0"},0,0,""]
[6,{"$f":"'Wettkampf 1'!B15","v":"Schwarte, Annette"},{"$f":"'Wettkampf 1'!C15","v":"Börger II"},null,"x","0","0",0,0,0,0,0,0,0,0,0,0,0,{"$nulls":5},{"v":0,"d":"0.0"},1,0,""]
[7,{"$f":"'Wettkampf 1'!B16","v":"Lindemann, Kerstin"},{"$f":"'Wettkampf 1'!C16","v":"Esterwegen V"},307.9,null,307.9,0,0,307.9,1,0,0,0,0,0,0,0,0,{"$nulls":5},{"v":0,"d":"0.0"},0,0,""]
[8,{"$f":"'Wettkampf 1'!B17","v":"Schlarmann, Lena"},{"$f":"'Wettkampf 1'!C17","v":"Esterwegen V"},311.3,null,311.3,0,0,311.3,1,0,0,0,0,0,0,0,0,{"$nulls":5},{"v":0,"d":"0.0"},0,0,""]
[9,{"$f":"'Wettkampf 1'!B18","v":"Lindemann, Stefanie"},{"$f":"'Wettkampf 1'!C18","v":"Esterwegen V"},303.1,"x","0",0,0,"0",0,0,0,0,0,0,0,0,0,{"$nulls":5},{"v":0,"d":"0.0"},0,0,""]
[10,{"$f":"'Wettkampf 1'!B19","v":"Lindemann, Rita"},{"$f":"'Wettkampf 1'!C19","v":"Esterwegen V"},316.6,null,316.6,0,0,316.6,1,0,0,0,0,0,0,0,0,{"$nulls":5},{"v":0,"d":"0.0"},0,0,""]
[11,{"$f":"'Wettkampf 1'!B20","v":"Büter, Daniela"},{"$f":"'Wettkampf 1'!C20","v":"Esterwegen V"},306.5,null,306.5,0,0,306.5,1,0,0,0,0,0,0,0,0,{"$nulls":5},{"v":0,"d":"0.0"},0,0,""]
[12,{"$f":"'Wettkampf 1'!B21","v":"Lindemann, Annemarie"},{"$f":"'Wettkampf 1'!C21","v":"Esterwegen V"},306.3,"x","0",0,0,"0",0,0,0,0,0,0,0,0,0,{"$nulls":5},{"v":0,"d":"0.0"},0,0,""]
[13,{"$f":"'Wettkampf 1'!B22","v":"Preut, Susanne"},{"$f":"'Wettkampf 1'!C22","v":"Neuvrees II"},null,"x","0",0,0,0,0,"0",0,0,0,0,0,0,0,{"$nulls":5},{"v":0,"d":"0.0"},1,0,""]
[14,{"$f":"'Wettkampf 1'!B23","v":"Thunert, Silvia"},{"$f":"'Wettkampf 1'!C23","v":"Neuvrees II"},308.3,null,308.3,0,0,0,0,308.3,1,0,0,0,0,0,0,{"$nulls":5},{"v":0,"d":"0.0"},0,0,""]
[15,{"$f":"'Wettkampf 1'!B24","v":"Pohlmann, Margret"},{"$f":"'Wettkampf 1'!C24","v":"Neuvrees II"},309.1,null,309.1,0,0,0,0,309.1,1,0,0,0,0,0,0,{"$nulls":5},{"v":0,"d":"0.0"},0,0,""]
[16,{"$f":"'Wettkampf 1'!B25","v":"Eilermann, Saskia"},{"$f":"'Wettkampf 1'!C25","v":"Neuvrees II"},null,"x","0",0,0,0,0,"0",0,0,0,0,0,0,0,{"$nulls":5},{"v":0,"d":"0.0"},1,0,""]
[17,{"$f":"'Wettkampf 1'!B26","v":"Junge, Silvia"},{"$f":"'Wettkampf 1'!C26","v":"Neuvrees II"},295.1,"x","0",0,0,0,0,"0",0,0,0,0,0,0,0,{"$nulls":5},{"v":0,"d":"0.0"},0,0,""]
[18,{"$f":"'Wettkampf 1'!B27","v":"Evers, Claudia"},{"$f":"'Wettkampf 1'!C27","v":"Neuvrees II"},303.2,null,303.2,0,0,0,0,303.2,1,0,0,0,0,0,0,{"$nulls":5},{"v":0,"d":"0.0"},0,0,""]
[19,{"$f":"'Wettkampf 1'!B28","v":"Schulte, Christina"},{"$f":"'Wettkampf 1'!C28","v":"Neuvrees II"},305.8,null,305.8,0,0,0,0,305.8,1,0,0,0,0,0,0,{"$nulls":5},{"v":0,"d":"0.0"},0,0,""]
[20,{"$f":"'Wettkampf 1'!B29","v":"Reinelt, Michaela"},{"$f":"'Wettkampf 1'!C29","v":"Lahn IV"},310.8,null,310.8,0,0,0,0,0,0,310.8,1,0,0,0,0,{"$nulls":5},{"v":0,"d":"0.0"},0,0,""]
[21,{"$f":"'Wettkampf 1'!B30","v":"Thien, Marita"},{"$f":"'Wettkampf 1'!C30","v":"Lahn IV"},311.7,null,311.7,0,0,0,0,0,0,311.7,1,0,0,0,0,{"$nulls":5},{"v":0,"d":"0.0"},0,0,""]
[22,{"$f":"'Wettkampf 1'!B31","v":"Robben, Anja"},{"$f":"'Wettkampf 1'!C31","v":"Lahn IV"},{"v":308,"d":"308.0"},null,{"v":308,"d":"308.0"},0,0,0,0,0,0,308,1,0,0,0,0,{"$nulls":5},{"v":0,"d":"0.0"},0,0,""]
[23,{"$f":"'Wettkampf 1'!B32","v":"Oldopp, Maria"},{"$f":"'Wettkampf 1'!C32","v":"Lahn IV"},297.2,"x","0",0,0,0,0,0,0,"0",0,0,0,0,0,{"$nulls":5},{"v":0,"d":"0.0"},0,0,""]
[24,{"$f":"'Wettkampf 1'!B33","v":"Hanneken, Doris"},{"$f":"'Wettkampf 1'!C33","v":"Lahn IV"},307.5,null,307.5,0,0,0,0,0,0,307.5,1,0,0,0,0,{"$nulls":5},{"v":0,"d":"0.0"},0,0,""]
[25,{"$f":"'Wettkampf 1'!B34","v":"Kuchta, Gertrud"},{"$f":"'Wettkampf 1'!C34","v":"Börger III"},306.5,null,306.5,0,0,0,0,0,0,0,0,306.5,1,0,0,{"$nulls":5},{"v":0,"d":"0.0"},0,0,""]
[26,{"$f":"'Wettkampf 1'!B35","v":"Jungsthöfel, Sabine"},{"$f":"'Wettkampf 1'!C35","v":"Börger III"},304.8,"x","0",0,0,0,0,0,0,0,0,"0",0,0,0,{"$nulls":5},{"v":0,"d":"0.0"},0,0,""]
[27,{"$f":"'Wettkampf 1'!B36","v":"Schwarte, Gundula"},{"$f":"'Wettkampf 1'!C36","v":"Börger III"},300.8,null,300.8,0,0,0,0,0,0,0,0,300.8,1,0,0,{"$nulls":5},{"v":0,"d":"0.0"},0,0,""]
[28,{"$f":"'Wettkampf 1'!B37","v":"Geers, Christa"},{"$f":"'Wettkampf 1'!C37","v":"Börger III"},307.3,null,307.3,0,0,0,0,0,0,0,0,307.3,1,0,0,{"$nulls":5},{"v":0,"d":"0.0"},0,0,""]
[29,{"$f":"'Wettkampf 1'!B38","v":"Remmers, Tanja"},{"$f":"'Wettkampf 1'!C38","v":"Börger III"},289.2,"x","0",0,0,0,0,0,0,0,0,"0",0,0,0,{"$nulls":5},{"v":0,"d":"0.0"},0,0,""]
[30,{"$f":"'Wettkampf 1'!B39","v":"Terhalle, Johanna"},{"$f":"'Wettkampf 1'!C39","v":"Börger III"},311.4,null,311.4,0,0,0,0,0,0,0,0,311.4,1,0,0,{"$nulls":5},{"v":0,"d":"0.0"},0,0,""]
[31,{"$f":"'Wettkampf 1'!B40","v":"Hackstette, Lena"},{"$f":"'Wettkampf 1'!C40","v":"Lahn III"},307.4,"x","0",0,0,0,0,0,0,0,0,0,0,"0",0,{"$nulls":5},{"v":0,"d":"0.0"},0,0,""]
[32,{"$f":"'Wettkampf 1'!B41","v":"Thyen, Christel"},{"$f":"'Wettkampf 1'!C41","v":"Lahn III"},314.8,null,314.8,0,0,0,0,0,0,0,0,0,0,314.8,1,{"$nulls":5},{"v":0,"d":"0.0"},0,0,""]
[33,{"$f":"'Wettkampf 1'!B42","v":"Ostermann, Hildegard"},{"$f":"'Wettkampf 1'!C42","v":"Lahn III"},312.1,null,312.1,0,0,0,0,0,0,0,0,0,0,312.1,1,{"$nulls":5},{"v":0,"d":"0.0"},0,0,""]
[34,{"$f":"'Wettkampf 1'!B43","v":"Willoh, Henrika"},{"$f":"'Wettkampf 1'!C43","v":"Lahn III"},310.3,null,310.3,0,0,0,0,0,0,0,0,0,0,310.3,1,{"$nulls":5},{"v":0,"d":"0.0"},0,0,""]
[35,{"$f":"'Wettkampf 1'!B44","v":"Müller, Anita"},{"$f":"'Wettkampf 1'!C44","v":"Lahn III"},305.4,"x","0",0,0,0,0,0,0,0,0,0,0,"0",0,{"$nulls":5},{"v":0,"d":"0.0"},0,0,""]
[36,{"$f":"'Wettkampf 1'!B45","v":"Wilken, Elena"},{"$f":"'Wettkampf 1'!C45","v":"Lahn III"},306.8,null,306.8,0,0,0,0,0,0,0,0,0,0,306.8,1,{"$nulls":5},{"v":0,"d":"0.0"},0,0,""]
[{"$nulls":6},{"$f":"LARGE(G10:G45,1)+LARGE(G10:G45,2)+LARGE(G10:G45,3)","v":925.5},{"$f":"SUM(H10:H45)","v":4},{"$f":"LARGE(I10:I45,1)+LARGE(I10:I45,2)+LARGE(I10:I45,3)","v":935.8000000000001},{"$f":"SUM(J10:J45)","v":4},{"$f":"LARGE(K10:K45,1)+LARGE(K10:K45,2)+LARGE(K10:K45,3)","v":923.2},{"$f":"SUM(L10:L45)","v":4},{"$f":"LARGE(M10:M45,1)+LARGE(M10:M45,2)+LARGE(M10:M45,3)","v":930.5},{"$f":"SUM(N10:N45)","v":4},{"$f":"LARGE(O10:O45,1)+LARGE(O10:O45,2)+LARGE(O10:O45,3)","v":925.2},{"$f":"SUM(P10:P45)","v":4},{"$f":"LARGE(Q10:Q45,1)+LARGE(Q10:Q45,2)+LARGE(Q10:Q45,3)","v":937.2},{"$f":"SUM(R10:S45)","v":4}]
[null,null,"per Email an: sk-huemmling@gmx.de"]

{"sheet":"6","index":6,"n_rows":47,"n_cols":27,"rows_kept":47,"merged":[[0,22,0,23],[1,22,1,23],[4,22,4,23],[5,22,5,23],[6,22,6,23],[8,20,8,23]]}
[null,"Verein / Gruppe",null,"Ergebnisse",{"$nulls":17},"Austragungsort:",{"$f":"Übersicht!I4","v":"Börger"}]
[1,{"$f":"'Wettkampf 1'!B2","v":"Börger II"},null,{"$f":"G46","v":930.4},{"$f":"IF(H46>4,\"Es sind zu viele Schützen in Wertung!\",\" \")","v":" "},{"$nulls":16},"Wettkampftag:",{"$f":"Übersicht!I3","v":"15.12."}]
[2,{"$f":"'Wettkampf 1'!B3","v":"Esterwegen V"},null,{"$f":"I46","v":933.2},{"$f":"IF(J46>4,\"Es sind zu viele Schützen in Wertung!\",\" \")","v":" "}]
[3,{"$f":"'Wettkampf 1'!B4","v":"Neuvrees II"},null,{"$f":"K46","v":920.9},{"$f":"IF(L46>4,\"Es sind zu viele Schützen in Wertung!\",\" \")","v":" "},{"$nulls":18},"Ansprechpartner für Rückfragen:"]
[4,{"$f":"'Wettkampf 1'!B5","v":"Lahn IV"},null,{"$f":"M46","v":929.6},{"$f":"IF(N46>4,\"Es sind zu viele Schützen in Wertung!\",\" \")","v":" "},{"$nulls":16},"Name:","Geers"]
[5,{"$f":"'Wettkampf 1'!B6","v":"Börger III"},null,{"$f":"O46","v":{"v":917,"d":"917.0"}},{"$f":"IF(P46>4,\"Es sind zu viele Schützen in Wertung!\",\" \")","v":" "},{"$nulls":16},"Tel:","05953431"]
[6,{"$f":"'Wettkampf 1'!B7","v":"Lahn III"},null,{"$f":"Q46","v":{"v":923.5999999999999,"d":"923.6"}},{"$f":"IF(R46>4,\"Es sind zu viele Schützen in Wertung!\",\" \")","v":" "},{"$nulls":16},"Standaufsicht:","Christa Geers"]
[]
[null,"Einzelergebnisse:","Verein / Gruppe","Ergebnisse (mindestens 0 eintragen)","AW? Dann x eintippen",null,"Verein 1",null,"Verein 2",null,"Verein 3",null,"Verein 4",null,"Verein 5",null,"Verein 6",{"$nulls":3},"Proberechnung bei Streifen:"]
[1,{"$f":"'Wettkampf 1'!B10","v":"Kossenjans, Annegret"},{"$f":"'Wettkampf 1'!C10","v":"Börger II"},301.9,null,{"$f":"IF(E10=\"x\",\"0\",D10)","v":301.9},{"$f":"IF(C10=$B$2,F10,0)","v":301.9},{"$f":"(IF(AND($E10=\"\",$C10=$B$2),1,0))","v":1},{"$f":"IF($C10=$B$3,F10,0)","v":0},{"$f":"(IF(AND($E10=\"\",$C10=$B$3),1,0))","v":0},{"$f":"IF($C10=$B$4,F10,0)","v":0},{"$f":"(IF(AND($E10=\"\",$C10=$B$4),1,0))","v":0},{"$f":"IF($C10=$B$5,F10,0)","v":0},{"$f":"(IF(AND($E10=\"\",$C10=$B$5),1,0))","v":0},{"$f":"IF($C10=$B$6,F10,0)","v":0},{"$f":"(IF(AND($E10=\"\",$C10=$B$6),1,0))","v":0},{"$f":"IF($C10=$B$7,F10,0)","v":0},{"$f":"(IF(AND($E10=\"\",$C10=$B$7),1,0))","v":0},{"$nulls":5},{"$f":"U10+V10+W10","v":{"v":0,"d":"0.0"}},{"$f":"IF(X10=D10,1,0)","v":0},{"$f":"IF(X10=0,0,1)","v":0},{"$f":"IF(Y10+Z10=2,\"Korrekt\",\"\")","v":""}]
[2,{"$f":"'Wettkampf 1'!B11","v":"Jansen, Elisabeth"},{"$f":"'Wettkampf 1'!C11","v":"Börger II"},311.6,null,{"$f":"IF(E11=\"x\",\"0\",D11)","v":311.6},{"$f":"IF(C11=$B$2,F11,0)","v":311.6},{"$f":"(IF(AND($E11=\"\",$C11=$B$2),1,0))","v":1},{"$f":"IF($C11=$B$3,F11,0)","v":0},{"$f":"(IF(AND($E11=\"\",$C11=$B$3),1,0))","v":0},{"$f":"IF($C11=$B$4,F11,0)","v":0},{"$f":"(IF(AND($E11=\"\",$C11=$B$4),1,0))","v":0},{"$f":"IF($C11=$B$5,F11,0)","v":0},{"$f":"(IF(AND($E11=\"\",$C11=$B$5),1,0))","v":0},{"$f":"IF($C11=$B$6,F11,0)","v":0},{"$f":"(IF(AND($E11=\"\",$C11=$B$6),1,0))","v":0},{"$f":"IF($C11=$B$7,F11,0)","v":0},{"$f":"(IF(AND($E11=\"\",$C11=$B$7),1,0))","v":0},{"$nulls":5},{"$f":"U11+V11+W11","v":{"v":0,"d":"0.0"}},{"$f":"IF(X11=D11,1,0)","v":0},{"$f":"IF(X11=0,0,1)","v":0},{"$f":"IF(Y11+Z11=2,\"Korrekt\",\"\")","v":""}]
[3,{"$f":"'Wettkampf 1'!B12","v":"Krömer, Monika"},{"$f":"'Wettkampf 1'!C12","v":"Börger II"},{"v":301,"d":"301.0"},"x","0","0",0,0,0,0,0,0,0,0,0,0,0,{"$nulls":5},{"v":0,"d":"0.0"},0,0,""]
[4,{"$f":"'Wettkampf 1'!B13","v":"Pohlgeers, Margret"},{"$f":"'Wettkampf 1'!C13","v":"Börger II"},312.4,null,312.4,312.4,1,0,0,0,0,0,0,0,0,0,0,{"$nulls":5},{"v":0,"d":"0.0"},0,0,""]
[5,{"$f":"'Wettkampf 1'!B14","v":"Pohlgeers, Silvia"},{"$f":"'Wettkampf 1'!C14","v":"Börger II"},306.4,null,306.4,306.4,1,0,0,0,0,0,0,0,0,0,0,{"$nulls":5},{"v":0,"d":"0.0"},0,0,""]
[6,{"$f":"'Wettkampf 1'!B15","v":"Schwarte, Annette"},{"$f":"'Wettkampf 1'!C15","v":"Börger II"},{"v":0,"d":"0.0"},"x","0","0",0,0,0,0,0,0,0,0,0,0,0,{"$nulls":5},{"v":0,"d":"0.0"},1,0,""]
[7,{"$f":"'Wettkampf 1'!B16","v":"Lindemann, Kerstin"},{"$f":"'Wettkampf 1'!C16","v":"Esterwegen V"},306.6,null,306.6,0,0,306.6,1,0,0,0,0,0,0,0,0,{"$nulls":5},{"v":0,"d":"0.0"},0,0,""]
[8,{"$f":"'Wettkampf 1'!B17","v":"Schlarmann, Lena"},{"$f":"'Wettkampf 1'!C17","v":"Esterwegen V"},{"v":311,"d":"311.0"},null,{"v":311,"d":"311.0"},0,0,311,1,0,0,0,0,0,0,0,0,{"$nulls":5},{"v":0,"d":"0.0"},0,0,""]
[9,{"$f":"'Wettkampf 1'!B18","v":"Lindemann, Stefanie"},{"$f":"'Wettkampf 1'!C18","v":"Esterwegen V"},306.8,"x","0",0,0,"0",0,0,0,0,0,0,0,0,0,{"$nulls":5},{"v":0,"d":"0.0"},0,0,""]
[10,{"$f":"'Wettkampf 1'!B19","v":"Lindemann, Rita"},{"$f":"'Wettkampf 1'!C19","v":"Esterwegen V"},315.6,null,315.6,0,0,315.6,1,0,0,0,0,0,0,0,0,{"$nulls":5},{"v":0,"d":"0.0"},0,0,""]
[11,{"$f":"'Wettkampf 1'!B20","v":"Büter, Daniela"},{"$f":"'Wettkampf 1'!C20","v":"Esterwegen V"},300.6,null,300.6,0,0,300.6,1,0,0,0,0,0,0,0,0,{"$nulls":5},{"v":0,"d":"0.0"},0,0,""]
[12,{"$f":"'Wettkampf 1'!B21","v":"Lindemann, Annemarie"},{"$f":"'Wettkampf 1'!C21","v":"Esterwegen V"},{"v":0,"d":"0.0"},"x","0",0,0,"0",0,0,0,0,0,0,0,0,0,{"$nulls":5},{"v":0,"d":"0.0"},1,0,""]
[13,{"$f":"'Wettkampf 1'!B22","v":"Preut, Susanne"},{"$f":"'Wettkampf 1'!C22","v":"Neuvrees II"},300.4,null,300.4,0,0,0,0,300.4,1,0,0,0,0,0,0,{"$nulls":5},{"v":0,"d":"0.0"},0,0,""]
[14,{"$f":"'Wettkampf 1'!B23","v":"Thunert, Silvia"},{"$f":"'Wettkampf 1'!C23","v":"Neuvrees II"},306.7,null,306.7,0,0,0,0,306.7,1,0,0,0,0,0,0,{"$nulls":5},{"v":0,"d":"0.0"},0,0,""]
[15,{"$f":"'Wettkampf 1'!B24","v":"Pohlmann, Margret"},{"$f":"'Wettkampf 1'!C24","v":"Neuvrees II"},{"v":303,"d":"303.0"},null,{"v":303,"d":"303.0"},0,0,0,0,303,1,0,0,0,0,0,0,{"$nulls":5},{"v":0,"d":"0.0"},0,0,""]
[16,{"$f":"'Wettkampf 1'!B25","v":"Eilermann, Saskia"},{"$f":"'Wettkampf 1'!C25","v":"Neuvrees II"},311.2,null,311.2,0,0,0,0,311.2,1,0,0,0,0,0,0,{"$nulls":5},{"v":0,"d":"0.0"},0,0,""]
[17,{"$f":"'Wettkampf 1'!B26","v":"Junge, Silvia"},{"$f":"'Wettkampf 1'!C26","v":"Neuvrees II"},298.9,"x","0",0,0,0,0,"0",0,0,0,0,0,0,0,{"$nulls":5},{"v":0,"d":"0.0"},0,0,""]
[18,{"$f":"'Wettkampf 1'!B27","v":"Evers, Claudia"},{"$f":"'Wettkampf 1'!C27","v":"Neuvrees II"},300.9,"x","0",0,0,0,0,"0",0,0,0,0,0,0,0,{"$nulls":5},{"v":0,"d":"0.0"},0,0,""]
[19,{"$f":"'Wettkampf 1'!B28","v":"Schulte, Christina"},{"$f":"'Wettkampf 1'!C28","v":"Neuvrees II"},{"v":0,"d":"0.0"},"x","0",0,0,0,0,"0",0,0,0,0,0,0,0,{"$nulls":5},{"v":0,"d":"0.0"},1,0,""]
[20,{"$f":"'Wettkampf 1'!B29","v":"Reinelt, Michaela"},{"$f":"'Wettkampf 1'!C29","v":"Lahn IV"},310.3,null,310.3,0,0,0,0,0,0,310.3,1,0,0,0,0,{"$nulls":5},{"v":0,"d":"0.0"},0,0,""]
[21,{"$f":"'Wettkampf 1'!B30","v":"Thien, Marita"},{"$f":"'Wettkampf 1'!C30","v":"Lahn IV"},309.5,null,309.5,0,0,0,0,0,0,309.5,1,0,0,0,0,{"$nulls":5},{"v":0,"d":"0.0"},0,0,""]
[22,{"$f":"'Wettkampf 1'!B31","v":"Robben, Anja"},{"$f":"'Wettkampf 1'!C31","v":"Lahn IV"},{"v":309,"d":"309.0"},null,{"v":309,"d":"309.0"},0,0,0,0,0,0,309,1,0,0,0,0,{"$nulls":5},{"v":0,"d":"0.0"},0,0,""]
[23,{"$f":"'Wettkampf 1'!B32","v":"Oldopp, Maria"},{"$f":"'Wettkampf 1'!C32","v":"Lahn IV"},{"v":299,"d":"299.0"},"x","0",0,0,0,0,0,0,"0",0,0,0,0,0,{"$nulls":5},{"v":0,"d":"0.0"},0,0,""]
[24,{"$f":"'Wettkampf 1'!B33","v":"Hanneken, Doris"},{"$f":"'Wettkampf 1'!C33","v":"Lahn IV"},309.8,null,309.8,0,0,0,0,0,0,309.8,1,0,0,0,0,{"$nulls":5},{"v":0,"d":"0.0"},0,0,""]
[25,{"$f":"'Wettkampf 1'!B34","v":"Kuchta, Gertrud"},{"$f":"'Wettkampf 1'!C34","v":"Börger III"},304.3,null,304.3,0,0,0,0,0,0,0,0,304.3,1,0,0,{"$nulls":5},{"v":0,"d":"0.0"},0,0,""]
[26,{"$f":"'Wettkampf 1'!B35","v":"Jungsthöfel, Sabine"},{"$f":"'Wettkampf 1'!C35","v":"Börger III"},299.2,null,299.2,0,0,0,0,0,0,0,0,299.2,1,0,0,{"$nulls":5},{"v":0,"d":"0.0"},0,0,""]
[27,{"$f":"'Wettkampf 1'!B36","v":"Schwarte, Gundula"},{"$f":"'Wettkampf 1'!C36","v":"Börger III"},302.4,"x","0",0,0,0,0,0,0,0,0,"0",0,0,0,{"$nulls":5},{"v":0,"d":"0.0"},0,0,""]
[28,{"$f":"'Wettkampf 1'!B37","v":"Geers, Christa"},{"$f":"'Wettkampf 1'!C37","v":"Börger III"},303.7,null,303.7,0,0,0,0,0,0,0,0,303.7,1,0,0,{"$nulls":5},{"v":0,"d":"0.0"},0,0,""]
[29,{"$f":"'Wettkampf 1'!B38","v":"Remmers, Tanja"},{"$f":"'Wettkampf 1'!C38","v":"Börger III"},{"v":0,"d":"0.0"},"x","0",0,0,0,0,0,0,0,0,"0",0,0,0,{"$nulls":5},{"v":0,"d":"0.0"},1,0,""]
[30,{"$f":"'Wettkampf 1'!B39","v":"Terhalle, Johanna"},{"$f":"'Wettkampf 1'!C39","v":"Börger III"},{"v":309,"d":"309.0"},null,{"v":309,"d":"309.0"},0,0,0,0,0,0,0,0,309,1,0,0,{"$nulls":5},{"v":0,"d":"0.0"},0,0,""]
[31,{"$f":"'Wettkampf 1'!B40","v":"Hackstette, Lena"},{"$f":"'Wettkampf 1'!C40","v":"Lahn III"},{"v":306,"d":"306.0"},null,{"v":306,"d":"306.0"},0,0,0,0,0,0,0,0,0,0,306,1,{"$nulls":5},{"v":0,"d":"0.0"},0,0,""]
[32,{"$f":"'Wettkampf 1'!B41","v":"Thyen, Christel"},{"$f":"'Wettkampf 1'!C41","v":"Lahn III"},308.1,null,308.1,0,0,0,0,0,0,0,0,0,0,308.1,1,{"$nulls":5},{"v":0,"d":"0.0"},0,0,""]
[33,{"$f":"'Wettkampf 1'!B42","v":"Ostermann, Hildegard"},{"$f":"'Wettkampf 1'!C42","v":"Lahn III"},306.3,null,306.3,0,0,0,0,0,0,0,0,0,0,306.3,1,{"$nulls":5},{"v":0,"d":"0.0"},0,0,""]
[34,{"$f":"'Wettkampf 1'!B43","v":"Willoh, Henrika"},{"$f":"'Wettkampf 1'!C43","v":"Lahn III"},309.2,null,309.2,0,0,0,0,0,0,0,0,0,0,309.2,1,{"$nulls":5},{"v":0,"d":"0.0"},0,0,""]
[35,{"$f":"'Wettkampf 1'!B44","v":"Müller, Anita"},{"$f":"'Wettkampf 1'!C44","v":"Lahn III"},{"v":304,"d":"304.0"},"x","0",0,0,0,0,0,0,0,0,0,0,"0",0,{"$nulls":5},{"v":0,"d":"0.0"},0,0,""]
[36,{"$f":"'Wettkampf 1'!B45","v":"Wilken, Elena"},{"$f":"'Wettkampf 1'!C45","v":"Lahn III"},304.1,"x","0",0,0,0,0,0,0,0,0,0,0,"0",0,{"$nulls":5},{"v":0,"d":"0.0"},0,0,""]
[{"$nulls":6},{"$f":"LARGE(G10:G45,1)+LARGE(G10:G45,2)+LARGE(G10:G45,3)","v":930.4},{"$f":"SUM(H10:H45)","v":4},{"$f":"LARGE(I10:I45,1)+LARGE(I10:I45,2)+LARGE(I10:I45,3)","v":933.2},{"$f":"SUM(J10:J45)","v":4},{"$f":"LARGE(K10:K45,1)+LARGE(K10:K45,2)+LARGE(K10:K45,3)","v":920.9},{"$f":"SUM(L10:L45)","v":4},{"$f":"LARGE(M10:M45,1)+LARGE(M10:M45,2)+LARGE(M10:M45,3)","v":929.6},{"$f":"SUM(N10:N45)","v":4},{"$f":"LARGE(O10:O45,1)+LARGE(O10:O45,2)+LARGE(O10:O45,3)","v":917},{"$f":"SUM(P10:P45)","v":4},{"$f":"LARGE(Q10:Q45,1)+LARGE(Q10:Q45,2)+LARGE(Q10:Q45,3)","v":923.5999999999999},{"$f":"SUM(R10:S45)","v":4}]
[null,null,"per Email an: sk-huemmling@gmx.de"]

{"sheet":"7","index":7,"n_rows":47,"n_cols":27,"rows_kept":47,"merged":[[0,22,0,23],[1,22,1,23],[4,22,4,23],[5,22,5,23],[6,22,6,23],[8,20,8,23]]}
[null,"Verein / Gruppe",null,"Ergebnisse",{"$nulls":17},"Austragungsort:",{"$f":"Übersicht!L4","v":"Börger"}]
[1,{"$f":"'Wettkampf 1'!B2","v":"Börger II"},null,{"$f":"G46","v":923.6},{"$f":"IF(H46>4,\"Es sind zu viele Schützen in Wertung!\",\" \")","v":" "},{"$nulls":16},"Wettkampftag:",{"$f":"Übersicht!L3","v":"12.01."}]
[2,{"$f":"'Wettkampf 1'!B3","v":"Esterwegen V"},null,{"$f":"I46","v":938.1},{"$f":"IF(J46>4,\"Es sind zu viele Schützen in Wertung!\",\" \")","v":" "}]
[3,{"$f":"'Wettkampf 1'!B4","v":"Neuvrees II"},null,{"$f":"K46","v":{"v":922.5999999999999,"d":"922.6"}},{"$f":"IF(L46>4,\"Es sind zu viele Schützen in Wertung!\",\" \")","v":" "},{"$nulls":18},"Ansprechpartner für Rückfragen:"]
[4,{"$f":"'Wettkampf 1'!B5","v":"Lahn IV"},null,{"$f":"M46","v":{"v":925.5999999999999,"d":"925.6"}},{"$f":"IF(N46>4,\"Es sind zu viele Schützen in Wertung!\",\" \")","v":" "},{"$nulls":16},"Name:","Doris Hanneken"]
[5,{"$f":"'Wettkampf 1'!B6","v":"Börger III"},null,{"$f":"O46","v":924.8},{"$f":"IF(P46>4,\"Es sind zu viele Schützen in Wertung!\",\" \")","v":" "},{"$nulls":16},"Tel:","017-42215241"]
[6,{"$f":"'Wettkampf 1'!B7","v":"Lahn III"},null,{"$f":"Q46","v":{"v":931.4999999999999,"d":"931.5"}},{"$f":"IF(R46>4,\"Es sind zu viele Schützen in Wertung!\",\" \")","v":" "},{"$nulls":16},"Standaufsicht:","Doris Hanneken"]
[]
[null,"Einzelergebnisse:","Verein / Gruppe","Ergebnisse (mindestens 0 eintragen)","AW? Dann x eintippen",null,"Verein 1",null,"Verein 2",null,"Verein 3",null,"Verein 4",null,"Verein 5",null,"Verein 6",{"$nulls":3},"Proberechnung bei Streifen:"]
[1,{"$f":"'Wettkampf 1'!B10","v":"Kossenjans, Annegret"},{"$f":"'Wettkampf 1'!C10","v":"Börger II"},{"v":0,"d":"0.0"},"x",{"$f":"IF(E10=\"x\",\"0\",D10)","v":"0"},{"$f":"IF(C10=$B$2,F10,0)","v":"0"},{"$f":"(IF(AND($E10=\"\",$C10=$B$2),1,0))","v":0},{"$f":"IF($C10=$B$3,F10,0)","v":0},{"$f":"(IF(AND($E10=\"\",$C10=$B$3),1,0))","v":0},{"$f":"IF($C10=$B$4,F10,0)","v":0},{"$f":"(IF(AND($E10=\"\",$C10=$B$4),1,0))","v":0},{"$f":"IF($C10=$B$5,F10,0)","v":0},{"$f":"(IF(AND($E10=\"\",$C10=$B$5),1,0))","v":0},{"$f":"IF($C10=$B$6,F10,0)","v":0},{"$f":"(IF(AND($E10=\"\",$C10=$B$6),1,0))","v":0},{"$f":"IF($C10=$B$7,F10,0)","v":0},{"$f":"(IF(AND($E10=\"\",$C10=$B$7),1,0))","v":0},null,null,{"v":0,"d":"0.0"},{"v":0,"d":"0.0"},{"v":0,"d":"0.0"},{"$f":"U10+V10+W10","v":{"v":0,"d":"0.0"}},{"$f":"IF(X10=D10,1,0)","v":1},{"$f":"IF(X10=0,0,1)","v":0},{"$f":"IF(Y10+Z10=2,\"Korrekt\",\"\")","v":""}]
[2,{"$f":"'Wettkampf 1'!B11","v":"Jansen, Elisabeth"},{"$f":"'Wettkampf 1'!C11","v":"Börger II"},306.6,null,{"$f":"IF(E11=\"x\",\"0\",D11)","v":306.6},{"$f":"IF(C11=$B$2,F11,0)","v":306.6},{"$f":"(IF(AND($E11=\"\",$C11=$B$2),1,0))","v":1},{"$f":"IF($C11=$B$3,F11,0)","v":0},{"$f":"(IF(AND($E11=\"\",$C11=$B$3),1,0))","v":0},{"$f":"IF($C11=$B$4,F11,0)","v":0},{"$f":"(IF(AND($E11=\"\",$C11=$B$4),1,0))","v":0},{"$f":"IF($C11=$B$5,F11,0)","v":0},{"$f":"(IF(AND($E11=\"\",$C11=$B$5),1,0))","v":0},{"$f":"IF($C11=$B$6,F11,0)","v":0},{"$f":"(IF(AND($E11=\"\",$C11=$B$6),1,0))","v":0},{"$f":"IF($C11=$B$7,F11,0)","v":0},{"$f":"(IF(AND($E11=\"\",$C11=$B$7),1,0))","v":0},null,null,103.2,102.3,101.1,{"$f":"U11+V11+W11","v":306.6},{"$f":"IF(X11=D11,1,0)","v":1},{"$f":"IF(X11=0,0,1)","v":1},{"$f":"IF(Y11+Z11=2,\"Korrekt\",\"\")","v":"Korrekt"}]
[3,{"$f":"'Wettkampf 1'!B12","v":"Krömer, Monika"},{"$f":"'Wettkampf 1'!C12","v":"Börger II"},299.7,null,299.7,299.7,1,0,0,0,0,0,0,0,0,0,0,null,null,99.5,{"v":102,"d":"102.0"},98.2,299.7,1,1,"Korrekt"]
[4,{"$f":"'Wettkampf 1'!B13","v":"Pohlgeers, Margret"},{"$f":"'Wettkampf 1'!C13","v":"Börger II"},308.6,null,308.6,308.6,1,0,0,0,0,0,0,0,0,0,0,null,null,103.2,102.3,103.1,308.6,1,1,"Korrekt"]
[5,{"$f":"'Wettkampf 1'!B14","v":"Pohlgeers, Silvia"},{"$f":"'Wettkampf 1'!C14","v":"Börger II"},308.4,null,308.4,308.4,1,0,0,0,0,0,0,0,0,0,0,null,null,100.5,104.1,103.8,308.4,1,1,"Korrekt"]
[6,{"$f":"'Wettkampf 1'!B15","v":"Schwarte, Annette"},{"$f":"'Wettkampf 1'!C15","v":"Börger II"},{"v":0,"d":"0.0"},"x","0","0",0,0,0,0,0,0,0,0,0,0,0,null,null,{"v":0,"d":"0.0"},{"v":0,"d":"0.0"},{"v":0,"d":"0.0"},{"v":0,"d":"0.0"},1,0,""]
[7,{"$f":"'Wettkampf 1'!B16","v":"Lindemann, Kerstin"},{"$f":"'Wettkampf 1'!C16","v":"Esterwegen V"},310.5,null,310.5,0,0,310.5,1,0,0,0,0,0,0,0,0,null,null,102.2,104.7,103.6,310.5,1,1,"Korrekt"]
[8,{"$f":"'Wettkampf 1'!B17","v":"Schlarmann, Lena"},{"$f":"'Wettkampf 1'!C17","v":"Esterwegen V"},311.5,null,311.5,0,0,311.5,1,0,0,0,0,0,0,0,0,null,null,{"v":103,"d":"103.0"},104.7,103.8,311.5,1,1,"Korrekt"]
[9,{"$f":"'Wettkampf 1'!B18","v":"Lindemann, Stefanie"},{"$f":"'Wettkampf 1'!C18","v":"Esterwegen V"},306.6,null,306.6,0,0,306.6,1,0,0,0,0,0,0,0,0,null,null,{"v":104,"d":"104.0"},100.2,102.4,306.6,1,1,"Korrekt"]
[10,{"$f":"'Wettkampf 1'!B19","v":"Lindemann, Rita"},{"$f":"'Wettkampf 1'!C19","v":"Esterwegen V"},316.1,null,316.1,0,0,316.1,1,0,0,0,0,0,0,0,0,null,null,{"v":105,"d":"105.0"},106.3,104.8,316.1,1,1,"Korrekt"]
[11,{"$f":"'Wettkampf 1'!B20","v":"Büter, Daniela"},{"$f":"'Wettkampf 1'!C20","v":"Esterwegen V"},303.6,"x","0",0,0,"0",0,0,0,0,0,0,0,0,0,null,null,101.4,99.9,102.3,303.6,1,1,"Korrekt"]
[12,{"$f":"'Wettkampf 1'!B21","v":"Lindemann, Annemarie"},{"$f":"'Wettkampf 1'!C21","v":"Esterwegen V"},{"v":0,"d":"0.0"},"x","0",0,0,"0",0,0,0,0,0,0,0,0,0,null,null,{"v":0,"d":"0.0"},{"v":0,"d":"0.0"},{"v":0,"d":"0.0"},{"v":0,"d":"0.0"},1,0,""]
[13,{"$f":"'Wettkampf 1'!B22","v":"Preut, Susanne"},{"$f":"'Wettkampf 1'!C22","v":"Neuvrees II"},303.2,null,303.2,0,0,0,0,303.2,1,0,0,0,0,0,0,null,null,99.4,99.6,104.2,303.2,1,1,"Korrekt"]
[14,{"$f":"'Wettkampf 1'!B23","v":"Thunert, Silvia"},{"$f":"'Wettkampf 1'!C23","v":"Neuvrees II"},309.5,null,309.5,0,0,0,0,309.5,1,0,0,0,0,0,0,null,null,103.8,102.3,103.4,309.5,1,1,"Korrekt"]
[15,{"$f":"'Wettkampf 1'!B24","v":"Pohlmann, Margret"},{"$f":"'Wettkampf 1'!C24","v":"Neuvrees II"},309.9,null,309.9,0,0,0,0,309.9,1,0,0,0,0,0,0,null,null,103.9,102.9,103.1,309.9,1,1,"Korrekt"]
[16,{"$f":"'Wettkampf 1'!B25","v":"Eilermann, Saskia"},{"$f":"'Wettkampf 1'!C25","v":"Neuvrees II"},{"v":0,"d":"0.0"},"x","0",0,0,0,0,"0",0,0,0,0,0,0,0,null,null,{"v":0,"d":"0.0"},{"v":0,"d":"0.0"},{"v":0,"d":"0.0"},{"v":0,"d":"0.0"},1,0,""]
[17,{"$f":"'Wettkampf 1'!B26","v":"Junge, Silvia"},{"$f":"'Wettkampf 1'!C26","v":"Neuvrees II"},292.8,"x","0",0,0,0,0,"0",0,0,0,0,0,0,0,null,null,99.7,98.9,94.2,292.8,1,1,"Korrekt"]
[18,{"$f":"'Wettkampf 1'!B27","v":"Evers, Claudia"},{"$f":"'Wettkampf 1'!C27","v":"Neuvrees II"},301.3,"x","0",0,0,0,0,"0",0,0,0,0,0,0,0,null,null,{"v":98,"d":"98.0"},101.1,102.2,301.3,1,1,"Korrekt"]
[19,{"$f":"'Wettkampf 1'!B28","v":"Schulte, Christina"},{"$f":"'Wettkampf 1'!C28","v":"Neuvrees II"},303.1,null,303.1,0,0,0,0,303.1,1,0,0,0,0,0,0,null,null,99.2,101.8,102.1,303.1,1,1,"Korrekt"]
[20,{"$f":"'Wettkampf 1'!B29","v":"Reinelt, Michaela"},{"$f":"'Wettkampf 1'!C29","v":"Lahn IV"},308.2,null,308.2,0,0,0,0,0,0,308.2,1,0,0,0,0,null,null,102.4,103.5,102.3,308.2,1,1,"Korrekt"]
[21,{"$f":"'Wettkampf 1'!B30","v":"Thien, Marita"},{"$f":"'Wettkampf 1'!C30","v":"Lahn IV"},311.2,null,311.2,0,0,0,0,0,0,311.2,1,0,0,0,0,null,null,103.1,103.3,104.8,311.2,1,1,"Korrekt"]
[22,{"$f":"'Wettkampf 1'!B31","v":"Robben, Anja"},{"$f":"'Wettkampf 1'!C31","v":"Lahn IV"},306.2,null,306.2,0,0,0,0,0,0,306.2,1,0,0,0,0,null,null,100.8,102.6,102.8,306.2,1,1,"Korrekt"]
[23,{"$f":"'Wettkampf 1'!B32","v":"Oldopp, Maria"},{"$f":"'Wettkampf 1'!C32","v":"Lahn IV"},300.2,"x","0",0,0,0,0,0,0,"0",0,0,0,0,0,null,null,97.1,102.8,100.3,300.2,1,1,"Korrekt"]
[24,{"$f":"'Wettkampf 1'!B33","v":"Hanneken, Doris"},{"$f":"'Wettkampf 1'!C33","v":"Lahn IV"},{"v":300,"d":"300.0"},null,{"v":300,"d":"300.0"},0,0,0,0,0,0,300,1,0,0,0,0,null,null,101.2,98.7,100.1,{"v":300,"d":"300.0"},1,1,"Korrekt"]
[25,{"$f":"'Wettkampf 1'!B34","v":"Kuchta, Gertrud"},{"$f":"'Wettkampf 1'!C34","v":"Börger III"},306.7,null,306.7,0,0,0,0,0,0,0,0,306.7,1,0,0,null,null,102.3,102.1,102.3,306.7,1,1,"Korrekt"]
[26,{"$f":"'Wettkampf 1'!B35","v":"Jungsthöfel, Sabine"},{"$f":"'Wettkampf 1'!C35","v":"Börger III"},307.4,"x","0",0,0,0,0,0,0,0,0,"0",0,0,0,null,null,{"v":102,"d":"102.0"},103.6,101.8,307.4,1,1,"Korrekt"]
[27,{"$f":"'Wettkampf 1'!B36","v":"Schwarte, Gundula"},{"$f":"'Wettkampf 1'!C36","v":"Börger III"},300.6,null,300.6,0,0,0,0,0,0,0,0,300.6,1,0,0,null,null,100.4,99.2,{"v":101,"d":"101.0"},300.6,1,1,"Korrekt"]
[28,{"$f":"'Wettkampf 1'!B37","v":"Geers, Christa"},{"$f":"'Wettkampf 1'!C37","v":"Börger III"},306.2,null,306.2,0,0,0,0,0,0,0,0,306.2,1,0,0,null,null,103.7,102.5,{"v":100,"d":"100.0"},306.2,1,1,"Korrekt"]
[29,{"$f":"'Wettkampf 1'!B38","v":"Remmers, Tanja"},{"$f":"'Wettkampf 1'!C38","v":"Börger III"},290.7,"x","0",0,0,0,0,0,0,0,0,"0",0,0,0,null,null,96.6,99.6,94.5,290.7,1,1,"Korrekt"]
[30,{"$f":"'Wettkampf 1'!B39","v":"Terhalle, Johanna"},{"$f":"'Wettkampf 1'!C39","v":"Börger III"},311.9,null,311.9,0,0,0,0,0,0,0,0,311.9,1,0,0,null,null,103.4,104.2,104.3,{"v":311.90000000000003,"d":"311.9"},1,1,"Korrekt"]
[31,{"$f":"'Wettkampf 1'!B40","v":"Hackstette, Lena"},{"$f":"'Wettkampf 1'!C40","v":"Lahn III"},301.9,"x","0",0,0,0,0,0,0,0,0,0,0,"0",0,null,null,101.9,97.6,102.4,301.9,1,1,"Korrekt"]
[32,{"$f":"'Wettkampf 1'!B41","v":"Thyen, Christel"},{"$f":"'Wettkampf 1'!C41","v":"Lahn III"},313.4,null,313.4,0,0,0,0,0,0,0,0,0,0,313.4,1,null,null,105.8,103.2,104.4,313.4,1,1,"Korrekt"]
[33,{"$f":"'Wettkampf 1'!B42","v":"Ostermann, Hildegard"},{"$f":"'Wettkampf 1'!C42","v":"Lahn III"},299.3,null,299.3,0,0,0,0,0,0,0,0,0,0,299.3,1,null,null,99.7,99.6,{"v":100,"d":"100.0"},299.3,1,1,"Korrekt"]
[34,{"$f":"'Wettkampf 1'!B43","v":"Willoh, Henrika"},{"$f":"'Wettkampf 1'!C43","v":"Lahn III"},306.4,null,306.4,0,0,0,0,0,0,0,0,0,0,306.4,1,null,null,102.6,101.7,102.1,306.4,1,1,"Korrekt"]
[35,{"$f":"'Wettkampf 1'!B44","v":"Müller, Anita"},{"$f":"'Wettkampf 1'!C44","v":"Lahn III"},301.3,"x","0",0,0,0,0,0,0,0,0,0,0,"0",0,null,null,101.7,96.6,{"v":103,"d":"103.0"},301.3,1,1,"Korrekt"]
[36,{"$f":"'Wettkampf 1'!B45","v":"Wilken, Elena"},{"$f":"'Wettkampf 1'!C45","v":"Lahn III"},311.7,null,311.7,0,0,0,0,0,0,0,0,0,0,311.7,1,null,null,104.8,104.5,102.4,{"v":311.70000000000005,"d":"311.7"},1,1,"Korrekt"]
[{"$nulls":6},{"$f":"LARGE(G10:G45,1)+LARGE(G10:G45,2)+LARGE(G10:G45,3)","v":923.6},{"$f":"SUM(H10:H45)","v":4},{"$f":"LARGE(I10:I45,1)+LARGE(I10:I45,2)+LARGE(I10:I45,3)","v":938.1},{"$f":"SUM(J10:J45)","v":4},{"$f":"LARGE(K10:K45,1)+LARGE(K10:K45,2)+LARGE(K10:K45,3)","v":922.5999999999999},{"$f":"SUM(L10:L45)","v":4},{"$f":"LARGE(M10:M45,1)+LARGE(M10:M45,2)+LARGE(M10:M45,3)","v":925.5999999999999},{"$f":"SUM(N10:N45)","v":4},{"$f":"LARGE(O10:O45,1)+LARGE(O10:O45,2)+LARGE(O10:O45,3)","v":924.8},{"$f":"SUM(P10:P45)","v":4},{"$f":"LARGE(Q10:Q45,1)+LARGE(Q10:Q45,2)+LARGE(Q10:Q45,3)","v":931.4999999999999},{"$f":"SUM(R10:S45)","v":4}]
[null,null,"per Email an: sk-huemmling@gmx.de"]

{"sheet":"8","index":8,"n_rows":47,"n_cols":27,"rows_kept":47,"merged":[[0,22,0,23],[1,22,1,23],[4,22,4,23],[5,22,5,23],[6,22,6,23],[8,20,8,23]]}
[null,"Verein / Gruppe",null,"Ergebnisse",{"$nulls":17},"Austragungsort:",{"$f":"Übersicht!M4","v":"Esterwegen"}]
[1,{"$f":"'Wettkampf 1'!B2","v":"Börger II"},null,{"$f":"G46","v":{"v":923.1999999999999,"d":"923.2"}},{"$f":"IF(H46>4,\"Es sind zu viele Schützen in Wertung!\",\" \")","v":" "},{"$nulls":16},"Wettkampftag:",{"$f":"Übersicht!M3","v":"26.01."}]
[2,{"$f":"'Wettkampf 1'!B3","v":"Esterwegen V"},null,{"$f":"I46","v":938.2},{"$f":"IF(J46>4,\"Es sind zu viele Schützen in Wertung!\",\" \")","v":" "}]
[3,{"$f":"'Wettkampf 1'!B4","v":"Neuvrees II"},null,{"$f":"K46","v":{"v":916.3000000000001,"d":"916.3"}},{"$f":"IF(L46>4,\"Es sind zu viele Schützen in Wertung!\",\" \")","v":" "},{"$nulls":18},"Ansprechpartner für Rückfragen:"]
[4,{"$f":"'Wettkampf 1'!B5","v":"Lahn IV"},null,{"$f":"M46","v":924.4},{"$f":"IF(N46>4,\"Es sind zu viele Schützen in Wertung!\",\" \")","v":" "},{"$nulls":16},"Name:","Rita Lindemann"]
[5,{"$f":"'Wettkampf 1'!B6","v":"Börger III"},null,{"$f":"O46","v":913.1},{"$f":"IF(P46>4,\"Es sind zu viele Schützen in Wertung!\",\" \")","v":" "},{"$nulls":16},"Tel:","01737565170"]
[6,{"$f":"'Wettkampf 1'!B7","v":"Lahn III"},null,{"$f":"Q46","v":{"v":922.0000000000001,"d":"922.0"}},{"$f":"IF(R46>4,\"Es sind zu viele Schützen in Wertung!\",\" \")","v":" "},{"$nulls":16},"Standaufsicht:","Klaus Lindemann"]
[]
[null,"Einzelergebnisse:","Verein / Gruppe","Ergebnisse (mindestens 0 eintragen)","AW? Dann x eintippen",null,"Verein 1",null,"Verein 2",null,"Verein 3",null,"Verein 4",null,"Verein 5",null,"Verein 6",{"$nulls":3},"Proberechnung bei Streifen:"]
[1,{"$f":"'Wettkampf 1'!B10","v":"Kossenjans, Annegret"},{"$f":"'Wettkampf 1'!C10","v":"Börger II"},{"v":0,"d":"0.0"},"x",{"$f":"IF(E10=\"x\",\"0\",D10)","v":"0"},{"$f":"IF(C10=$B$2,F10,0)","v":"0"},{"$f":"(IF(AND($E10=\"\",$C10=$B$2),1,0))","v":0},{"$f":"IF($C10=$B$3,F10,0)","v":0},{"$f":"(IF(AND($E10=\"\",$C10=$B$3),1,0))","v":0},{"$f":"IF($C10=$B$4,F10,0)","v":0},{"$f":"(IF(AND($E10=\"\",$C10=$B$4),1,0))","v":0},{"$f":"IF($C10=$B$5,F10,0)","v":0},{"$f":"(IF(AND($E10=\"\",$C10=$B$5),1,0))","v":0},{"$f":"IF($C10=$B$6,F10,0)","v":0},{"$f":"(IF(AND($E10=\"\",$C10=$B$6),1,0))","v":0},{"$f":"IF($C10=$B$7,F10,0)","v":0},{"$f":"(IF(AND($E10=\"\",$C10=$B$7),1,0))","v":0},{"$nulls":5},{"$f":"U10+V10+W10","v":{"v":0,"d":"0.0"}},{"$f":"IF(X10=D10,1,0)","v":1},{"$f":"IF(X10=0,0,1)","v":0},{"$f":"IF(Y10+Z10=2,\"Korrekt\",\"\")","v":""}]
[2,{"$f":"'Wettkampf 1'!B11","v":"Jansen, Elisabeth"},{"$f":"'Wettkampf 1'!C11","v":"Börger II"},308.9,null,{"$f":"IF(E11=\"x\",\"0\",D11)","v":308.9},{"$f":"IF(C11=$B$2,F11,0)","v":308.9},{"$f":"(IF(AND($E11=\"\",$C11=$B$2),1,0))","v":1},{"$f":"IF($C11=$B$3,F11,0)","v":0},{"$f":"(IF(AND($E11=\"\",$C11=$B$3),1,0))","v":0},{"$f":"IF($C11=$B$4,F11,0)","v":0},{"$f":"(IF(AND($E11=\"\",$C11=$B$4),1,0))","v":0},{"$f":"IF($C11=$B$5,F11,0)","v":0},{"$f":"(IF(AND($E11=\"\",$C11=$B$5),1,0))","v":0},{"$f":"IF($C11=$B$6,F11,0)","v":0},{"$f":"(IF(AND($E11=\"\",$C11=$B$6),1,0))","v":0},{"$f":"IF($C11=$B$7,F11,0)","v":0},{"$f":"(IF(AND($E11=\"\",$C11=$B$7),1,0))","v":0},{"$nulls":5},{"$f":"U11+V11+W11","v":{"v":0,"d":"0.0"}},{"$f":"IF(X11=D11,1,0)","v":0},{"$f":"IF(X11=0,0,1)","v":0},{"$f":"IF(Y11+Z11=2,\"Korrekt\",\"\")","v":""}]
[3,{"$f":"'Wettkampf 1'!B12","v":"Krömer, Monika"},{"$f":"'Wettkampf 1'!C12","v":"Börger II"},292.8,null,292.8,292.8,1,0,0,0,0,0,0,0,0,0,0,{"$nulls":5},{"v":0,"d":"0.0"},0,0,""]
[4,{"$f":"'Wettkampf 1'!B13","v":"Pohlgeers, Margret"},{"$f":"'Wettkampf 1'!C13","v":"Börger II"},308.7,null,308.7,308.7,1,0,0,0,0,0,0,0,0,0,0,{"$nulls":5},{"v":0,"d":"0.0"},0,0,""]
[5,{"$f":"'Wettkampf 1'!B14","v":"Pohlgeers, Silvia"},{"$f":"'Wettkampf 1'!C14","v":"Börger II"},305.6,null,305.6,305.6,1,0,0,0,0,0,0,0,0,0,0,{"$nulls":5},{"v":0,"d":"0.0"},0,0,""]
[6,{"$f":"'Wettkampf 1'!B15","v":"Schwarte, Annette"},{"$f":"'Wettkampf 1'!C15","v":"Börger II"},{"v":0,"d":"0.0"},"x","0","0",0,0,0,0,0,0,0,0,0,0,0,{"$nulls":5},{"v":0,"d":"0.0"},1,0,""]
[7,{"$f":"'Wettkampf 1'!B16","v":"Lindemann, Kerstin"},{"$f":"'Wettkampf 1'!C16","v":"Esterwegen V"},309.3,null,309.3,0,0,309.3,1,0,0,0,0,0,0,0,0,{"$nulls":5},{"v":0,"d":"0.0"},0,0,""]
[8,{"$f":"'Wettkampf 1'!B17","v":"Schlarmann, Lena"},{"$f":"'Wettkampf 1'!C17","v":"Esterwegen V"},312.6,null,312.6,0,0,312.6,1,0,0,0,0,0,0,0,0,{"$nulls":5},{"v":0,"d":"0.0"},0,0,""]
[9,{"$f":"'Wettkampf 1'!B18","v":"Lindemann, Stefanie"},{"$f":"'Wettkampf 1'!C18","v":"Esterwegen V"},310.6,null,310.6,0,0,310.6,1,0,0,0,0,0,0,0,0,{"$nulls":5},{"v":0,"d":"0.0"},0,0,""]
[10,{"$f":"'Wettkampf 1'!B19","v":"Lindemann, Rita"},{"$f":"'Wettkampf 1'!C19","v":"Esterwegen V"},{"v":315,"d":"315.0"},null,{"v":315,"d":"315.0"},0,0,315,1,0,0,0,0,0,0,0,0,{"$nulls":5},{"v":0,"d":"0.0"},0,0,""]
[11,{"$f":"'Wettkampf 1'!B20","v":"Büter, Daniela"},{"$f":"'Wettkampf 1'!C20","v":"Esterwegen V"},308.5,"x","0",0,0,"0",0,0,0,0,0,0,0,0,0,{"$nulls":5},{"v":0,"d":"0.0"},0,0,""]
[12,{"$f":"'Wettkampf 1'!B21","v":"Lindemann, Annemarie"},{"$f":"'Wettkampf 1'!C21","v":"Esterwegen V"},{"v":0,"d":"0.0"},"x","0",0,0,"0",0,0,0,0,0,0,0,0,0,{"$nulls":5},{"v":0,"d":"0.0"},1,0,""]
[13,{"$f":"'Wettkampf 1'!B22","v":"Preut, Susanne"},{"$f":"'Wettkampf 1'!C22","v":"Neuvrees II"},304.6,null,304.6,0,0,0,0,304.6,1,0,0,0,0,0,0,{"$nulls":5},{"v":0,"d":"0.0"},0,0,""]
[14,{"$f":"'Wettkampf 1'!B23","v":"Thunert, Silvia"},{"$f":"'Wettkampf 1'!C23","v":"Neuvrees II"},306.6,null,306.6,0,0,0,0,306.6,1,0,0,0,0,0,0,{"$nulls":5},{"v":0,"d":"0.0"},0,0,""]
[15,{"$f":"'Wettkampf 1'!B24","v":"Pohlmann, Margret"},{"$f":"'Wettkampf 1'!C24","v":"Neuvrees II"},305.1,null,305.1,0,0,0,0,305.1,1,0,0,0,0,0,0,{"$nulls":5},{"v":0,"d":"0.0"},0,0,""]
[16,{"$f":"'Wettkampf 1'!B25","v":"Eilermann, Saskia"},{"$f":"'Wettkampf 1'!C25","v":"Neuvrees II"},{"v":0,"d":"0.0"},"x","0",0,0,0,0,"0",0,0,0,0,0,0,0,{"$nulls":5},{"v":0,"d":"0.0"},1,0,""]
[17,{"$f":"'Wettkampf 1'!B26","v":"Junge, Silvia"},{"$f":"'Wettkampf 1'!C26","v":"Neuvrees II"},287.4,"x","0",0,0,0,0,"0",0,0,0,0,0,0,0,{"$nulls":5},{"v":0,"d":"0.0"},0,0,""]
[18,{"$f":"'Wettkampf 1'!B27","v":"Evers, Claudia"},{"$f":"'Wettkampf 1'!C27","v":"Neuvrees II"},297.9,null,297.9,0,0,0,0,297.9,1,0,0,0,0,0,0,{"$nulls":5},{"v":0,"d":"0.0"},0,0,""]
[19,{"$f":"'Wettkampf 1'!B28","v":"Schulte, Christina"},{"$f":"'Wettkampf 1'!C28","v":"Neuvrees II"},{"v":0,"d":"0.0"},"x","0",0,0,0,0,"0",0,0,0,0,0,0,0,{"$nulls":5},{"v":0,"d":"0.0"},1,0,""]
[20,{"$f":"'Wettkampf 1'!B29","v":"Reinelt, Michaela"},{"$f":"'Wettkampf 1'!C29","v":"Lahn IV"},307.7,null,307.7,0,0,0,0,0,0,307.7,1,0,0,0,0,{"$nulls":5},{"v":0,"d":"0.0"},0,0,""]
[21,{"$f":"'Wettkampf 1'!B30","v":"Thien, Marita"},{"$f":"'Wettkampf 1'!C30","v":"Lahn IV"},312.3,null,312.3,0,0,0,0,0,0,312.3,1,0,0,0,0,{"$nulls":5},{"v":0,"d":"0.0"},0,0,""]
[22,{"$f":"'Wettkampf 1'!B31","v":"Robben, Anja"},{"$f":"'Wettkampf 1'!C31","v":"Lahn IV"},304.4,null,304.4,0,0,0,0,0,0,304.4,1,0,0,0,0,{"$nulls":5},{"v":0,"d":"0.0"},0,0,""]
[23,{"$f":"'Wettkampf 1'!B32","v":"Oldopp, Maria"},{"$f":"'Wettkampf 1'!C32","v":"Lahn IV"},299.1,"x","0",0,0,0,0,0,0,"0",0,0,0,0,0,{"$nulls":5},{"v":0,"d":"0.0"},0,0,""]
[24,{"$f":"'Wettkampf 1'!B33","v":"Hanneken, Doris"},{"$f":"'Wettkampf 1'!C33","v":"Lahn IV"},302.8,null,302.8,0,0,0,0,0,0,302.8,1,0,0,0,0,{"$nulls":5},{"v":0,"d":"0.0"},0,0,""]
[25,{"$f":"'Wettkampf 1'!B34","v":"Kuchta, Gertrud"},{"$f":"'Wettkampf 1'!C34","v":"Börger III"},303.4,null,303.4,0,0,0,0,0,0,0,0,303.4,1,0,0,{"$nulls":5},{"v":0,"d":"0.0"},0,0,""]
[26,{"$f":"'Wettkampf 1'!B35","v":"Jungsthöfel, Sabine"},{"$f":"'Wettkampf 1'!C35","v":"Börger III"},300.4,null,300.4,0,0,0,0,0,0,0,0,300.4,1,0,0,{"$nulls":5},{"v":0,"d":"0.0"},0,0,""]
[27,{"$f":"'Wettkampf 1'!B36","v":"Schwarte, Gundula"},{"$f":"'Wettkampf 1'!C36","v":"Börger III"},306.5,"x","0",0,0,0,0,0,0,0,0,"0",0,0,0,{"$nulls":5},{"v":0,"d":"0.0"},0,0,""]
[28,{"$f":"'Wettkampf 1'!B37","v":"Geers, Christa"},{"$f":"'Wettkampf 1'!C37","v":"Börger III"},299.1,null,299.1,0,0,0,0,0,0,0,0,299.1,1,0,0,{"$nulls":5},{"v":0,"d":"0.0"},0,0,""]
[29,{"$f":"'Wettkampf 1'!B38","v":"Remmers, Tanja"},{"$f":"'Wettkampf 1'!C38","v":"Börger III"},{"v":286,"d":"286.0"},"x","0",0,0,0,0,0,0,0,0,"0",0,0,0,{"$nulls":5},{"v":0,"d":"0.0"},0,0,""]
[30,{"$f":"'Wettkampf 1'!B39","v":"Terhalle, Johanna"},{"$f":"'Wettkampf 1'!C39","v":"Börger III"},309.3,null,309.3,0,0,0,0,0,0,0,0,309.3,1,0,0,{"$nulls":5},{"v":0,"d":"0.0"},0,0,""]
[31,{"$f":"'Wettkampf 1'!B40","v":"Hackstette, Lena"},{"$f":"'Wettkampf 1'!C40","v":"Lahn III"},309.4,"x","0",0,0,0,0,0,0,0,0,0,0,"0",0,{"$nulls":5},{"v":0,"d":"0.0"},0,0,""]
[32,{"$f":"'Wettkampf 1'!B41","v":"Thyen, Christel"},{"$f":"'Wettkampf 1'!C41","v":"Lahn III"},306.1,null,306.1,0,0,0,0,0,0,0,0,0,0,306.1,1,{"$nulls":5},{"v":0,"d":"0.0"},0,0,""]
[33,{"$f":"'Wettkampf 1'!B42","v":"Ostermann, Hildegard"},{"$f":"'Wettkampf 1'!C42","v":"Lahn III"},306.1,null,306.1,0,0,0,0,0,0,0,0,0,0,306.1,1,{"$nulls":5},{"v":0,"d":"0.0"},0,0,""]
[34,{"$f":"'Wettkampf 1'!B43","v":"Willoh, Henrika"},{"$f":"'Wettkampf 1'!C43","v":"Lahn III"},309.8,null,309.8,0,0,0,0,0,0,0,0,0,0,309.8,1,{"$nulls":5},{"v":0,"d":"0.0"},0,0,""]
[35,{"$f":"'Wettkampf 1'!B44","v":"Müller, Anita"},{"$f":"'Wettkampf 1'!C44","v":"Lahn III"},306.6,"x","0",0,0,0,0,0,0,0,0,0,0,"0",0,{"$nulls":5},{"v":0,"d":"0.0"},0,0,""]
[36,{"$f":"'Wettkampf 1'!B45","v":"Wilken, Elena"},{"$f":"'Wettkampf 1'!C45","v":"Lahn III"},{"v":305,"d":"305.0"},null,{"v":305,"d":"305.0"},0,0,0,0,0,0,0,0,0,0,305,1,{"$nulls":5},{"v":0,"d":"0.0"},0,0,""]
[{"$nulls":6},{"$f":"LARGE(G10:G45,1)+LARGE(G10:G45,2)+LARGE(G10:G45,3)","v":923.1999999999999},{"$f":"SUM(H10:H45)","v":4},{"$f":"LARGE(I10:I45,1)+LARGE(I10:I45,2)+LARGE(I10:I45,3)","v":938.2},{"$f":"SUM(J10:J45)","v":4},{"$f":"LARGE(K10:K45,1)+LARGE(K10:K45,2)+LARGE(K10:K45,3)","v":916.3000000000001},{"$f":"SUM(L10:L45)","v":4},{"$f":"LARGE(M10:M45,1)+LARGE(M10:M45,2)+LARGE(M10:M45,3)","v":924.4},{"$f":"SUM(N10:N45)","v":4},{"$f":"LARGE(O10:O45,1)+LARGE(O10:O45,2)+LARGE(O10:O45,3)","v":913.1},{"$f":"SUM(P10:P45)","v":4},{"$f":"LARGE(Q10:Q45,1)+LARGE(Q10:Q45,2)+LARGE(Q10:Q45,3)","v":922.0000000000001},{"$f":"SUM(R10:S45)","v":4}]
[null,null,"per Email an: sk-huemmling@gmx.de"]

{"sheet":"9","index":9,"n_rows":47,"n_cols":27,"rows_kept":47,"merged":[[0,22,0,23],[1,22,1,23],[4,22,4,23],[5,22,5,23],[6,22,6,23],[8,20,8,23]]}
[null,"Verein / Gruppe",null,"Ergebnisse",{"$nulls":17},"Austragungsort:",{"$f":"Übersicht!N4","v":"Neuvrees"}]
[1,{"$f":"'Wettkampf 1'!B2","v":"Börger II"},null,{"$f":"G46","v":{"v":919.5999999999999,"d":"919.6"}},{"$f":"IF(H46>4,\"Es sind zu viele Schützen in Wertung!\",\" \")","v":" "},{"$nulls":16},"Wettkampftag:",{"$f":"Übersicht!N3","v":"09.02."}]
[2,{"$f":"'Wettkampf 1'!B3","v":"Esterwegen V"},null,{"$f":"I46","v":932.4},{"$f":"IF(J46>4,\"Es sind zu viele Schützen in Wertung!\",\" \")","v":" "}]
[3,{"$f":"'Wettkampf 1'!B4","v":"Neuvrees II"},null,{"$f":"K46","v":925.6},{"$f":"IF(L46>4,\"Es sind zu viele Schützen in Wertung!\",\" \")","v":" "},{"$nulls":18},"Ansprechpartner für Rückfragen:"]
[4,{"$f":"'Wettkampf 1'!B5","v":"Lahn IV"},null,{"$f":"M46","v":928.4},{"$f":"IF(N46>4,\"Es sind zu viele Schützen in Wertung!\",\" \")","v":" "},{"$nulls":16},"Name:","Silvia Thunert"]
[5,{"$f":"'Wettkampf 1'!B6","v":"Börger III"},null,{"$f":"O46","v":{"v":925.4000000000001,"d":"925.4"}},{"$f":"IF(P46>4,\"Es sind zu viele Schützen in Wertung!\",\" \")","v":" "},{"$nulls":16},"Tel:","04493-998686"]
[6,{"$f":"'Wettkampf 1'!B7","v":"Lahn III"},null,{"$f":"Q46","v":{"v":921.6999999999999,"d":"921.7"}},{"$f":"IF(R46>4,\"Es sind zu viele Schützen in Wertung!\",\" \")","v":" "},{"$nulls":16},"Standaufsicht:","Silvia Thunert"]
[]
[null,"Einzelergebnisse:","Verein / Gruppe","Ergebnisse (mindestens 0 eintragen)","AW? Dann x eintippen",null,"Verein 1",null,"Verein 2",null,"Verein 3",null,"Verein 4",null,"Verein 5",null,"Verein 6",{"$nulls":3},"Proberechnung bei Streifen:"]
[1,{"$f":"'Wettkampf 1'!B10","v":"Kossenjans, Annegret"},{"$f":"'Wettkampf 1'!C10","v":"Börger II"},null,"x",{"$f":"IF(E10=\"x\",\"0\",D10)","v":"0"},{"$f":"IF(C10=$B$2,F10,0)","v":"0"},{"$f":"(IF(AND($E10=\"\",$C10=$B$2),1,0))","v":0},{"$f":"IF($C10=$B$3,F10,0)","v":0},{"$f":"(IF(AND($E10=\"\",$C10=$B$3),1,0))","v":0},{"$f":"IF($C10=$B$4,F10,0)","v":0},{"$f":"(IF(AND($E10=\"\",$C10=$B$4),1,0))","v":0},{"$f":"IF($C10=$B$5,F10,0)","v":0},{"$f":"(IF(AND($E10=\"\",$C10=$B$5),1,0))","v":0},{"$f":"IF($C10=$B$6,F10,0)","v":0},{"$f":"(IF(AND($E10=\"\",$C10=$B$6),1,0))","v":0},{"$f":"IF($C10=$B$7,F10,0)","v":0},{"$f":"(IF(AND($E10=\"\",$C10=$B$7),1,0))","v":0},{"$nulls":5},{"$f":"U10+V10+W10","v":{"v":0,"d":"0.0"}},{"$f":"IF(X10=D10,1,0)","v":1},{"$f":"IF(X10=0,0,1)","v":0},{"$f":"IF(Y10+Z10=2,\"Korrekt\",\"\")","v":""}]
[2,{"$f":"'Wettkampf 1'!B11","v":"Jansen, Elisabeth"},{"$f":"'Wettkampf 1'!C11","v":"Börger II"},307.3,null,{"$f":"IF(E11=\"x\",\"0\",D11)","v":307.3},{"$f":"IF(C11=$B$2,F11,0)","v":307.3},{"$f":"(IF(AND($E11=\"\",$C11=$B$2),1,0))","v":1},{"$f":"IF($C11=$B$3,F11,0)","v":0},{"$f":"(IF(AND($E11=\"\",$C11=$B$3),1,0))","v":0},{"$f":"IF($C11=$B$4,F11,0)","v":0},{"$f":"(IF(AND($E11=\"\",$C11=$B$4),1,0))","v":0},{"$f":"IF($C11=$B$5,F11,0)","v":0},{"$f":"(IF(AND($E11=\"\",$C11=$B$5),1,0))","v":0},{"$f":"IF($C11=$B$6,F11,0)","v":0},{"$f":"(IF(AND($E11=\"\",$C11=$B$6),1,0))","v":0},{"$f":"IF($C11=$B$7,F11,0)","v":0},{"$f":"(IF(AND($E11=\"\",$C11=$B$7),1,0))","v":0},{"$nulls":5},{"$f":"U11+V11+W11","v":{"v":0,"d":"0.0"}},{"$f":"IF(X11=D11,1,0)","v":0},{"$f":"IF(X11=0,0,1)","v":0},{"$f":"IF(Y11+Z11=2,\"Korrekt\",\"\")","v":""}]
[3,{"$f":"'Wettkampf 1'!B12","v":"Krömer, Monika"},{"$f":"'Wettkampf 1'!C12","v":"Börger II"},290.4,null,290.4,290.4,1,0,0,0,0,0,0,0,0,0,0,{"$nulls":5},{"v":0,"d":"0.0"},0,0,""]
[4,{"$f":"'Wettkampf 1'!B13","v":"Pohlgeers, Margret"},{"$f":"'Wettkampf 1'!C13","v":"Börger II"},{"v":309,"d":"309.0"},null,{"v":309,"d":"309.0"},309,1,0,0,0,0,0,0,0,0,0,0,{"$nulls":5},{"v":0,"d":"0.0"},0,0,""]
[5,{"$f":"'Wettkampf 1'!B14","v":"Pohlgeers, Silvia"},{"$f":"'Wettkampf 1'!C14","v":"Börger II"},303.3,null,303.3,303.3,1,0,0,0,0,0,0,0,0,0,0,{"$nulls":5},{"v":0,"d":"0.0"},0,0,""]
[6,{"$f":"'Wettkampf 1'!B15","v":"Schwarte, Annette"},{"$f":"'Wettkampf 1'!C15","v":"Börger II"},null,"x","0","0",0,0,0,0,0,0,0,0,0,0,0,{"$nulls":5},{"v":0,"d":"0.0"},1,0,""]
[7,{"$f":"'Wettkampf 1'!B16","v":"Lindemann, Kerstin"},{"$f":"'Wettkampf 1'!C16","v":"Esterwegen V"},307.5,null,307.5,0,0,307.5,1,0,0,0,0,0,0,0,0,{"$nulls":5},{"v":0,"d":"0.0"},0,0,""]
[8,{"$f":"'Wettkampf 1'!B17","v":"Schlarmann, Lena"},{"$f":"'Wettkampf 1'!C17","v":"Esterwegen V"},304.5,null,304.5,0,0,304.5,1,0,0,0,0,0,0,0,0,{"$nulls":5},{"v":0,"d":"0.0"},0,0,""]
[9,{"$f":"'Wettkampf 1'!B18","v":"Lindemann, Stefanie"},{"$f":"'Wettkampf 1'!C18","v":"Esterwegen V"},307.7,null,307.7,0,0,307.7,1,0,0,0,0,0,0,0,0,{"$nulls":5},{"v":0,"d":"0.0"},0,0,""]
[10,{"$f":"'Wettkampf 1'!B19","v":"Lindemann, Rita"},{"$f":"'Wettkampf 1'!C19","v":"Esterwegen V"},317.2,null,317.2,0,0,317.2,1,0,0,0,0,0,0,0,0,{"$nulls":5},{"v":0,"d":"0.0"},0,0,""]
[11,{"$f":"'Wettkampf 1'!B20","v":"Büter, Daniela"},{"$f":"'Wettkampf 1'!C20","v":"Esterwegen V"},295.8,"x","0",0,0,"0",0,0,0,0,0,0,0,0,0,{"$nulls":5},{"v":0,"d":"0.0"},0,0,""]
[12,{"$f":"'Wettkampf 1'!B21","v":"Lindemann, Annemarie"},{"$f":"'Wettkampf 1'!C21","v":"Esterwegen V"},null,"x","0",0,0,"0",0,0,0,0,0,0,0,0,0,{"$nulls":5},{"v":0,"d":"0.0"},1,0,""]
[13,{"$f":"'Wettkampf 1'!B22","v":"Preut, Susanne"},{"$f":"'Wettkampf 1'!C22","v":"Neuvrees II"},null,null,{"v":0,"d":"0.0"},0,0,0,0,0,1,0,0,0,0,0,0,{"$nulls":5},{"v":0,"d":"0.0"},1,0,""]
[14,{"$f":"'Wettkampf 1'!B23","v":"Thunert, Silvia"},{"$f":"'Wettkampf 1'!C23","v":"Neuvrees II"},306.9,null,306.9,0,0,0,0,306.9,1,0,0,0,0,0,0,{"$nulls":5},{"v":0,"d":"0.0"},0,0,""]
[15,{"$f":"'Wettkampf 1'!B24","v":"Pohlmann, Margret"},{"$f":"'Wettkampf 1'!C24","v":"Neuvrees II"},308.4,null,308.4,0,0,0,0,308.4,1,0,0,0,0,0,0,{"$nulls":5},{"v":0,"d":"0.0"},0,0,""]
[16,{"$f":"'Wettkampf 1'!B25","v":"Eilermann, Saskia"},{"$f":"'Wettkampf 1'!C25","v":"Neuvrees II"},310.3,null,310.3,0,0,0,0,310.3,1,0,0,0,0,0,0,{"$nulls":5},{"v":0,"d":"0.0"},0,0,""]
[17,{"$f":"'Wettkampf 1'!B26","v":"Junge, Silvia"},{"$f":"'Wettkampf 1'!C26","v":"Neuvrees II"},305.4,"x","0",0,0,0,0,"0",0,0,0,0,0,0,0,{"$nulls":5},{"v":0,"d":"0.0"},0,0,""]
[18,{"$f":"'Wettkampf 1'!B27","v":"Evers, Claudia"},{"$f":"'Wettkampf 1'!C27","v":"Neuvrees II"},302.6,"x","0",0,0,0,0,"0",0,0,0,0,0,0,0,{"$nulls":5},{"v":0,"d":"0.0"},0,0,""]
[19,{"$f":"'Wettkampf 1'!B28","v":"Schulte, Christina"},{"$f":"'Wettkampf 1'!C28","v":"Neuvrees II"},null,"x","0",0,0,0,0,"0",0,0,0,0,0,0,0,{"$nulls":5},{"v":0,"d":"0.0"},1,0,""]
[20,{"$f":"'Wettkampf 1'!B29","v":"Reinelt, Michaela"},{"$f":"'Wettkampf 1'!C29","v":"Lahn IV"},310.2,null,310.2,0,0,0,0,0,0,310.2,1,0,0,0,0,{"$nulls":5},{"v":0,"d":"0.0"},0,0,""]
[21,{"$f":"'Wettkampf 1'!B30","v":"Thien, Marita"},{"$f":"'Wettkampf 1'!C30","v":"Lahn IV"},310.3,null,310.3,0,0,0,0,0,0,310.3,1,0,0,0,0,{"$nulls":5},{"v":0,"d":"0.0"},0,0,""]
[22,{"$f":"'Wettkampf 1'!B31","v":"Robben, Anja"},{"$f":"'Wettkampf 1'!C31","v":"Lahn IV"},307.9,null,307.9,0,0,0,0,0,0,307.9,1,0,0,0,0,{"$nulls":5},{"v":0,"d":"0.0"},0,0,""]
[23,{"$f":"'Wettkampf 1'!B32","v":"Oldopp, Maria"},{"$f":"'Wettkampf 1'!C32","v":"Lahn IV"},{"v":302,"d":"302.0"},"x","0",0,0,0,0,0,0,"0",0,0,0,0,0,{"$nulls":5},{"v":0,"d":"0.0"},0,0,""]
[24,{"$f":"'Wettkampf 1'!B33","v":"Hanneken, Doris"},{"$f":"'Wettkampf 1'!C33","v":"Lahn IV"},303.9,null,303.9,0,0,0,0,0,0,303.9,1,0,0,0,0,{"$nulls":5},{"v":0,"d":"0.0"},0,0,""]
[25,{"$f":"'Wettkampf 1'!B34","v":"Kuchta, Gertrud"},{"$f":"'Wettkampf 1'!C34","v":"Börger III"},311.1,null,311.1,0,0,0,0,0,0,0,0,311.1,1,0,0,{"$nulls":5},{"v":0,"d":"0.0"},0,0,""]
[26,{"$f":"'Wettkampf 1'!B35","v":"Jungsthöfel, Sabine"},{"$f":"'Wettkampf 1'!C35","v":"Börger III"},298.1,"x","0",0,0,0,0,0,0,0,0,"0",0,0,0,{"$nulls":5},{"v":0,"d":"0.0"},0,0,""]
[27,{"$f":"'Wettkampf 1'!B36","v":"Schwarte, Gundula"},{"$f":"'Wettkampf 1'!C36","v":"Börger III"},301.9,null,301.9,0,0,0,0,0,0,0,0,301.9,1,0,0,{"$nulls":5},{"v":0,"d":"0.0"},0,0,""]
[28,{"$f":"'Wettkampf 1'!B37","v":"Geers, Christa"},{"$f":"'Wettkampf 1'!C37","v":"Börger III"},305.2,null,305.2,0,0,0,0,0,0,0,0,305.2,1,0,0,{"$nulls":5},{"v":0,"d":"0.0"},0,0,""]
[29,{"$f":"'Wettkampf 1'!B38","v":"Remmers, Tanja"},{"$f":"'Wettkampf 1'!C38","v":"Börger III"},301.8,"x","0",0,0,0,0,0,0,0,0,"0",0,0,0,{"$nulls":5},{"v":0,"d":"0.0"},0,0,""]
[30,{"$f":"'Wettkampf 1'!B39","v":"Terhalle, Johanna"},{"$f":"'Wettkampf 1'!C39","v":"Börger III"},309.1,null,309.1,0,0,0,0,0,0,0,0,309.1,1,0,0,{"$nulls":5},{"v":0,"d":"0.0"},0,0,""]
[31,{"$f":"'Wettkampf 1'!B40","v":"Hackstette, Lena"},{"$f":"'Wettkampf 1'!C40","v":"Lahn III"},305.6,null,305.6,0,0,0,0,0,0,0,0,0,0,305.6,1,{"$nulls":5},{"v":0,"d":"0.0"},0,0,""]
[32,{"$f":"'Wettkampf 1'!B41","v":"Thyen, Christel"},{"$f":"'Wettkampf 1'!C41","v":"Lahn III"},305.7,null,305.7,0,0,0,0,0,0,0,0,0,0,305.7,1,{"$nulls":5},{"v":0,"d":"0.0"},0,0,""]
[33,{"$f":"'Wettkampf 1'!B42","v":"Ostermann, Hildegard"},{"$f":"'Wettkampf 1'!C42","v":"Lahn III"},301.4,null,301.4,0,0,0,0,0,0,0,0,0,0,301.4,1,{"$nulls":5},{"v":0,"d":"0.0"},0,0,""]
[34,{"$f":"'Wettkampf 1'!B43","v":"Willoh, Henrika"},{"$f":"'Wettkampf 1'!C43","v":"Lahn III"},310.4,null,310.4,0,0,0,0,0,0,0,0,0,0,310.4,1,{"$nulls":5},{"v":0,"d":"0.0"},0,0,""]
[35,{"$f":"'Wettkampf 1'!B44","v":"Müller, Anita"},{"$f":"'Wettkampf 1'!C44","v":"Lahn III"},{"v":304,"d":"304.0"},"x","0",0,0,0,0,0,0,0,0,0,0,"0",0,{"$nulls":5},{"v":0,"d":"0.0"},0,0,""]
[36,{"$f":"'Wettkampf 1'!B45","v":"Wilken, Elena"},{"$f":"'Wettkampf 1'!C45","v":"Lahn III"},308.5,"x","0",0,0,0,0,0,0,0,0,0,0,"0",0,{"$nulls":5},{"v":0,"d":"0.0"},0,0,""]
[{"$nulls":6},{"$f":"LARGE(G10:G45,1)+LARGE(G10:G45,2)+LARGE(G10:G45,3)","v":919.5999999999999},{"$f":"SUM(H10:H45)","v":4},{"$f":"LARGE(I10:I45,1)+LARGE(I10:I45,2)+LARGE(I10:I45,3)","v":932.4},{"$f":"SUM(J10:J45)","v":4},{"$f":"LARGE(K10:K45,1)+LARGE(K10:K45,2)+LARGE(K10:K45,3)","v":925.6},{"$f":"SUM(L10:L45)","v":4},{"$f":"LARGE(M10:M45,1)+LARGE(M10:M45,2)+LARGE(M10:M45,3)","v":928.4},{"$f":"SUM(N10:N45)","v":4},{"$f":"LARGE(O10:O45,1)+LARGE(O10:O45,2)+LARGE(O10:O45,3)","v":925.4000000000001},{"$f":"SUM(P10:P45)","v":4},{"$f":"LARGE(Q10:Q45,1)+LARGE(Q10:Q45,2)+LARGE(Q10:Q45,3)","v":921.6999999999999},{"$f":"SUM(R10:S45)","v":4}]
[null,null,"per Email an: sk-huemmling@gmx.de"]

{"sheet":"10","index":10,"n_rows":47,"n_cols":27,"rows_kept":47,"merged":[[0,22,0,23],[1,22,1,23],[4,22,4,23],[5,22,5,23],[6,22,6,23],[8,20,8,23]]}
[null,"Verein / Gruppe",null,"Ergebnisse",{"$nulls":17},"Austragungsort:",{"$f":"Übersicht!O4","v":"Börger"}]
[1,{"$f":"'Wettkampf 1'!B2","v":"Börger II"},null,{"$f":"G46","v":{"v":922.0999999999999,"d":"922.1"}},{"$f":"IF(H46>4,\"Es sind zu viele Schützen in Wertung!\",\" \")","v":" "},{"$nulls":16},"Wettkampftag:",{"$f":"Übersicht!O3","v":"23.02."}]
[2,{"$f":"'Wettkampf 1'!B3","v":"Esterwegen V"},null,{"$f":"I46","v":937.8},{"$f":"IF(J46>4,\"Es sind zu viele Schützen in Wertung!\",\" \")","v":" "}]
[3,{"$f":"'Wettkampf 1'!B4","v":"Neuvrees II"},null,{"$f":"K46","v":924.4},{"$f":"IF(L46>4,\"Es sind zu viele Schützen in Wertung!\",\" \")","v":" "},{"$nulls":18},"Ansprechpartner für Rückfragen:"]
[4,{"$f":"'Wettkampf 1'!B5","v":"Lahn IV"},null,{"$f":"M46","v":{"v":935,"d":"935.0"}},{"$f":"IF(N46>4,\"Es sind zu viele Schützen in Wertung!\",\" \")","v":" "},{"$nulls":16},"Name:","Margret Pohlgeers"]
[5,{"$f":"'Wettkampf 1'!B6","v":"Börger III"},null,{"$f":"O46","v":915.2},{"$f":"IF(P46>4,\"Es sind zu viele Schützen in Wertung!\",\" \")","v":" "},{"$nulls":16},"Tel:","059538976"]
[6,{"$f":"'Wettkampf 1'!B7","v":"Lahn III"},null,{"$f":"Q46","v":928.8},{"$f":"IF(R46>4,\"Es sind zu viele Schützen in Wertung!\",\" \")","v":" "},{"$nulls":16},"Standaufsicht:","Pohlgeers Geers"]
[]
[null,"Einzelergebnisse:","Verein / Gruppe","Ergebnisse (mindestens 0 eintragen)","AW? Dann x eintippen",null,"Verein 1",null,"Verein 2",null,"Verein 3",null,"Verein 4",null,"Verein 5",null,"Verein 6",{"$nulls":3},"Proberechnung bei Streifen:"]
[1,{"$f":"'Wettkampf 1'!B10","v":"Kossenjans, Annegret"},{"$f":"'Wettkampf 1'!C10","v":"Börger II"},{"v":0,"d":"0.0"},"x",{"$f":"IF(E10=\"x\",\"0\",D10)","v":"0"},{"$f":"IF(C10=$B$2,F10,0)","v":"0"},{"$f":"(IF(AND($E10=\"\",$C10=$B$2),1,0))","v":0},{"$f":"IF($C10=$B$3,F10,0)","v":0},{"$f":"(IF(AND($E10=\"\",$C10=$B$3),1,0))","v":0},{"$f":"IF($C10=$B$4,F10,0)","v":0},{"$f":"(IF(AND($E10=\"\",$C10=$B$4),1,0))","v":0},{"$f":"IF($C10=$B$5,F10,0)","v":0},{"$f":"(IF(AND($E10=\"\",$C10=$B$5),1,0))","v":0},{"$f":"IF($C10=$B$6,F10,0)","v":0},{"$f":"(IF(AND($E10=\"\",$C10=$B$6),1,0))","v":0},{"$f":"IF($C10=$B$7,F10,0)","v":0},{"$f":"(IF(AND($E10=\"\",$C10=$B$7),1,0))","v":0},{"$nulls":5},{"$f":"U10+V10+W10","v":{"v":0,"d":"0.0"}},{"$f":"IF(X10=D10,1,0)","v":1},{"$f":"IF(X10=0,0,1)","v":0},{"$f":"IF(Y10+Z10=2,\"Korrekt\",\"\")","v":""}]
[2,{"$f":"'Wettkampf 1'!B11","v":"Jansen, Elisabeth"},{"$f":"'Wettkampf 1'!C11","v":"Börger II"},306.6,null,{"$f":"IF(E11=\"x\",\"0\",D11)","v":306.6},{"$f":"IF(C11=$B$2,F11,0)","v":306.6},{"$f":"(IF(AND($E11=\"\",$C11=$B$2),1,0))","v":1},{"$f":"IF($C11=$B$3,F11,0)","v":0},{"$f":"(IF(AND($E11=\"\",$C11=$B$3),1,0))","v":0},{"$f":"IF($C11=$B$4,F11,0)","v":0},{"$f":"(IF(AND($E11=\"\",$C11=$B$4),1,0))","v":0},{"$f":"IF($C11=$B$5,F11,0)","v":0},{"$f":"(IF(AND($E11=\"\",$C11=$B$5),1,0))","v":0},{"$f":"IF($C11=$B$6,F11,0)","v":0},{"$f":"(IF(AND($E11=\"\",$C11=$B$6),1,0))","v":0},{"$f":"IF($C11=$B$7,F11,0)","v":0},{"$f":"(IF(AND($E11=\"\",$C11=$B$7),1,0))","v":0},{"$nulls":5},{"$f":"U11+V11+W11","v":{"v":0,"d":"0.0"}},{"$f":"IF(X11=D11,1,0)","v":0},{"$f":"IF(X11=0,0,1)","v":0},{"$f":"IF(Y11+Z11=2,\"Korrekt\",\"\")","v":""}]
[3,{"$f":"'Wettkampf 1'!B12","v":"Krömer, Monika"},{"$f":"'Wettkampf 1'!C12","v":"Börger II"},292.8,null,292.8,292.8,1,0,0,0,0,0,0,0,0,0,0,{"$nulls":5},{"v":0,"d":"0.0"},0,0,""]
[4,{"$f":"'Wettkampf 1'!B13","v":"Pohlgeers, Margret"},{"$f":"'Wettkampf 1'!C13","v":"Börger II"},309.2,null,309.2,309.2,1,0,0,0,0,0,0,0,0,0,0,{"$nulls":5},{"v":0,"d":"0.0"},0,0,""]
[5,{"$f":"'Wettkampf 1'!B14","v":"Pohlgeers, Silvia"},{"$f":"'Wettkampf 1'!C14","v":"Börger II"},306.3,null,306.3,306.3,1,0,0,0,0,0,0,0,0,0,0,{"$nulls":5},{"v":0,"d":"0.0"},0,0,""]
[6,{"$f":"'Wettkampf 1'!B15","v":"Schwarte, Annette"},{"$f":"'Wettkampf 1'!C15","v":"Börger II"},{"v":0,"d":"0.0"},"x","0","0",0,0,0,0,0,0,0,0,0,0,0,{"$nulls":5},{"v":0,"d":"0.0"},1,0,""]
[7,{"$f":"'Wettkampf 1'!B16","v":"Lindemann, Kerstin"},{"$f":"'Wettkampf 1'!C16","v":"Esterwegen V"},311.5,null,311.5,0,0,311.5,1,0,0,0,0,0,0,0,0,{"$nulls":5},{"v":0,"d":"0.0"},0,0,""]
[8,{"$f":"'Wettkampf 1'!B17","v":"Schlarmann, Lena"},{"$f":"'Wettkampf 1'!C17","v":"Esterwegen V"},312.6,null,312.6,0,0,312.6,1,0,0,0,0,0,0,0,0,{"$nulls":5},{"v":0,"d":"0.0"},0,0,""]
[9,{"$f":"'Wettkampf 1'!B18","v":"Lindemann, Stefanie"},{"$f":"'Wettkampf 1'!C18","v":"Esterwegen V"},300.9,null,300.9,0,0,300.9,1,0,0,0,0,0,0,0,0,{"$nulls":5},{"v":0,"d":"0.0"},0,0,""]
[10,{"$f":"'Wettkampf 1'!B19","v":"Lindemann, Rita"},{"$f":"'Wettkampf 1'!C19","v":"Esterwegen V"},313.7,null,313.7,0,0,313.7,1,0,0,0,0,0,0,0,0,{"$nulls":5},{"v":0,"d":"0.0"},0,0,""]
[11,{"$f":"'Wettkampf 1'!B20","v":"Büter, Daniela"},{"$f":"'Wettkampf 1'!C20","v":"Esterwegen V"},304.4,"x","0",0,0,"0",0,0,0,0,0,0,0,0,0,{"$nulls":5},{"v":0,"d":"0.0"},0,0,""]
[12,{"$f":"'Wettkampf 1'!B21","v":"Lindemann, Annemarie"},{"$f":"'Wettkampf 1'!C21","v":"Esterwegen V"},{"v":0,"d":"0.0"},"x","0",0,0,"0",0,0,0,0,0,0,0,0,0,{"$nulls":5},{"v":0,"d":"0.0"},1,0,""]
[13,{"$f":"'Wettkampf 1'!B22","v":"Preut, Susanne"},{"$f":"'Wettkampf 1'!C22","v":"Neuvrees II"},307.9,null,307.9,0,0,0,0,307.9,1,0,0,0,0,0,0,{"$nulls":5},{"v":0,"d":"0.0"},0,0,""]
[14,{"$f":"'Wettkampf 1'!B23","v":"Thunert, Silvia"},{"$f":"'Wettkampf 1'!C23","v":"Neuvrees II"},307.9,null,307.9,0,0,0,0,307.9,1,0,0,0,0,0,0,{"$nulls":5},{"v":0,"d":"0.0"},0,0,""]
[15,{"$f":"'Wettkampf 1'!B24","v":"Pohlmann, Margret"},{"$f":"'Wettkampf 1'!C24","v":"Neuvrees II"},308.6,null,308.6,0,0,0,0,308.6,1,0,0,0,0,0,0,{"$nulls":5},{"v":0,"d":"0.0"},0,0,""]
[16,{"$f":"'Wettkampf 1'!B25","v":"Eilermann, Saskia"},{"$f":"'Wettkampf 1'!C25","v":"Neuvrees II"},{"v":0,"d":"0.0"},"x","0",0,0,0,0,"0",0,0,0,0,0,0,0,{"$nulls":5},{"v":0,"d":"0.0"},1,0,""]
[17,{"$f":"'Wettkampf 1'!B26","v":"Junge, Silvia"},{"$f":"'Wettkampf 1'!C26","v":"Neuvrees II"},287.2,null,287.2,0,0,0,0,287.2,1,0,0,0,0,0,0,{"$nulls":5},{"v":0,"d":"0.0"},0,0,""]
[18,{"$f":"'Wettkampf 1'!B27","v":"Evers, Claudia"},{"$f":"'Wettkampf 1'!C27","v":"Neuvrees II"},301.2,"x","0",0,0,0,0,"0",0,0,0,0,0,0,0,{"$nulls":5},{"v":0,"d":"0.0"},0,0,""]
[19,{"$f":"'Wettkampf 1'!B28","v":"Schulte, Christina"},{"$f":"'Wettkampf 1'!C28","v":"Neuvrees II"},{"v":0,"d":"0.0"},"x","0",0,0,0,0,"0",0,0,0,0,0,0,0,{"$nulls":5},{"v":0,"d":"0.0"},1,0,""]
[20,{"$f":"'Wettkampf 1'!B29","v":"Reinelt, Michaela"},{"$f":"'Wettkampf 1'!C29","v":"Lahn IV"},308.8,null,308.8,0,0,0,0,0,0,308.8,1,0,0,0,0,{"$nulls":5},{"v":0,"d":"0.0"},0,0,""]
[21,{"$f":"'Wettkampf 1'!B30","v":"Thien, Marita"},{"$f":"'Wettkampf 1'!C30","v":"Lahn IV"},311.7,null,311.7,0,0,0,0,0,0,311.7,1,0,0,0,0,{"$nulls":5},{"v":0,"d":"0.0"},0,0,""]
[22,{"$f":"'Wettkampf 1'!B31","v":"Robben, Anja"},{"$f":"'Wettkampf 1'!C31","v":"Lahn IV"},314.5,null,314.5,0,0,0,0,0,0,314.5,1,0,0,0,0,{"$nulls":5},{"v":0,"d":"0.0"},0,0,""]
[23,{"$f":"'Wettkampf 1'!B32","v":"Oldopp, Maria"},{"$f":"'Wettkampf 1'!C32","v":"Lahn IV"},300.7,"x","0",0,0,0,0,0,0,"0",0,0,0,0,0,{"$nulls":5},{"v":0,"d":"0.0"},0,0,""]
[24,{"$f":"'Wettkampf 1'!B33","v":"Hanneken, Doris"},{"$f":"'Wettkampf 1'!C33","v":"Lahn IV"},296.9,null,296.9,0,0,0,0,0,0,296.9,1,0,0,0,0,{"$nulls":5},{"v":0,"d":"0.0"},0,0,""]
[25,{"$f":"'Wettkampf 1'!B34","v":"Kuchta, Gertrud"},{"$f":"'Wettkampf 1'!C34","v":"Börger III"},{"v":307,"d":"307.0"},null,{"v":307,"d":"307.0"},0,0,0,0,0,0,0,0,307,1,0,0,{"$nulls":5},{"v":0,"d":"0.0"},0,0,""]
[26,{"$f":"'Wettkampf 1'!B35","v":"Jungsthöfel, Sabine"},{"$f":"'Wettkampf 1'!C35","v":"Börger III"},303.7,null,303.7,0,0,0,0,0,0,0,0,303.7,1,0,0,{"$nulls":5},{"v":0,"d":"0.0"},0,0,""]
[27,{"$f":"'Wettkampf 1'!B36","v":"Schwarte, Gundula"},{"$f":"'Wettkampf 1'!C36","v":"Börger III"},299.4,"x","0",0,0,0,0,0,0,0,0,"0",0,0,0,{"$nulls":5},{"v":0,"d":"0.0"},0,0,""]
[28,{"$f":"'Wettkampf 1'!B37","v":"Geers, Christa"},{"$f":"'Wettkampf 1'!C37","v":"Börger III"},296.4,null,296.4,0,0,0,0,0,0,0,0,296.4,1,0,0,{"$nulls":5},{"v":0,"d":"0.0"},0,0,""]
[29,{"$f":"'Wettkampf 1'!B38","v":"Remmers, Tanja"},{"$f":"'Wettkampf 1'!C38","v":"Börger III"},{"v":297,"d":"297.0"},"x","0",0,0,0,0,0,0,0,0,"0",0,0,0,{"$nulls":5},{"v":0,"d":"0.0"},0,0,""]
[30,{"$f":"'Wettkampf 1'!B39","v":"Terhalle, Johanna"},{"$f":"'Wettkampf 1'!C39","v":"Börger III"},304.5,null,304.5,0,0,0,0,0,0,0,0,304.5,1,0,0,{"$nulls":5},{"v":0,"d":"0.0"},0,0,""]
[31,{"$f":"'Wettkampf 1'!B40","v":"Hackstette, Lena"},{"$f":"'Wettkampf 1'!C40","v":"Lahn III"},307.8,null,307.8,0,0,0,0,0,0,0,0,0,0,307.8,1,{"$nulls":5},{"v":0,"d":"0.0"},0,0,""]
[32,{"$f":"'Wettkampf 1'!B41","v":"Thyen, Christel"},{"$f":"'Wettkampf 1'!C41","v":"Lahn III"},308.8,null,308.8,0,0,0,0,0,0,0,0,0,0,308.8,1,{"$nulls":5},{"v":0,"d":"0.0"},0,0,""]
[33,{"$f":"'Wettkampf 1'!B42","v":"Ostermann, Hildegard"},{"$f":"'Wettkampf 1'!C42","v":"Lahn III"},302.8,"x","0",0,0,0,0,0,0,0,0,0,0,"0",0,{"$nulls":5},{"v":0,"d":"0.0"},0,0,""]
[34,{"$f":"'Wettkampf 1'!B43","v":"Willoh, Henrika"},{"$f":"'Wettkampf 1'!C43","v":"Lahn III"},312.2,null,312.2,0,0,0,0,0,0,0,0,0,0,312.2,1,{"$nulls":5},{"v":0,"d":"0.0"},0,0,""]
[35,{"$f":"'Wettkampf 1'!B44","v":"Müller, Anita"},{"$f":"'Wettkampf 1'!C44","v":"Lahn III"},305.1,"x","0",0,0,0,0,0,0,0,0,0,0,"0",0,{"$nulls":5},{"v":0,"d":"0.0"},0,0,""]
[36,{"$f":"'Wettkampf 1'!B45","v":"Wilken, Elena"},{"$f":"'Wettkampf 1'!C45","v":"Lahn III"},301.4,null,301.4,0,0,0,0,0,0,0,0,0,0,301.4,1,{"$nulls":5},{"v":0,"d":"0.0"},0,0,""]
[{"$nulls":6},{"$f":"LARGE(G10:G45,1)+LARGE(G10:G45,2)+LARGE(G10:G45,3)","v":922.0999999999999},{"$f":"SUM(H10:H45)","v":4},{"$f":"LARGE(I10:I45,1)+LARGE(I10:I45,2)+LARGE(I10:I45,3)","v":937.8},{"$f":"SUM(J10:J45)","v":4},{"$f":"LARGE(K10:K45,1)+LARGE(K10:K45,2)+LARGE(K10:K45,3)","v":924.4},{"$f":"SUM(L10:L45)","v":4},{"$f":"LARGE(M10:M45,1)+LARGE(M10:M45,2)+LARGE(M10:M45,3)","v":935},{"$f":"SUM(N10:N45)","v":4},{"$f":"LARGE(O10:O45,1)+LARGE(O10:O45,2)+LARGE(O10:O45,3)","v":915.2},{"$f":"SUM(P10:P45)","v":4},{"$f":"LARGE(Q10:Q45,1)+LARGE(Q10:Q45,2)+LARGE(Q10:Q45,3)","v":928.8},{"$f":"SUM(R10:S45)","v":4}]
[null,null,"per Email an: sk-huemmling@gmx.de"]

{"sheet":"11","index":11,"n_rows":47,"n_cols":27,"rows_kept":47,"merged":[[0,22,0,23],[1,22,1,23],[4,22,4,23],[5,22,5,23],[6,22,6,23],[8,20,8,23]]}
[null,"Verein / Gruppe",null,"Ergebnisse",{"$nulls":17},"Austragungsort:",{"$f":"Übersicht!P4","v":"Lahn"}]
[1,{"$f":"'Wettkampf 1'!B2","v":"Börger II"},null,{"$f":"G46","v":{"v":929.4000000000001,"d":"929.4"}},{"$f":"IF(H46>4,\"Es sind zu viele Schützen in Wertung!\",\" \")","v":" "},{"$nulls":16},"Wettkampftag:",{"$f":"Übersicht!P3","v":"08.03."}]
[2,{"$f":"'Wettkampf 1'!B3","v":"Esterwegen V"},null,{"$f":"I46","v":934.2},{"$f":"IF(J46>4,\"Es sind zu viele Schützen in Wertung!\",\" \")","v":" "}]
[3,{"$f":"'Wettkampf 1'!B4","v":"Neuvrees II"},null,{"$f":"K46","v":932.8},{"$f":"IF(L46>4,\"Es sind zu viele Schützen in Wertung!\",\" \")","v":" "},{"$nulls":18},"Ansprechpartner für Rückfragen:"]
[4,{"$f":"'Wettkampf 1'!B5","v":"Lahn IV"},null,{"$f":"M46","v":{"v":925,"d":"925.0"}},{"$f":"IF(N46>4,\"Es sind zu viele Schützen in Wertung!\",\" \")","v":" "},{"$nulls":16},"Name:","Hildegard Ostermann"]
[5,{"$f":"'Wettkampf 1'!B6","v":"Börger III"},null,{"$f":"O46","v":{"v":919.6999999999999,"d":"919.7"}},{"$f":"IF(P46>4,\"Es sind zu viele Schützen in Wertung!\",\" \")","v":" "},{"$nulls":16},"Tel:"]
[6,{"$f":"'Wettkampf 1'!B7","v":"Lahn III"},null,{"$f":"Q46","v":{"v":923.9000000000001,"d":"923.9"}},{"$f":"IF(R46>4,\"Es sind zu viele Schützen in Wertung!\",\" \")","v":" "},{"$nulls":16},"Standaufsicht:","Hildegard Ostermann"]
[]
[null,"Einzelergebnisse:","Verein / Gruppe","Ergebnisse (mindestens 0 eintragen)","AW? Dann x eintippen",null,"Verein 1",null,"Verein 2",null,"Verein 3",null,"Verein 4",null,"Verein 5",null,"Verein 6",{"$nulls":3},"Proberechnung bei Streifen:"]
[1,{"$f":"'Wettkampf 1'!B10","v":"Kossenjans, Annegret"},{"$f":"'Wettkampf 1'!C10","v":"Börger II"},null,"x",{"$f":"IF(E10=\"x\",\"0\",D10)","v":"0"},{"$f":"IF(C10=$B$2,F10,0)","v":"0"},{"$f":"(IF(AND($E10=\"\",$C10=$B$2),1,0))","v":0},{"$f":"IF($C10=$B$3,F10,0)","v":0},{"$f":"(IF(AND($E10=\"\",$C10=$B$3),1,0))","v":0},{"$f":"IF($C10=$B$4,F10,0)","v":0},{"$f":"(IF(AND($E10=\"\",$C10=$B$4),1,0))","v":0},{"$f":"IF($C10=$B$5,F10,0)","v":0},{"$f":"(IF(AND($E10=\"\",$C10=$B$5),1,0))","v":0},{"$f":"IF($C10=$B$6,F10,0)","v":0},{"$f":"(IF(AND($E10=\"\",$C10=$B$6),1,0))","v":0},{"$f":"IF($C10=$B$7,F10,0)","v":0},{"$f":"(IF(AND($E10=\"\",$C10=$B$7),1,0))","v":0},{"$nulls":5},{"$f":"U10+V10+W10","v":{"v":0,"d":"0.0"}},{"$f":"IF(X10=D10,1,0)","v":1},{"$f":"IF(X10=0,0,1)","v":0},{"$f":"IF(Y10+Z10=2,\"Korrekt\",\"\")","v":""}]
[2,{"$f":"'Wettkampf 1'!B11","v":"Jansen, Elisabeth"},{"$f":"'Wettkampf 1'!C11","v":"Börger II"},306.7,null,{"$f":"IF(E11=\"x\",\"0\",D11)","v":306.7},{"$f":"IF(C11=$B$2,F11,0)","v":306.7},{"$f":"(IF(AND($E11=\"\",$C11=$B$2),1,0))","v":1},{"$f":"IF($C11=$B$3,F11,0)","v":0},{"$f":"(IF(AND($E11=\"\",$C11=$B$3),1,0))","v":0},{"$f":"IF($C11=$B$4,F11,0)","v":0},{"$f":"(IF(AND($E11=\"\",$C11=$B$4),1,0))","v":0},{"$f":"IF($C11=$B$5,F11,0)","v":0},{"$f":"(IF(AND($E11=\"\",$C11=$B$5),1,0))","v":0},{"$f":"IF($C11=$B$6,F11,0)","v":0},{"$f":"(IF(AND($E11=\"\",$C11=$B$6),1,0))","v":0},{"$f":"IF($C11=$B$7,F11,0)","v":0},{"$f":"(IF(AND($E11=\"\",$C11=$B$7),1,0))","v":0},{"$nulls":5},{"$f":"U11+V11+W11","v":{"v":0,"d":"0.0"}},{"$f":"IF(X11=D11,1,0)","v":0},{"$f":"IF(X11=0,0,1)","v":0},{"$f":"IF(Y11+Z11=2,\"Korrekt\",\"\")","v":""}]
[3,{"$f":"'Wettkampf 1'!B12","v":"Krömer, Monika"},{"$f":"'Wettkampf 1'!C12","v":"Börger II"},298.7,null,298.7,298.7,1,0,0,0,0,0,0,0,0,0,0,{"$nulls":5},{"v":0,"d":"0.0"},0,0,""]
[4,{"$f":"'Wettkampf 1'!B13","v":"Pohlgeers, Margret"},{"$f":"'Wettkampf 1'!C13","v":"Börger II"},311.4,null,311.4,311.4,1,0,0,0,0,0,0,0,0,0,0,{"$nulls":5},{"v":0,"d":"0.0"},0,0,""]
[5,{"$f":"'Wettkampf 1'!B14","v":"Pohlgeers, Silvia"},{"$f":"'Wettkampf 1'!C14","v":"Börger II"},311.3,null,311.3,311.3,1,0,0,0,0,0,0,0,0,0,0,{"$nulls":5},{"v":0,"d":"0.0"},0,0,""]
[6,{"$f":"'Wettkampf 1'!B15","v":"Schwarte, Annette"},{"$f":"'Wettkampf 1'!C15","v":"Börger II"},null,"x","0","0",0,0,0,0,0,0,0,0,0,0,0,{"$nulls":5},{"v":0,"d":"0.0"},1,0,""]
[7,{"$f":"'Wettkampf 1'!B16","v":"Lindemann, Kerstin"},{"$f":"'Wettkampf 1'!C16","v":"Esterwegen V"},305.7,null,305.7,0,0,305.7,1,0,0,0,0,0,0,0,0,{"$nulls":5},{"v":0,"d":"0.0"},0,0,""]
[8,{"$f":"'Wettkampf 1'!B17","v":"Schlarmann, Lena"},{"$f":"'Wettkampf 1'!C17","v":"Esterwegen V"},309.2,null,309.2,0,0,309.2,1,0,0,0,0,0,0,0,0,{"$nulls":5},{"v":0,"d":"0.0"},0,0,""]
[9,{"$f":"'Wettkampf 1'!B18","v":"Lindemann, Stefanie"},{"$f":"'Wettkampf 1'!C18","v":"Esterwegen V"},null,"x","0",0,0,"0",0,0,0,0,0,0,0,0,0,{"$nulls":5},{"v":0,"d":"0.0"},1,0,""]
[10,{"$f":"'Wettkampf 1'!B19","v":"Lindemann, Rita"},{"$f":"'Wettkampf 1'!C19","v":"Esterwegen V"},316.8,null,316.8,0,0,316.8,1,0,0,0,0,0,0,0,0,{"$nulls":5},{"v":0,"d":"0.0"},0,0,""]
[11,{"$f":"'Wettkampf 1'!B20","v":"Büter, Daniela"},{"$f":"'Wettkampf 1'!C20","v":"Esterwegen V"},308.2,null,308.2,0,0,308.2,1,0,0,0,0,0,0,0,0,{"$nulls":5},{"v":0,"d":"0.0"},0,0,""]
[12,{"$f":"'Wettkampf 1'!B21","v":"Lindemann, Annemarie"},{"$f":"'Wettkampf 1'!C21","v":"Esterwegen V"},null,"x","0",0,0,"0",0,0,0,0,0,0,0,0,0,{"$nulls":5},{"v":0,"d":"0.0"},1,0,""]
[13,{"$f":"'Wettkampf 1'!B22","v":"Preut, Susanne"},{"$f":"'Wettkampf 1'!C22","v":"Neuvrees II"},297.8,null,297.8,0,0,0,0,297.8,1,0,0,0,0,0,0,{"$nulls":5},{"v":0,"d":"0.0"},0,0,""]
[14,{"$f":"'Wettkampf 1'!B23","v":"Thunert, Silvia"},{"$f":"'Wettkampf 1'!C23","v":"Neuvrees II"},313.9,null,313.9,0,0,0,0,313.9,1,0,0,0,0,0,0,{"$nulls":5},{"v":0,"d":"0.0"},0,0,""]
[15,{"$f":"'Wettkampf 1'!B24","v":"Pohlmann, Margret"},{"$f":"'Wettkampf 1'!C24","v":"Neuvrees II"},306.4,null,306.4,0,0,0,0,306.4,1,0,0,0,0,0,0,{"$nulls":5},{"v":0,"d":"0.0"},0,0,""]
[16,{"$f":"'Wettkampf 1'!B25","v":"Eilermann, Saskia"},{"$f":"'Wettkampf 1'!C25","v":"Neuvrees II"},312.5,null,312.5,0,0,0,0,312.5,1,0,0,0,0,0,0,{"$nulls":5},{"v":0,"d":"0.0"},0,0,""]
[17,{"$f":"'Wettkampf 1'!B26","v":"Junge, Silvia"},{"$f":"'Wettkampf 1'!C26","v":"Neuvrees II"},{"v":292,"d":"292.0"},"x","0",0,0,0,0,"0",0,0,0,0,0,0,0,{"$nulls":5},{"v":0,"d":"0.0"},0,0,""]
[18,{"$f":"'Wettkampf 1'!B27","v":"Evers, Claudia"},{"$f":"'Wettkampf 1'!C27","v":"Neuvrees II"},303.7,"x","0",0,0,0,0,"0",0,0,0,0,0,0,0,{"$nulls":5},{"v":0,"d":"0.0"},0,0,""]
[19,{"$f":"'Wettkampf 1'!B28","v":"Schulte, Christina"},{"$f":"'Wettkampf 1'!C28","v":"Neuvrees II"},null,"x","0",0,0,0,0,"0",0,0,0,0,0,0,0,{"$nulls":5},{"v":0,"d":"0.0"},1,0,""]
[20,{"$f":"'Wettkampf 1'!B29","v":"Reinelt, Michaela"},{"$f":"'Wettkampf 1'!C29","v":"Lahn IV"},308.2,null,308.2,0,0,0,0,0,0,308.2,1,0,0,0,0,{"$nulls":5},{"v":0,"d":"0.0"},0,0,""]
[21,{"$f":"'Wettkampf 1'!B30","v":"Thien, Marita"},{"$f":"'Wettkampf 1'!C30","v":"Lahn IV"},{"v":312,"d":"312.0"},null,{"v":312,"d":"312.0"},0,0,0,0,0,0,312,1,0,0,0,0,{"$nulls":5},{"v":0,"d":"0.0"},0,0,""]
[22,{"$f":"'Wettkampf 1'!B31","v":"Robben, Anja"},{"$f":"'Wettkampf 1'!C31","v":"Lahn IV"},304.8,null,304.8,0,0,0,0,0,0,304.8,1,0,0,0,0,{"$nulls":5},{"v":0,"d":"0.0"},0,0,""]
[23,{"$f":"'Wettkampf 1'!B32","v":"Oldopp, Maria"},{"$f":"'Wettkampf 1'!C32","v":"Lahn IV"},298.2,"x","0",0,0,0,0,0,0,"0",0,0,0,0,0,{"$nulls":5},{"v":0,"d":"0.0"},0,0,""]
[24,{"$f":"'Wettkampf 1'!B33","v":"Hanneken, Doris"},{"$f":"'Wettkampf 1'!C33","v":"Lahn IV"},303.4,null,303.4,0,0,0,0,0,0,303.4,1,0,0,0,0,{"$nulls":5},{"v":0,"d":"0.0"},0,0,""]
[25,{"$f":"'Wettkampf 1'!B34","v":"Kuchta, Gertrud"},{"$f":"'Wettkampf 1'!C34","v":"Börger III"},308.4,null,308.4,0,0,0,0,0,0,0,0,308.4,1,0,0,{"$nulls":5},{"v":0,"d":"0.0"},0,0,""]
[26,{"$f":"'Wettkampf 1'!B35","v":"Jungsthöfel, Sabine"},{"$f":"'Wettkampf 1'!C35","v":"Börger III"},296.4,null,296.4,0,0,0,0,0,0,0,0,296.4,1,0,0,{"$nulls":5},{"v":0,"d":"0.0"},0,0,""]
[27,{"$f":"'Wettkampf 1'!B36","v":"Schwarte, Gundula"},{"$f":"'Wettkampf 1'!C36","v":"Börger III"},303.8,"x","0",0,0,0,0,0,0,0,0,"0",0,0,0,{"$nulls":5},{"v":0,"d":"0.0"},0,0,""]
[28,{"$f":"'Wettkampf 1'!B37","v":"Geers, Christa"},{"$f":"'Wettkampf 1'!C37","v":"Börger III"},301.9,null,301.9,0,0,0,0,0,0,0,0,301.9,1,0,0,{"$nulls":5},{"v":0,"d":"0.0"},0,0,""]
[29,{"$f":"'Wettkampf 1'!B38","v":"Remmers, Tanja"},{"$f":"'Wettkampf 1'!C38","v":"Börger III"},297.2,"x","0",0,0,0,0,0,0,0,0,"0",0,0,0,{"$nulls":5},{"v":0,"d":"0.0"},0,0,""]
[30,{"$f":"'Wettkampf 1'!B39","v":"Terhalle, Johanna"},{"$f":"'Wettkampf 1'!C39","v":"Börger III"},309.4,null,309.4,0,0,0,0,0,0,0,0,309.4,1,0,0,{"$nulls":5},{"v":0,"d":"0.0"},0,0,""]
[31,{"$f":"'Wettkampf 1'!B40","v":"Hackstette, Lena"},{"$f":"'Wettkampf 1'!C40","v":"Lahn III"},304.6,null,304.6,0,0,0,0,0,0,0,0,0,0,304.6,1,{"$nulls":5},{"v":0,"d":"0.0"},0,0,""]
[32,{"$f":"'Wettkampf 1'!B41","v":"Thyen, Christel"},{"$f":"'Wettkampf 1'!C41","v":"Lahn III"},305.8,null,305.8,0,0,0,0,0,0,0,0,0,0,305.8,1,{"$nulls":5},{"v":0,"d":"0.0"},0,0,""]
[33,{"$f":"'Wettkampf 1'!B42","v":"Ostermann, Hildegard"},{"$f":"'Wettkampf 1'!C42","v":"Lahn III"},302.7,"x","0",0,0,0,0,0,0,0,0,0,0,"0",0,{"$nulls":5},{"v":0,"d":"0.0"},0,0,""]
[34,{"$f":"'Wettkampf 1'!B43","v":"Willoh, Henrika"},{"$f":"'Wettkampf 1'!C43","v":"Lahn III"},311.1,null,311.1,0,0,0,0,0,0,0,0,0,0,311.1,1,{"$nulls":5},{"v":0,"d":"0.0"},0,0,""]
[35,{"$f":"'Wettkampf 1'!B44","v":"Müller, Anita"},{"$f":"'Wettkampf 1'!C44","v":"Lahn III"},305.7,"x","0",0,0,0,0,0,0,0,0,0,0,"0",0,{"$nulls":5},{"v":0,"d":"0.0"},0,0,""]
[36,{"$f":"'Wettkampf 1'!B45","v":"Wilken, Elena"},{"$f":"'Wettkampf 1'!C45","v":"Lahn III"},{"v":307,"d":"307.0"},null,{"v":307,"d":"307.0"},0,0,0,0,0,0,0,0,0,0,307,1,{"$nulls":5},{"v":0,"d":"0.0"},0,0,""]
[{"$nulls":6},{"$f":"LARGE(G10:G45,1)+LARGE(G10:G45,2)+LARGE(G10:G45,3)","v":929.4000000000001},{"$f":"SUM(H10:H45)","v":4},{"$f":"LARGE(I10:I45,1)+LARGE(I10:I45,2)+LARGE(I10:I45,3)","v":934.2},{"$f":"SUM(J10:J45)","v":4},{"$f":"LARGE(K10:K45,1)+LARGE(K10:K45,2)+LARGE(K10:K45,3)","v":932.8},{"$f":"SUM(L10:L45)","v":4},{"$f":"LARGE(M10:M45,1)+LARGE(M10:M45,2)+LARGE(M10:M45,3)","v":925},{"$f":"SUM(N10:N45)","v":4},{"$f":"LARGE(O10:O45,1)+LARGE(O10:O45,2)+LARGE(O10:O45,3)","v":919.6999999999999},{"$f":"SUM(P10:P45)","v":4},{"$f":"LARGE(Q10:Q45,1)+LARGE(Q10:Q45,2)+LARGE(Q10:Q45,3)","v":923.9000000000001},{"$f":"SUM(R10:S45)","v":4}]
[null,null,"per Email an: sk-huemmling@gmx.de"]

{"sheet":"12","index":12,"n_rows":47,"n_cols":27,"rows_kept":47,"merged":[[0,22,0,23],[1,22,1,23],[4,22,4,23],[5,22,5,23],[6,22,6,23],[8,20,8,23]]}
[null,"Verein / Gruppe",null,"Ergebnisse",{"$nulls":17},"Austragungsort:",{"$f":"Übersicht!Q4","v":"Lahn"}]
[1,{"$f":"'Wettkampf 1'!B2","v":"Börger II"},null,{"$f":"G46","v":{"v":0,"d":"0.0"}},{"$f":"IF(H46>4,\"Es sind zu viele Schützen in Wertung!\",\" \")","v":" "},{"$nulls":16},"Wettkampftag:",{"$f":"Übersicht!Q3","v":"22.03."}]
[2,{"$f":"'Wettkampf 1'!B3","v":"Esterwegen V"},null,{"$f":"I46","v":{"v":0,"d":"0.0"}},{"$f":"IF(J46>4,\"Es sind zu viele Schützen in Wertung!\",\" \")","v":" "}]
[3,{"$f":"'Wettkampf 1'!B4","v":"Neuvrees II"},null,{"$f":"K46","v":{"v":0,"d":"0.0"}},{"$f":"IF(L46>4,\"Es sind zu viele Schützen in Wertung!\",\" \")","v":"Es sind zu viele Schützen in Wertung!"},{"$nulls":18},"Ansprechpartner für Rückfragen:"]
[4,{"$f":"'Wettkampf 1'!B5","v":"Lahn IV"},null,{"$f":"M46","v":{"v":0,"d":"0.0"}},{"$f":"IF(N46>4,\"Es sind zu viele Schützen in Wertung!\",\" \")","v":" "},{"$nulls":16},"Name:"]
[5,{"$f":"'Wettkampf 1'!B6","v":"Börger III"},null,{"$f":"O46","v":{"v":0,"d":"0.0"}},{"$f":"IF(P46>4,\"Es sind zu viele Schützen in Wertung!\",\" \")","v":" "},{"$nulls":16},"Tel:"]
[6,{"$f":"'Wettkampf 1'!B7","v":"Lahn III"},null,{"$f":"Q46","v":{"v":0,"d":"0.0"}},{"$f":"IF(R46>4,\"Es sind zu viele Schützen in Wertung!\",\" \")","v":" "},{"$nulls":16},"Standaufsicht:"]
[]
[null,"Einzelergebnisse:","Verein / Gruppe","Ergebnisse (mindestens 0 eintragen)","AW? Dann x eintippen",null,"Verein 1",null,"Verein 2",null,"Verein 3",null,"Verein 4",null,"Verein 5",null,"Verein 6",{"$nulls":3},"Proberechnung bei Streifen:"]
[1,{"$f":"'Wettkampf 1'!B10","v":"Kossenjans, Annegret"},{"$f":"'Wettkampf 1'!C10","v":"Börger II"},null,null,{"$f":"IF(E10=\"x\",\"0\",D10)","v":{"v":0,"d":"0.0"}},{"$f":"IF(C10=$B$2,F10,0)","v":0},{"$f":"(IF(AND($E10=\"\",$C10=$B$2),1,0))","v":1},{"$f":"IF($C10=$B$3,F10,0)","v":0},{"$f":"(IF(AND($E10=\"\",$C10=$B$3),1,0))","v":0},{"$f":"IF($C10=$B$4,F10,0)","v":0},{"$f":"(IF(AND($E10=\"\",$C10=$B$4),1,0))","v":0},{"$f":"IF($C10=$B$5,F10,0)","v":0},{"$f":"(IF(AND($E10=\"\",$C10=$B$5),1,0))","v":0},{"$f":"IF($C10=$B$6,F10,0)","v":0},{"$f":"(IF(AND($E10=\"\",$C10=$B$6),1,0))","v":0},{"$f":"IF($C10=$B$7,F10,0)","v":0},{"$f":"(IF(AND($E10=\"\",$C10=$B$7),1,0))","v":0},{"$nulls":5},{"$f":"U10+V10+W10","v":{"v":0,"d":"0.0"}},{"$f":"IF(X10=D10,1,0)","v":1},{"$f":"IF(X10=0,0,1)","v":0},{"$f":"IF(Y10+Z10=2,\"Korrekt\",\"\")","v":""}]
[2,{"$f":"'Wettkampf 1'!B11","v":"Jansen, Elisabeth"},{"$f":"'Wettkampf 1'!C11","v":"Börger II"},null,null,{"$f":"IF(E11=\"x\",\"0\",D11)","v":{"v":0,"d":"0.0"}},{"$f":"IF(C11=$B$2,F11,0)","v":0},{"$f":"(IF(AND($E11=\"\",$C11=$B$2),1,0))","v":1},{"$f":"IF($C11=$B$3,F11,0)","v":0},{"$f":"(IF(AND($E11=\"\",$C11=$B$3),1,0))","v":0},{"$f":"IF($C11=$B$4,F11,0)","v":0},{"$f":"(IF(AND($E11=\"\",$C11=$B$4),1,0))","v":0},{"$f":"IF($C11=$B$5,F11,0)","v":0},{"$f":"(IF(AND($E11=\"\",$C11=$B$5),1,0))","v":0},{"$f":"IF($C11=$B$6,F11,0)","v":0},{"$f":"(IF(AND($E11=\"\",$C11=$B$6),1,0))","v":0},{"$f":"IF($C11=$B$7,F11,0)","v":0},{"$f":"(IF(AND($E11=\"\",$C11=$B$7),1,0))","v":0},{"$nulls":5},{"$f":"U11+V11+W11","v":{"v":0,"d":"0.0"}},{"$f":"IF(X11=D11,1,0)","v":1},{"$f":"IF(X11=0,0,1)","v":0},{"$f":"IF(Y11+Z11=2,\"Korrekt\",\"\")","v":""}]
[3,{"$f":"'Wettkampf 1'!B12","v":"Krömer, Monika"},{"$f":"'Wettkampf 1'!C12","v":"Börger II"},null,null,{"v":0,"d":"0.0"},0,1,0,0,0,0,0,0,0,0,0,0,{"$nulls":5},{"v":0,"d":"0.0"},1,0,""]
[4,{"$f":"'Wettkampf 1'!B13","v":"Pohlgeers, Margret"},{"$f":"'Wettkampf 1'!C13","v":"Börger II"},null,null,{"v":0,"d":"0.0"},0,1,0,0,0,0,0,0,0,0,0,0,{"$nulls":5},{"v":0,"d":"0.0"},1,0,""]
[5,{"$f":"'Wettkampf 1'!B14","v":"Pohlgeers, Silvia"},{"$f":"'Wettkampf 1'!C14","v":"Börger II"},null,"x","0","0",0,0,0,0,0,0,0,0,0,0,0,{"$nulls":5},{"v":0,"d":"0.0"},1,0,""]
[6,{"$f":"'Wettkampf 1'!B15","v":"Schwarte, Annette"},{"$f":"'Wettkampf 1'!C15","v":"Börger II"},null,"x","0","0",0,0,0,0,0,0,0,0,0,0,0,{"$nulls":5},{"v":0,"d":"0.0"},1,0,""]
[7,{"$f":"'Wettkampf 1'!B16","v":"Lindemann, Kerstin"},{"$f":"'Wettkampf 1'!C16","v":"Esterwegen V"},null,null,{"v":0,"d":"0.0"},0,0,0,1,0,0,0,0,0,0,0,0,{"$nulls":5},{"v":0,"d":"0.0"},1,0,""]
[8,{"$f":"'Wettkampf 1'!B17","v":"Schlarmann, Lena"},{"$f":"'Wettkampf 1'!C17","v":"Esterwegen V"},null,null,{"v":0,"d":"0.0"},0,0,0,1,0,0,0,0,0,0,0,0,{"$nulls":5},{"v":0,"d":"0.0"},1,0,""]
[9,{"$f":"'Wettkampf 1'!B18","v":"Lindemann, Stefanie"},{"$f":"'Wettkampf 1'!C18","v":"Esterwegen V"},null,null,{"v":0,"d":"0.0"},0,0,0,1,0,0,0,0,0,0,0,0,{"$nulls":5},{"v":0,"d":"0.0"},1,0,""]
[10,{"$f":"'Wettkampf 1'!B19","v":"Lindemann, Rita"},{"$f":"'Wettkampf 1'!C19","v":"Esterwegen V"},null,null,{"v":0,"d":"0.0"},0,0,0,1,0,0,0,0,0,0,0,0,{"$nulls":5},{"v":0,"d":"0.0"},1,0,""]
[11,{"$f":"'Wettkampf 1'!B20","v":"Büter, Daniela"},{"$f":"'Wettkampf 1'!C20","v":"Esterwegen V"},null,"x","0",0,0,"0",0,0,0,0,0,0,0,0,0,{"$nulls":5},{"v":0,"d":"0.0"},1,0,""]
[12,{"$f":"'Wettkampf 1'!B21","v":"Lindemann, Annemarie"},{"$f":"'Wettkampf 1'!C21","v":"Esterwegen V"},null,"x","0",0,0,"0",0,0,0,0,0,0,0,0,0,{"$nulls":5},{"v":0,"d":"0.0"},1,0,""]
[13,{"$f":"'Wettkampf 1'!B22","v":"Preut, Susanne"},{"$f":"'Wettkampf 1'!C22","v":"Neuvrees II"},null,null,{"v":0,"d":"0.0"},0,0,0,0,0,1,0,0,0,0,0,0,{"$nulls":5},{"v":0,"d":"0.0"},1,0,""]
[14,{"$f":"'Wettkampf 1'!B23","v":"Thunert, Silvia"},{"$f":"'Wettkampf 1'!C23","v":"Neuvrees II"},null,null,{"v":0,"d":"0.0"},0,0,0,0,0,1,0,0,0,0,0,0,{"$nulls":5},{"v":0,"d":"0.0"},1,0,""]
[15,{"$f":"'Wettkampf 1'!B24","v":"Pohlmann, Margret"},{"$f":"'Wettkampf 1'!C24","v":"Neuvrees II"},null,null,{"v":0,"d":"0.0"},0,0,0,0,0,1,0,0,0,0,0,0,{"$nulls":5},{"v":0,"d":"0.0"},1,0,""]
[16,{"$f":"'Wettkampf 1'!B25","v":"Eilermann, Saskia"},{"$f":"'Wettkampf 1'!C25","v":"Neuvrees II"},null,null,{"v":0,"d":"0.0"},0,0,0,0,0,1,0,0,0,0,0,0,{"$nulls":5},{"v":0,"d":"0.0"},1,0,""]
[17,{"$f":"'Wettkampf 1'!B26","v":"Junge, Silvia"},{"$f":"'Wettkampf 1'!C26","v":"Neuvrees II"},null,"x","0",0,0,0,0,"0",0,0,0,0,0,0,0,{"$nulls":5},{"v":0,"d":"0.0"},1,0,""]
[18,{"$f":"'Wettkampf 1'!B27","v":"Evers, Claudia"},{"$f":"'Wettkampf 1'!C27","v":"Neuvrees II"},null,"x","0",0,0,0,0,"0",0,0,0,0,0,0,0,{"$nulls":5},{"v":0,"d":"0.0"},1,0,""]
[19,{"$f":"'Wettkampf 1'!B28","v":"Schulte, Christina"},{"$f":"'Wettkampf 1'!C28","v":"Neuvrees II"},null,null,{"v":0,"d":"0.0"},0,0,0,0,0,1,0,0,0,0,0,0,{"$nulls":5},{"v":0,"d":"0.0"},1,0,""]
[20,{"$f":"'Wettkampf 1'!B29","v":"Reinelt, Michaela"},{"$f":"'Wettkampf 1'!C29","v":"Lahn IV"},null,null,{"v":0,"d":"0.0"},0,0,0,0,0,0,0,1,0,0,0,0,{"$nulls":5},{"v":0,"d":"0.0"},1,0,""]
[21,{"$f":"'Wettkampf 1'!B30","v":"Thien, Marita"},{"$f":"'Wettkampf 1'!C30","v":"Lahn IV"},null,null,{"v":0,"d":"0.0"},0,0,0,0,0,0,0,1,0,0,0,0,{"$nulls":5},{"v":0,"d":"0.0"},1,0,""]
[22,{"$f":"'Wettkampf 1'!B31","v":"Robben, Anja"},{"$f":"'Wettkampf 1'!C31","v":"Lahn IV"},null,null,{"v":0,"d":"0.0"},0,0,0,0,0,0,0,1,0,0,0,0,{"$nulls":5},{"v":0,"d":"0.0"},1,0,""]
[23,{"$f":"'Wettkampf 1'!B32","v":"Oldopp, Maria"},{"$f":"'Wettkampf 1'!C32","v":"Lahn IV"},null,"x","0",0,0,0,0,0,0,"0",0,0,0,0,0,{"$nulls":5},{"v":0,"d":"0.0"},1,0,""]
[24,{"$f":"'Wettkampf 1'!B33","v":"Hanneken, Doris"},{"$f":"'Wettkampf 1'!C33","v":"Lahn IV"},null,"x","0",0,0,0,0,0,0,"0",0,0,0,0,0,{"$nulls":5},{"v":0,"d":"0.0"},1,0,""]
[25,{"$f":"'Wettkampf 1'!B34","v":"Kuchta, Gertrud"},{"$f":"'Wettkampf 1'!C34","v":"Börger III"},null,null,{"v":0,"d":"0.0"},0,0,0,0,0,0,0,0,0,1,0,0,{"$nulls":5},{"v":0,"d":"0.0"},1,0,""]
[26,{"$f":"'Wettkampf 1'!B35","v":"Jungsthöfel, Sabine"},{"$f":"'Wettkampf 1'!C35","v":"Börger III"},null,null,{"v":0,"d":"0.0"},0,0,0,0,0,0,0,0,0,1,0,0,{"$nulls":5},{"v":0,"d":"0.0"},1,0,""]
[27,{"$f":"'Wettkampf 1'!B36","v":"Schwarte, Gundula"},{"$f":"'Wettkampf 1'!C36","v":"Börger III"},null,null,{"v":0,"d":"0.0"},0,0,0,0,0,0,0,0,0,1,0,0,{"$nulls":5},{"v":0,"d":"0.0"},1,0,""]
[28,{"$f":"'Wettkampf 1'!B37","v":"Geers, Christa"},{"$f":"'Wettkampf 1'!C37","v":"Börger III"},null,null,{"v":0,"d":"0.0"},0,0,0,0,0,0,0,0,0,1,0,0,{"$nulls":5},{"v":0,"d":"0.0"},1,0,""]
[29,{"$f":"'Wettkampf 1'!B38","v":"Remmers, Tanja"},{"$f":"'Wettkampf 1'!C38","v":"Börger III"},null,"x","0",0,0,0,0,0,0,0,0,"0",0,0,0,{"$nulls":5},{"v":0,"d":"0.0"},1,0,""]
[30,{"$f":"'Wettkampf 1'!B39","v":"Terhalle, Johanna"},{"$f":"'Wettkampf 1'!C39","v":"Börger III"},null,"x","0",0,0,0,0,0,0,0,0,"0",0,0,0,{"$nulls":5},{"v":0,"d":"0.0"},1,0,""]
[31,{"$f":"'Wettkampf 1'!B40","v":"Hackstette, Lena"},{"$f":"'Wettkampf 1'!C40","v":"Lahn III"},null,null,{"v":0,"d":"0.0"},0,0,0,0,0,0,0,0,0,0,0,1,{"$nulls":5},{"v":0,"d":"0.0"},1,0,""]
[32,{"$f":"'Wettkampf 1'!B41","v":"Thyen, Christel"},{"$f":"'Wettkampf 1'!C41","v":"Lahn III"},null,null,{"v":0,"d":"0.0"},0,0,0,0,0,0,0,0,0,0,0,1,{"$nulls":5},{"v":0,"d":"0.0"},1,0,""]
[33,{"$f":"'Wettkampf 1'!B42","v":"Ostermann, Hildegard"},{"$f":"'Wettkampf 1'!C42","v":"Lahn III"},null,null,{"v":0,"d":"0.0"},0,0,0,0,0,0,0,0,0,0,0,1,{"$nulls":5},{"v":0,"d":"0.0"},1,0,""]
[34,{"$f":"'Wettkampf 1'!B43","v":"Willoh, Henrika"},{"$f":"'Wettkampf 1'!C43","v":"Lahn III"},null,null,{"v":0,"d":"0.0"},0,0,0,0,0,0,0,0,0,0,0,1,{"$nulls":5},{"v":0,"d":"0.0"},1,0,""]
[35,{"$f":"'Wettkampf 1'!B44","v":"Müller, Anita"},{"$f":"'Wettkampf 1'!C44","v":"Lahn III"},null,"x","0",0,0,0,0,0,0,0,0,0,0,"0",0,{"$nulls":5},{"v":0,"d":"0.0"},1,0,""]
[36,{"$f":"'Wettkampf 1'!B45","v":"Wilken, Elena"},{"$f":"'Wettkampf 1'!C45","v":"Lahn III"},null,"x","0",0,0,0,0,0,0,0,0,0,0,"0",0,{"$nulls":5},{"v":0,"d":"0.0"},1,0,""]
[{"$nulls":6},{"$f":"LARGE(G10:G45,1)+LARGE(G10:G45,2)+LARGE(G10:G45,3)","v":0},{"$f":"SUM(H10:H45)","v":4},{"$f":"LARGE(I10:I45,1)+LARGE(I10:I45,2)+LARGE(I10:I45,3)","v":0},{"$f":"SUM(J10:J45)","v":4},{"$f":"LARGE(K10:K45,1)+LARGE(K10:K45,2)+LARGE(K10:K45,3)","v":0},{"$f":"SUM(L10:L45)","v":5},{"$f":"LARGE(M10:M45,1)+LARGE(M10:M45,2)+LARGE(M10:M45,3)","v":0},{"$f":"SUM(N10:N45)","v":3},{"$f":"LARGE(O10:O45,1)+LARGE(O10:O45,2)+LARGE(O10:O45,3)","v":0},{"$f":"SUM(P10:P45)","v":4},{"$f":"LARGE(Q10:Q45,1)+LARGE(Q10:Q45,2)+LARGE(Q10:Q45,3)","v":0},{"$f":"SUM(R10:S45)","v":4}]
[null,null,"per Email an: sk-huemmling@gmx.de"]

{"sheet":"Ausdruck","index":13,"n_rows":48,"n_cols":29,"rows_kept":48,"merged":[[0,3,0,19],[0,24,0,25],[1,3,1,19],[1,24,1,25],[2,3,2,19],[3,3,3,19],[4,24,4,25],[5,24,5,25],[6,24,6,25],[8,22,8,25]]}
[null,"Verein / Gruppe","Ergebnisse",{"$f":"Übersicht!K1","v":"2019/2020"},{"$nulls":19},"Austragungsort:"]
[1,{"$f":"'Wettkampf 1'!B2","v":"Börger II"},null,"Klasse:",{"$nulls":19},"Wettkampftag:"]
[2,{"$f":"'Wettkampf 1'!B3","v":"Esterwegen V"},null,{"$f":"Übersicht!M1","v":"2. Kreisklasse"}]
[3,{"$f":"'Wettkampf 1'!B4","v":"Neuvrees II"},null,{"$f":"Übersicht!P1","v":"Damen"},{"$nulls":21},"Ansprechpartner für Rückfragen:"]
[4,{"$f":"'Wettkampf 1'!B5","v":"Lahn IV"},{"$nulls":21},"Name:"]
[5,{"$f":"'Wettkampf 1'!B6","v":"Börger III"},{"$nulls":21},"Tel:"]
[6,{"$f":"'Wettkampf 1'!B7","v":"Lahn III"},{"$nulls":21},"Standaufsicht:"]
[]
[null,"Name Schütze","Verein/Gruppe","Ergebnis","AW? ",null,"Verein 1",null,"Verein 2",null,"Verein 3",null,"Verein 4",null,"Verein 5",null,"Verein 6",{"$nulls":3},"Geburts-datum",null,"Proberechnung bei Streifen:"]
[1,{"$f":"'Wettkampf 1'!B10","v":"Kossenjans, Annegret"},{"$f":"'Wettkampf 1'!C10","v":"Börger II"},null,null,{"$f":"IF(E10=\"x\",\"0\",D10)","v":0},{"$f":"IF(C10=$B$2,F10,0)","v":0},{"$f":"(IF(AND($E10=\"\",$C10=$B$2),1,0))","v":1},{"$f":"IF($C10=$B$3,F10,0)","v":0},{"$f":"(IF(AND($E10=\"\",$C10=$B$3),1,0))","v":0},{"$f":"IF($C10=$B$4,F10,0)","v":0},{"$f":"(IF(AND($E10=\"\",$C10=$B$4),1,0))","v":0},{"$f":"IF($C10=$B$5,F10,0)","v":0},{"$f":"(IF(AND($E10=\"\",$C10=$B$5),1,0))","v":0},{"$f":"IF($C10=$B$6,F10,0)","v":0},{"$f":"(IF(AND($E10=\"\",$C10=$B$6),1,0))","v":0},{"$f":"IF($C10=$B$7,F10,0)","v":0},{"$f":"(IF(AND($E10=\"\",$C10=$B$7),1,0))","v":0},{"$nulls":8},{"$f":"IF(Z10=D10,1,0)","v":1},{"$f":"IF(Z10=0,0,1)","v":0},{"$f":"IF(AA10+AB10=2,\"Korrekt\",\"\")","v":""}]
[2,{"$f":"'Wettkampf 1'!B11","v":"Jansen, Elisabeth"},{"$f":"'Wettkampf 1'!C11","v":"Börger II"},null,null,{"$f":"IF(E11=\"x\",\"0\",D11)","v":0},{"$f":"IF(C11=$B$2,F11,0)","v":0},{"$f":"(IF(AND($E11=\"\",$C11=$B$2),1,0))","v":1},{"$f":"IF($C11=$B$3,F11,0)","v":0},{"$f":"(IF(AND($E11=\"\",$C11=$B$3),1,0))","v":0},{"$f":"IF($C11=$B$4,F11,0)","v":0},{"$f":"(IF(AND($E11=\"\",$C11=$B$4),1,0))","v":0},{"$f":"IF($C11=$B$5,F11,0)","v":0},{"$f":"(IF(AND($E11=\"\",$C11=$B$5),1,0))","v":0},{"$f":"IF($C11=$B$6,F11,0)","v":0},{"$f":"(IF(AND($E11=\"\",$C11=$B$6),1,0))","v":0},{"$f":"IF($C11=$B$7,F11,0)","v":0},{"$f":"(IF(AND($E11=\"\",$C11=$B$7),1,0))","v":0},{"$nulls":8},{"$f":"IF(Z11=D11,1,0)","v":1},{"$f":"IF(Z11=0,0,1)","v":0},{"$f":"IF(AA11+AB11=2,\"Korrekt\",\"\")","v":""}]
[3,{"$f":"'Wettkampf 1'!B12","v":"Krömer, Monika"},{"$f":"'Wettkampf 1'!C12","v":"Börger II"},null,null,0,0,1,0,0,0,0,0,0,0,0,0,0,{"$nulls":8},1,0,""]
[4,{"$f":"'Wettkampf 1'!B13","v":"Pohlgeers, Margret"},{"$f":"'Wettkampf 1'!C13","v":"Börger II"},null,null,0,0,1,0,0,0,0,0,0,0,0,0,0,{"$nulls":8},1,0,""]
[5,{"$f":"'Wettkampf 1'!B14","v":"Pohlgeers, Silvia"},{"$f":"'Wettkampf 1'!C14","v":"Börger II"},null,null,0,0,1,0,0,0,0,0,0,0,0,0,0,{"$nulls":8},1,0,""]
[6,{"$f":"'Wettkampf 1'!B15","v":"Schwarte, Annette"},{"$f":"'Wettkampf 1'!C15","v":"Börger II"},null,null,0,0,1,0,0,0,0,0,0,0,0,0,0,{"$nulls":8},1,0,""]
[7,{"$f":"'Wettkampf 1'!B16","v":"Lindemann, Kerstin"},{"$f":"'Wettkampf 1'!C16","v":"Esterwegen V"},null,null,0,0,0,0,1,0,0,0,0,0,0,0,0,{"$nulls":8},1,0,""]
[8,{"$f":"'Wettkampf 1'!B17","v":"Schlarmann, Lena"},{"$f":"'Wettkampf 1'!C17","v":"Esterwegen V"},null,null,0,0,0,0,1,0,0,0,0,0,0,0,0,{"$nulls":8},1,0,""]
[9,{"$f":"'Wettkampf 1'!B18","v":"Lindemann, Stefanie"},{"$f":"'Wettkampf 1'!C18","v":"Esterwegen V"},null,null,0,0,0,0,1,0,0,0,0,0,0,0,0,{"$nulls":8},1,0,""]
[10,{"$f":"'Wettkampf 1'!B19","v":"Lindemann, Rita"},{"$f":"'Wettkampf 1'!C19","v":"Esterwegen V"},null,null,0,0,0,0,1,0,0,0,0,0,0,0,0,{"$nulls":8},1,0,""]
[11,{"$f":"'Wettkampf 1'!B20","v":"Büter, Daniela"},{"$f":"'Wettkampf 1'!C20","v":"Esterwegen V"},null,null,0,0,0,0,1,0,0,0,0,0,0,0,0,{"$nulls":8},1,0,""]
[12,{"$f":"'Wettkampf 1'!B21","v":"Lindemann, Annemarie"},{"$f":"'Wettkampf 1'!C21","v":"Esterwegen V"},null,null,0,0,0,0,1,0,0,0,0,0,0,0,0,{"$nulls":8},1,0,""]
[13,{"$f":"'Wettkampf 1'!B22","v":"Preut, Susanne"},{"$f":"'Wettkampf 1'!C22","v":"Neuvrees II"},null,null,0,0,0,0,0,0,1,0,0,0,0,0,0,{"$nulls":8},1,0,""]
[14,{"$f":"'Wettkampf 1'!B23","v":"Thunert, Silvia"},{"$f":"'Wettkampf 1'!C23","v":"Neuvrees II"},null,null,0,0,0,0,0,0,1,0,0,0,0,0,0,{"$nulls":8},1,0,""]
[15,{"$f":"'Wettkampf 1'!B24","v":"Pohlmann, Margret"},{"$f":"'Wettkampf 1'!C24","v":"Neuvrees II"},null,null,0,0,0,0,0,0,1,0,0,0,0,0,0,{"$nulls":8},1,0,""]
[16,{"$f":"'Wettkampf 1'!B25","v":"Eilermann, Saskia"},{"$f":"'Wettkampf 1'!C25","v":"Neuvrees II"},null,null,0,0,0,0,0,0,1,0,0,0,0,0,0,{"$nulls":8},1,0,""]
[17,{"$f":"'Wettkampf 1'!B26","v":"Junge, Silvia"},{"$f":"'Wettkampf 1'!C26","v":"Neuvrees II"},null,null,0,0,0,0,0,0,1,0,0,0,0,0,0,{"$nulls":8},1,0,""]
[18,{"$f":"'Wettkampf 1'!B27","v":"Evers, Claudia"},{"$f":"'Wettkampf 1'!C27","v":"Neuvrees II"},null,null,0,0,0,0,0,0,1,0,0,0,0,0,0,{"$nulls":8},1,0,""]
[19,{"$f":"'Wettkampf 1'!B28","v":"Schulte, Christina"},{"$f":"'Wettkampf 1'!C28","v":"Neuvrees II"},null,null,0,0,0,0,0,0,1,0,0,0,0,0,0,{"$nulls":8},1,0,""]
[20,{"$f":"'Wettkampf 1'!B29","v":"Reinelt, Michaela"},{"$f":"'Wettkampf 1'!C29","v":"Lahn IV"},null,null,0,0,0,0,0,0,0,0,1,0,0,0,0,{"$nulls":8},1,0,""]
[21,{"$f":"'Wettkampf 1'!B30","v":"Thien, Marita"},{"$f":"'Wettkampf 1'!C30","v":"Lahn IV"},null,null,0,0,0,0,0,0,0,0,1,0,0,0,0,{"$nulls":8},1,0,""]
[22,{"$f":"'Wettkampf 1'!B31","v":"Robben, Anja"},{"$f":"'Wettkampf 1'!C31","v":"Lahn IV"},null,null,0,0,0,0,0,0,0,0,1,0,0,0,0,{"$nulls":8},1,0,""]
[23,{"$f":"'Wettkampf 1'!B32","v":"Oldopp, Maria"},{"$f":"'Wettkampf 1'!C32","v":"Lahn IV"},null,null,0,0,0,0,0,0,0,0,1,0,0,0,0,{"$nulls":8},1,0,""]
[24,{"$f":"'Wettkampf 1'!B33","v":"Hanneken, Doris"},{"$f":"'Wettkampf 1'!C33","v":"Lahn IV"},null,null,0,0,0,0,0,0,0,0,1,0,0,0,0,{"$nulls":8},1,0,""]
[25,{"$f":"'Wettkampf 1'!B34","v":"Kuchta, Gertrud"},{"$f":"'Wettkampf 1'!C34","v":"Börger III"},null,null,0,0,0,0,0,0,0,0,0,0,1,0,0,{"$nulls":8},1,0,""]
[26,{"$f":"'Wettkampf 1'!B35","v":"Jungsthöfel, Sabine"},{"$f":"'Wettkampf 1'!C35","v":"Börger III"},null,null,0,0,0,0,0,0,0,0,0,0,1,0,0,{"$nulls":8},1,0,""]
[27,{"$f":"'Wettkampf 1'!B36","v":"Schwarte, Gundula"},{"$f":"'Wettkampf 1'!C36","v":"Börger III"},null,null,0,0,0,0,0,0,0,0,0,0,1,0,0,{"$nulls":8},1,0,""]
[28,{"$f":"'Wettkampf 1'!B37","v":"Geers, Christa"},{"$f":"'Wettkampf 1'!C37","v":"Börger III"},null,null,0,0,0,0,0,0,0,0,0,0,1,0,0,{"$nulls":8},1,0,""]
[29,{"$f":"'Wettkampf 1'!B38","v":"Remmers, Tanja"},{"$f":"'Wettkampf 1'!C38","v":"Börger III"},null,null,0,0,0,0,0,0,0,0,0,0,1,0,0,{"$nulls":8},1,0,""]
[30,{"$f":"'Wettkampf 1'!B39","v":"Terhalle, Johanna"},{"$f":"'Wettkampf 1'!C39","v":"Börger III"},null,null,0,0,0,0,0,0,0,0,0,0,1,0,0,{"$nulls":8},1,0,""]
[31,{"$f":"'Wettkampf 1'!B40","v":"Hackstette, Lena"},{"$f":"'Wettkampf 1'!C40","v":"Lahn III"},null,null,0,0,0,0,0,0,0,0,0,0,0,0,1,{"$nulls":8},1,0,""]
[32,{"$f":"'Wettkampf 1'!B41","v":"Thyen, Christel"},{"$f":"'Wettkampf 1'!C41","v":"Lahn III"},null,null,0,0,0,0,0,0,0,0,0,0,0,0,1,{"$nulls":8},1,0,""]
[33,{"$f":"'Wettkampf 1'!B42","v":"Ostermann, Hildegard"},{"$f":"'Wettkampf 1'!C42","v":"Lahn III"},null,null,0,0,0,0,0,0,0,0,0,0,0,0,1,{"$nulls":8},1,0,""]
[34,{"$f":"'Wettkampf 1'!B43","v":"Willoh, Henrika"},{"$f":"'Wettkampf 1'!C43","v":"Lahn III"},null,null,0,0,0,0,0,0,0,0,0,0,0,0,1,{"$nulls":8},1,0,""]
[35,{"$f":"'Wettkampf 1'!B44","v":"Müller, Anita"},{"$f":"'Wettkampf 1'!C44","v":"Lahn III"},null,null,0,0,0,0,0,0,0,0,0,0,0,0,1,{"$nulls":8},1,0,""]
[36,{"$f":"'Wettkampf 1'!B45","v":"Wilken, Elena"},{"$f":"'Wettkampf 1'!C45","v":"Lahn III"},null,null,0,0,0,0,0,0,0,0,0,0,0,0,1,{"$nulls":8},1,0,""]
[{"$nulls":6},{"$f":"LARGE(G10:G45,1)+LARGE(G10:G45,2)+LARGE(G10:G45,3)","v":0},{"$f":"SUM(H10:H45)","v":6},{"$f":"LARGE(I10:I45,1)+LARGE(I10:I45,2)+LARGE(I10:I45,3)","v":0},{"$f":"SUM(J10:J45)","v":6},{"$f":"LARGE(K10:K45,1)+LARGE(K10:K45,2)+LARGE(K10:K45,3)","v":0},{"$f":"SUM(L10:L45)","v":7},{"$f":"LARGE(M10:M45,1)+LARGE(M10:M45,2)+LARGE(M10:M45,3)","v":0},{"$f":"SUM(N10:N45)","v":5},{"$f":"LARGE(O10:O45,1)+LARGE(O10:O45,2)+LARGE(O10:O45,3)","v":0},{"$f":"SUM(P10:P45)","v":6},{"$f":"LARGE(Q10:Q45,1)+LARGE(Q10:Q45,2)+LARGE(Q10:Q45,3)","v":0},{"$f":"SUM(R10:S45)","v":6}]
[]
[null,"Bitte beachtet, dass die Standaufsicht benannt werden muss"]

{"sheet":"Ausdruck blank","index":14,"n_rows":48,"n_cols":29,"rows_kept":48,"merged":[[0,3,0,19],[0,24,0,25],[1,3,1,19],[1,24,1,25],[2,3,2,19],[3,3,3,19],[4,24,4,25],[5,24,5,25],[6,24,6,25],[8,22,8,25]]}
[null,"Verein / Gruppe","Ergebnisse",{"$f":"Übersicht!K1","v":"2019/2020"},{"$nulls":19},"Austragungsort:"]
[1,null,null,"Klasse:",{"$nulls":19},"Wettkampftag:"]
[2]
[3,{"$nulls":24},"Ansprechpartner für Rückfragen:"]
[4,{"$nulls":22},"Name:"]
[5,{"$nulls":22},"Tel:"]
[6,{"$nulls":22},"Standaufsicht:"]
[]
[null,"Name Schütze","Verein/Gruppe","Ergebnis","AW? ",null,"Verein 1",null,"Verein 2",null,"Verein 3",null,"Verein 4",null,"Verein 5",null,"Verein 6",{"$nulls":3},"Geburts-datum",null,"Proberechnung bei Streifen:"]
[1,{"$nulls":4},{"$f":"IF(E10=\"x\",\"0\",D10)","v":0},{"$f":"IF(C10=$B$2,F10,0)","v":0},{"$f":"(IF(AND($E10=\"\",$C10=$B$2),1,0))","v":1},{"$f":"IF($C10=$B$3,F10,0)","v":0},{"$f":"(IF(AND($E10=\"\",$C10=$B$3),1,0))","v":1},{"$f":"IF($C10=$B$4,F10,0)","v":0},{"$f":"(IF(AND($E10=\"\",$C10=$B$4),1,0))","v":1},{"$f":"IF($C10=$B$5,F10,0)","v":0},{"$f":"(IF(AND($E10=\"\",$C10=$B$5),1,0))","v":1},{"$f":"IF($C10=$B$6,F10,0)","v":0},{"$f":"(IF(AND($E10=\"\",$C10=$B$6),1,0))","v":1},{"$f":"IF($C10=$B$7,F10,0)","v":0},{"$f":"(IF(AND($E10=\"\",$C10=$B$7),1,0))","v":1},{"$nulls":8},{"$f":"IF(Z10=D10,1,0)","v":1},{"$f":"IF(Z10=0,0,1)","v":0},{"$f":"IF(AA10+AB10=2,\"Korrekt\",\"\")","v":""}]
[2,{"$nulls":4},{"$f":"IF(E11=\"x\",\"0\",D11)","v":0},{"$f":"IF(C11=$B$2,F11,0)","v":0},{"$f":"(IF(AND($E11=\"\",$C11=$B$2),1,0))","v":1},{"$f":"IF($C11=$B$3,F11,0)","v":0},{"$f":"(IF(AND($E11=\"\",$C11=$B$3),1,0))","v":1},{"$f":"IF($C11=$B$4,F11,0)","v":0},{"$f":"(IF(AND($E11=\"\",$C11=$B$4),1,0))","v":1},{"$f":"IF($C11=$B$5,F11,0)","v":0},{"$f":"(IF(AND($E11=\"\",$C11=$B$5),1,0))","v":1},{"$f":"IF($C11=$B$6,F11,0)","v":0},{"$f":"(IF(AND($E11=\"\",$C11=$B$6),1,0))","v":1},{"$f":"IF($C11=$B$7,F11,0)","v":0},{"$f":"(IF(AND($E11=\"\",$C11=$B$7),1,0))","v":1},{"$nulls":8},{"$f":"IF(Z11=D11,1,0)","v":1},{"$f":"IF(Z11=0,0,1)","v":0},{"$f":"IF(AA11+AB11=2,\"Korrekt\",\"\")","v":""}]
[3,{"$nulls":4},0,0,1,0,1,0,1,0,1,0,1,0,1,{"$nulls":8},1,0,""]
[4,{"$nulls":4},0,0,1,0,1,0,1,0,1,0,1,0,1,{"$nulls":8},1,0,""]
[5,{"$nulls":4},0,0,1,0,1,0,1,0,1,0,1,0,1,{"$nulls":8},1,0,""]
[6,{"$nulls":4},0,0,1,0,1,0,1,0,1,0,1,0,1,{"$nulls":8},1,0,""]
[7,{"$nulls":4},0,0,1,0,1,0,1,0,1,0,1,0,1,{"$nulls":8},1,0,""]
[8,{"$nulls":4},0,0,1,0,1,0,1,0,1,0,1,0,1,{"$nulls":8},1,0,""]
[9,{"$nulls":4},0,0,1,0,1,0,1,0,1,0,1,0,1,{"$nulls":8},1,0,""]
[10,{"$nulls":4},0,0,1,0,1,0,1,0,1,0,1,0,1,{"$nulls":8},1,0,""]
[11,{"$nulls":4},0,0,1,0,1,0,1,0,1,0,1,0,1,{"$nulls":8},1,0,""]
[12,{"$nulls":4},0,0,1,0,1,0,1,0,1,0,1,0,1,{"$nulls":8},1,0,""]
[13,{"$nulls":4},0,0,1,0,1,0,1,0,1,0,1,0,1,{"$nulls":8},1,0,""]
[14,{"$nulls":4},0,0,1,0,1,0,1,0,1,0,1,0,1,{"$nulls":8},1,0,""]
[15,{"$nulls":4},0,0,1,0,1,0,1,0,1,0,1,0,1,{"$nulls":8},1,0,""]
[16,{"$nulls":4},0,0,1,0,1,0,1,0,1,0,1,0,1,{"$nulls":8},1,0,""]
[17,{"$nulls":4},0,0,1,0,1,0,1,0,1,0,1,0,1,{"$nulls":8},1,0,""]
[18,{"$nulls":4},0,0,1,0,1,0,1,0,1,0,1,0,1,{"$nulls":8},1,0,""]
[19,{"$nulls":4},0,0,1,0,1,0,1,0,1,0,1,0,1,{"$nulls":8},1,0,""]
[20,{"$nulls":4},0,0,1,0,1,0,1,0,1,0,1,0,1,{"$nulls":8},1,0,""]
[21,{"$nulls":4},0,0,1,0,1,0,1,0,1,0,1,0,1,{"$nulls":8},1,0,""]
[22,{"$nulls":4},0,0,1,0,1,0,1,0,1,0,1,0,1,{"$nulls":8},1,0,""]
[23,{"$nulls":4},0,0,1,0,1,0,1,0,1,0,1,0,1,{"$nulls":8},1,0,""]
[24,{"$nulls":4},0,0,1,0,1,0,1,0,1,0,1,0,1,{"$nulls":8},1,0,""]
[25,{"$nulls":4},0,0,1,0,1,0,1,0,1,0,1,0,1,{"$nulls":8},1,0,""]
[26,{"$nulls":4},0,0,1,0,1,0,1,0,1,0,1,0,1,{"$nulls":8},1,0,""]
[27,{"$nulls":4},0,0,1,0,1,0,1,0,1,0,1,0,1,{"$nulls":8},1,0,""]
[28,{"$nulls":4},0,0,1,0,1,0,1,0,1,0,1,0,1,{"$nulls":8},1,0,""]
[29,{"$nulls":4},0,0,1,0,1,0,1,0,1,0,1,0,1,{"$nulls":8},1,0,""]
[30,{"$nulls":4},0,0,1,0,1,0,1,0,1,0,1,0,1,{"$nulls":8},1,0,""]
[31,{"$nulls":4},0,0,1,0,1,0,1,0,1,0,1,0,1,{"$nulls":8},1,0,""]
[32,{"$nulls":4},0,0,1,0,1,0,1,0,1,0,1,0,1,{"$nulls":8},1,0,""]
[33,{"$nulls":4},0,0,1,0,1,0,1,0,1,0,1,0,1,{"$nulls":8},1,0,""]
[34,{"$nulls":4},0,0,1,0,1,0,1,0,1,0,1,0,1,{"$nulls":8},1,0,""]
[35,{"$nulls":4},0,0,1,0,1,0,1,0,1,0,1,0,1,{"$nulls":8},1,0,""]
[36,{"$nulls":4},0,0,1,0,1,0,1,0,1,0,1,0,1,{"$nulls":8},1,0,""]
[{"$nulls":6},{"$f":"LARGE(G10:G45,1)+LARGE(G10:G45,2)+LARGE(G10:G45,3)","v":0},{"$f":"SUM(H10:H45)","v":36},{"$f":"LARGE(I10:I45,1)+LARGE(I10:I45,2)+LARGE(I10:I45,3)","v":0},{"$f":"SUM(J10:J45)","v":36},{"$f":"LARGE(K10:K45,1)+LARGE(K10:K45,2)+LARGE(K10:K45,3)","v":0},{"$f":"SUM(L10:L45)","v":36},{"$f":"LARGE(M10:M45,1)+LARGE(M10:M45,2)+LARGE(M10:M45,3)","v":0},{"$f":"SUM(N10:N45)","v":36},{"$f":"LARGE(O10:O45,1)+LARGE(O10:O45,2)+LARGE(O10:O45,3)","v":0},{"$f":"SUM(P10:P45)","v":36},{"$f":"LARGE(Q10:Q45,1)+LARGE(Q10:Q45,2)+LARGE(Q10:Q45,3)","v":0},{"$f":"SUM(R10:S45)","v":36}]
[]
[null,"Bitte beachtet, dass die Standaufsicht benannt werden muss"]

{"sheet":"Übersicht Schützen","index":15,"n_rows":37,"n_cols":23,"rows_kept":37,"hidden":true}
[null,null,{"v":1,"d":"1.0"},{"v":2,"d":"2.0"},{"v":3,"d":"3.0"},{"v":4,"d":"4.0"},{"v":5,"d":"5.0"},{"v":6,"d":"6.0"},{"$nulls":3},{"v":7,"d":"7.0"},{"v":8,"d":"8.0"},{"v":9,"d":"9.0"},{"v":10,"d":"10.0"},{"v":11,"d":"11.0"},{"v":12,"d":"12.0"}]
["Lindemann, Rita",{"$f":"VLOOKUP(A2,'Wettkampf 1'!$B$10:$C$45,2,FALSE)","v":"Esterwegen V"},{"$f":"VLOOKUP(A2,'Wettkampf 1'!$B$10:$D$45,3,FALSE)","v":313.4},{"$f":"VLOOKUP($A2,'2'!$B$10:$D$45,3,FALSE)","v":317.5},{"$f":"VLOOKUP($A2,'3'!$B$10:$D$45,3,FALSE)","v":314.5},{"$f":"VLOOKUP($A2,'4'!$B$10:$D$45,3,FALSE)","v":{"v":315,"d":"315.0"}},{"$f":"VLOOKUP($A2,'5'!$B$10:$D$45,3,FALSE)","v":316.6},{"$f":"VLOOKUP($A2,'6'!$B$10:$D$45,3,FALSE)","v":315.6},{"$f":"K2/J2","v":{"v":315.43333333333334,"d":"315.4"}},{"$f":"VLOOKUP(A2,Formelhilfe!$A$9:$H$44,8,FALSE)","v":{"v":6,"d":"6.0"}},{"$f":"SUM(C2:H2)","v":{"v":1892.6,"d":"1,892.6"}},{"$f":"VLOOKUP($A2,'7'!$B$10:$D$45,3,FALSE)","v":316.1},{"$f":"VLOOKUP($A2,'8'!$B$10:$D$45,3,FALSE)","v":{"v":315,"d":"315.0"}},{"$f":"VLOOKUP($A2,'9'!$B$10:$D$45,3,FALSE)","v":317.2},{"$f":"VLOOKUP($A2,'10'!$B$10:$D$45,3,FALSE)","v":313.7},{"$f":"VLOOKUP($A2,'11'!$B$10:$D$45,3,FALSE)","v":316.8},{"$f":"VLOOKUP($A2,'12'!$B$10:$D$45,3,FALSE)","v":{"v":0,"d":"0.0"}},{"$f":"T2/S2","v":{"v":315.76,"d":"315.8"}},{"$f":"VLOOKUP(A2,Formelhilfe!$A$9:$O$44,15,FALSE)","v":{"v":5,"d":"5.0"}},{"$f":"SUM(L2:Q2)","v":{"v":1578.8,"d":"1,578.8"}},{"$f":"W2/V2","v":{"v":315.58181818181816,"d":"315.6"}},{"$f":"VLOOKUP(A2,Formelhilfe!$A$9:$P$44,16,FALSE)","v":{"v":11,"d":"11.0"}},{"$f":"SUM(C2:H2,L2:Q2)","v":{"v":3471.3999999999996,"d":"3,471.4"}}]
["Schlarmann, Lena",{"$f":"VLOOKUP(A3,'Wettkampf 1'!$B$10:$C$45,2,FALSE)","v":"Esterwegen V"},{"$f":"VLOOKUP(A3,'Wettkampf 1'!$B$10:$D$45,3,FALSE)","v":311.4},{"$f":"VLOOKUP($A3,'2'!$B$10:$D$45,3,FALSE)","v":{"v":312,"d":"312.0"}},{"$f":"VLOOKUP($A3,'3'!$B$10:$D$45,3,FALSE)","v":309.8},{"$f":"VLOOKUP($A3,'4'!$B$10:$D$45,3,FALSE)","v":{"v":310,"d":"310.0"}},{"$f":"VLOOKUP($A3,'5'!$B$10:$D$45,3,FALSE)","v":311.3},{"$f":"VLOOKUP($A3,'6'!$B$10:$D$45,3,FALSE)","v":{"v":311,"d":"311.0"}},{"$f":"K3/J3","v":{"v":310.9166666666667,"d":"310.9"}},{"$f":"VLOOKUP(A3,Formelhilfe!$A$9:$H$44,8,FALSE)","v":{"v":6,"d":"6.0"}},{"$f":"SUM(C3:H3)","v":{"v":1865.5,"d":"1,865.5"}},{"$f":"VLOOKUP($A3,'7'!$B$10:$D$45,3,FALSE)","v":311.5},{"$f":"VLOOKUP($A3,'8'!$B$10:$D$45,3,FALSE)","v":312.6},{"$f":"VLOOKUP($A3,'9'!$B$10:$D$45,3,FALSE)","v":304.5},{"$f":"VLOOKUP($A3,'10'!$B$10:$D$45,3,FALSE)","v":312.6},{"$f":"VLOOKUP($A3,'11'!$B$10:$D$45,3,FALSE)","v":309.2},{"$f":"VLOOKUP($A3,'12'!$B$10:$D$45,3,FALSE)","v":{"v":0,"d":"0.0"}},{"$f":"T3/S3","v":{"v":310.08000000000004,"d":"310.1"}},{"$f":"VLOOKUP(A3,Formelhilfe!$A$9:$O$44,15,FALSE)","v":{"v":5,"d":"5.0"}},{"$f":"SUM(L3:Q3)","v":{"v":1550.4,"d":"1,550.4"}},{"$f":"W3/V3","v":{"v":310.5363636363636,"d":"310.5"}},{"$f":"VLOOKUP(A3,Formelhilfe!$A$9:$P$44,16,FALSE)","v":{"v":11,"d":"11.0"}},{"$f":"SUM(C3:H3,L3:Q3)","v":{"v":3415.8999999999996,"d":"3,415.9"}}]
["Thien, Marita",{"$f":"VLOOKUP(A4,'Wettkampf 1'!$B$10:$C$45,2,FALSE)","v":"Lahn IV"},{"$f":"VLOOKUP(A4,'Wettkampf 1'!$B$10:$D$45,3,FALSE)","v":308.6},{"$f":"VLOOKUP($A4,'2'!$B$10:$D$45,3,FALSE)","v":306.7},{"$f":"VLOOKUP($A4,'3'!$B$10:$D$45,3,FALSE)","v":306.4},{"$f":"VLOOKUP($A4,'4'!$B$10:$D$45,3,FALSE)","v":{"v":309,"d":"309.0"}},{"$f":"VLOOKUP($A4,'5'!$B$10:$D$45,3,FALSE)","v":311.7},{"$f":"VLOOKUP($A4,'6'!$B$10:$D$45,3,FALSE)","v":309.5},{"$f":"K4/J4","v":{"v":308.65,"d":"308.7"}},{"$f":"VLOOKUP(A4,Formelhilfe!$A$9:$H$44,8,FALSE)","v":{"v":6,"d":"6.0"}},{"$f":"SUM(C4:H4)","v":{"v":1851.8999999999999,"d":"1,851.9"}},{"$f":"VLOOKUP($A4,'7'!$B$10:$D$45,3,FALSE)","v":311.2},{"$f":"VLOOKUP($A4,'8'!$B$10:$D$45,3,FALSE)","v":312.3},{"$f":"VLOOKUP($A4,'9'!$B$10:$D$45,3,FALSE)","v":310.3},{"$f":"VLOOKUP($A4,'10'!$B$10:$D$45,3,FALSE)","v":311.7},{"$f":"VLOOKUP($A4,'11'!$B$10:$D$45,3,FALSE)","v":{"v":312,"d":"312.0"}},{"$f":"VLOOKUP($A4,'12'!$B$10:$D$45,3,FALSE)","v":{"v":0,"d":"0.0"}},{"$f":"T4/S4","v":311.5},{"$f":"VLOOKUP(A4,Formelhilfe!$A$9:$O$44,15,FALSE)","v":{"v":5,"d":"5.0"}},{"$f":"SUM(L4:Q4)","v":{"v":1557.5,"d":"1,557.5"}},{"$f":"W4/V4","v":{"v":309.94545454545454,"d":"309.9"}},{"$f":"VLOOKUP(A4,Formelhilfe!$A$9:$P$44,16,FALSE)","v":{"v":11,"d":"11.0"}},{"$f":"SUM(C4:H4,L4:Q4)","v":{"v":3409.4,"d":"3,409.4"}}]
["Willoh, Henrika",{"$f":"VLOOKUP(A5,'Wettkampf 1'!$B$10:$C$45,2,FALSE)","v":"Lahn III"},{"$f":"VLOOKUP(A5,'Wettkampf 1'!$B$10:$D$45,3,FALSE)","v":309.3},{"$f":"VLOOKUP($A5,'2'!$B$10:$D$45,3,FALSE)","v":309.3},{"$f":"VLOOKUP($A5,'3'!$B$10:$D$45,3,FALSE)","v":308.1},{"$f":"VLOOKUP($A5,'4'!$B$10:$D$45,3,FALSE)","v":310.7},{"$f":"VLOOKUP($A5,'5'!$B$10:$D$45,3,FALSE)","v":310.3},{"$f":"VLOOKUP($A5,'6'!$B$10:$D$45,3,FALSE)","v":309.2},{"$f":"K5/J5","v":{"v":309.48333333333335,"d":"309.5"}},{"$f":"VLOOKUP(A5,Formelhilfe!$A$9:$H$44,8,FALSE)","v":{"v":6,"d":"6.0"}},{"$f":"SUM(C5:H5)","v":{"v":1856.9,"d":"1,856.9"}},{"$f":"VLOOKUP($A5,'7'!$B$10:$D$45,3,FALSE)","v":306.4},{"$f":"VLOOKUP($A5,'8'!$B$10:$D$45,3,FALSE)","v":309.8},{"$f":"VLOOKUP($A5,'9'!$B$10:$D$45,3,FALSE)","v":310.4},{"$f":"VLOOKUP($A5,'10'!$B$10:$D$45,3,FALSE)","v":312.2},{"$f":"VLOOKUP($A5,'11'!$B$10:$D$45,3,FALSE)","v":311.1},{"$f":"VLOOKUP($A5,'12'!$B$10:$D$45,3,FALSE)","v":{"v":0,"d":"0.0"}},{"$f":"T5/S5","v":{"v":309.98,"d":"310.0"}},{"$f":"VLOOKUP(A5,Formelhilfe!$A$9:$O$44,15,FALSE)","v":{"v":5,"d":"5.0"}},{"$f":"SUM(L5:Q5)","v":{"v":1549.9,"d":"1,549.9"}},{"$f":"W5/V5","v":{"v":309.70909090909095,"d":"309.7"}},{"$f":"VLOOKUP(A5,Formelhilfe!$A$9:$P$44,16,FALSE)","v":{"v":11,"d":"11.0"}},{"$f":"SUM(C5:H5,L5:Q5)","v":{"v":3406.8,"d":"3,406.8"}}]
["Terhalle, Johanna",{"$f":"VLOOKUP(A6,'Wettkampf 1'!$B$10:$C$45,2,FALSE)","v":"Börger III"},{"$f":"VLOOKUP(A6,'Wettkampf 1'!$B$10:$D$45,3,FALSE)","v":311.4},{"$f":"VLOOKUP($A6,'2'!$B$10:$D$45,3,FALSE)","v":308.8},{"$f":"VLOOKUP($A6,'3'!$B$10:$D$45,3,FALSE)","v":305.2},{"$f":"VLOOKUP($A6,'4'!$B$10:$D$45,3,FALSE)","v":309.4},{"$f":"VLOOKUP($A6,'5'!$B$10:$D$45,3,FALSE)","v":311.4},{"$f":"VLOOKUP($A6,'6'!$B$10:$D$45,3,FALSE)","v":{"v":309,"d":"309.0"}},{"$f":"K6/J6","v":{"v":309.20000000000005,"d":"309.2"}},{"$f":"VLOOKUP(A6,Formelhilfe!$A$9:$H$44,8,FALSE)","v":{"v":6,"d":"6.0"}},{"$f":"SUM(C6:H6)","v":{"v":1855.2000000000003,"d":"1,855.2"}},{"$f":"VLOOKUP($A6,'7'!$B$10:$D$45,3,FALSE)","v":311.9},{"$f":"VLOOKUP($A6,'8'!$B$10:$D$45,3,FALSE)","v":309.3},{"$f":"VLOOKUP($A6,'9'!$B$10:$D$45,3,FALSE)","v":309.1},{"$f":"VLOOKUP($A6,'10'!$B$10:$D$45,3,FALSE)","v":304.5},{"$f":"VLOOKUP($A6,'11'!$B$10:$D$45,3,FALSE)","v":309.4},{"$f":"VLOOKUP($A6,'12'!$B$10:$D$45,3,FALSE)","v":{"v":0,"d":"0.0"}},{"$f":"T6/S6","v":{"v":308.84000000000003,"d":"308.8"}},{"$f":"VLOOKUP(A6,Formelhilfe!$A$9:$O$44,15,FALSE)","v":{"v":5,"d":"5.0"}},{"$f":"SUM(L6:Q6)","v":{"v":1544.2000000000003,"d":"1,544.2"}},{"$f":"W6/V6","v":{"v":309.03636363636366,"d":"309.0"}},{"$f":"VLOOKUP(A6,Formelhilfe!$A$9:$P$44,16,FALSE)","v":{"v":11,"d":"11.0"}},{"$f":"SUM(C6:H6,L6:Q6)","v":{"v":3399.4000000000005,"d":"3,399.4"}}]
["Pohlgeers, Margret",{"$f":"VLOOKUP(A7,'Wettkampf 1'!$B$10:$C$45,2,FALSE)","v":"Börger II"},{"$f":"VLOOKUP(A7,'Wettkampf 1'!$B$10:$D$45,3,FALSE)","v":307.4},{"$f":"VLOOKUP($A7,'2'!$B$10:$D$45,3,FALSE)","v":307.7},{"$f":"VLOOKUP($A7,'3'!$B$10:$D$45,3,FALSE)","v":308.1},{"$f":"VLOOKUP($A7,'4'!$B$10:$D$45,3,FALSE)","v":307.5},{"$f":"VLOOKUP($A7,'5'!$B$10:$D$45,3,FALSE)","v":309.3},{"$f":"VLOOKUP($A7,'6'!$B$10:$D$45,3,FALSE)","v":312.4},{"$f":"K7/J7","v":{"v":308.7333333333333,"d":"308.7"}},{"$f":"VLOOKUP(A7,Formelhilfe!$A$9:$H$44,8,FALSE)","v":{"v":6,"d":"6.0"}},{"$f":"SUM(C7:H7)","v":{"v":1852.3999999999996,"d":"1,852.4"}},{"$f":"VLOOKUP($A7,'7'!$B$10:$D$45,3,FALSE)","v":308.6},{"$f":"VLOOKUP($A7,'8'!$B$10:$D$45,3,FALSE)","v":308.7},{"$f":"VLOOKUP($A7,'9'!$B$10:$D$45,3,FALSE)","v":{"v":309,"d":"309.0"}},{"$f":"VLOOKUP($A7,'10'!$B$10:$D$45,3,FALSE)","v":309.2},{"$f":"VLOOKUP($A7,'11'!$B$10:$D$45,3,FALSE)","v":311.4},{"$f":"VLOOKUP($A7,'12'!$B$10:$D$45,3,FALSE)","v":{"v":0,"d":"0.0"}},{"$f":"T7/S7","v":{"v":309.38,"d":"309.4"}},{"$f":"VLOOKUP(A7,Formelhilfe!$A$9:$O$44,15,FALSE)","v":{"v":5,"d":"5.0"}},{"$f":"SUM(L7:Q7)","v":{"v":1546.9,"d":"1,546.9"}},{"$f":"W7/V7","v":{"v":309.02727272727265,"d":"309.0"}},{"$f":"VLOOKUP(A7,Formelhilfe!$A$9:$P$44,16,FALSE)","v":{"v":11,"d":"11.0"}},{"$f":"SUM(C7:H7,L7:Q7)","v":{"v":3399.2999999999993,"d":"3,399.3"}}]
["Thunert, Silvia",{"$f":"VLOOKUP(A8,'Wettkampf 1'!$B$10:$C$45,2,FALSE)","v":"Neuvrees II"},{"$f":"VLOOKUP(A8,'Wettkampf 1'!$B$10:$D$45,3,FALSE)","v":310.8},{"$f":"VLOOKUP($A8,'2'!$B$10:$D$45,3,FALSE)","v":307.4},{"$f":"VLOOKUP($A8,'3'!$B$10:$D$45,3,FALSE)","v":310.9},{"$f":"VLOOKUP($A8,'4'!$B$10:$D$45,3,FALSE)","v":308.4},{"$f":"VLOOKUP($A8,'5'!$B$10:$D$45,3,FALSE)","v":308.3},{"$f":"VLOOKUP($A8,'6'!$B$10:$D$45,3,FALSE)","v":306.7},{"$f":"K8/J8","v":{"v":308.75,"d":"308.8"}},{"$f":"VLOOKUP(A8,Formelhilfe!$A$9:$H$44,8,FALSE)","v":{"v":6,"d":"6.0"}},{"$f":"SUM(C8:H8)","v":{"v":1852.5,"d":"1,852.5"}},{"$f":"VLOOKUP($A8,'7'!$B$10:$D$45,3,FALSE)","v":309.5},{"$f":"VLOOKUP($A8,'8'!$B$10:$D$45,3,FALSE)","v":306.6},{"$f":"VLOOKUP($A8,'9'!$B$10:$D$45,3,FALSE)","v":306.9},{"$f":"VLOOKUP($A8,'10'!$B$10:$D$45,3,FALSE)","v":307.9},{"$f":"VLOOKUP($A8,'11'!$B$10:$D$45,3,FALSE)","v":313.9},{"$f":"VLOOKUP($A8,'12'!$B$10:$D$45,3,FALSE)","v":{"v":0,"d":"0.0"}},{"$f":"T8/S8","v":{"v":308.96000000000004,"d":"309.0"}},{"$f":"VLOOKUP(A8,Formelhilfe!$A$9:$O$44,15,FALSE)","v":{"v":5,"d":"5.0"}},{"$f":"SUM(L8:Q8)","v":{"v":1544.8000000000002,"d":"1,544.8"}},{"$f":"W8/V8","v":{"v":308.8454545454546,"d":"308.8"}},{"$f":"VLOOKUP(A8,Formelhilfe!$A$9:$P$44,16,FALSE)","v":{"v":11,"d":"11.0"}},{"$f":"SUM(C8:H8,L8:Q8)","v":{"v":3397.3,"d":"3,397.3"}}]
["Lindemann, Kerstin",{"$f":"VLOOKUP(A9,'Wettkampf 1'!$B$10:$C$45,2,FALSE)","v":"Esterwegen V"},{"$f":"VLOOKUP(A9,'Wettkampf 1'!$B$10:$D$45,3,FALSE)","v":306.3},{"$f":"VLOOKUP($A9,'2'!$B$10:$D$45,3,FALSE)","v":310.6},{"$f":"VLOOKUP($A9,'3'!$B$10:$D$45,3,FALSE)","v":310.4},{"$f":"VLOOKUP($A9,'4'!$B$10:$D$45,3,FALSE)","v":{"v":309,"d":"309.0"}},{"$f":"VLOOKUP($A9,'5'!$B$10:$D$45,3,FALSE)","v":307.9},{"$f":"VLOOKUP($A9,'6'!$B$10:$D$45,3,FALSE)","v":306.6},{"$f":"K9/J9","v":{"v":308.4666666666667,"d":"308.5"}},{"$f":"VLOOKUP(A9,Formelhilfe!$A$9:$H$44,8,FALSE)","v":{"v":6,"d":"6.0"}},{"$f":"SUM(C9:H9)","v":{"v":1850.8000000000002,"d":"1,850.8"}},{"$f":"VLOOKUP($A9,'7'!$B$10:$D$45,3,FALSE)","v":310.5},{"$f":"VLOOKUP($A9,'8'!$B$10:$D$45,3,FALSE)","v":309.3},{"$f":"VLOOKUP($A9,'9'!$B$10:$D$45,3,FALSE)","v":307.5},{"$f":"VLOOKUP($A9,'10'!$B$10:$D$45,3,FALSE)","v":311.5},{"$f":"VLOOKUP($A9,'11'!$B$10:$D$45,3,FALSE)","v":305.7},{"$f":"VLOOKUP($A9,'12'!$B$10:$D$45,3,FALSE)","v":{"v":0,"d":"0.0"}},{"$f":"T9/S9","v":308.9},{"$f":"VLOOKUP(A9,Formelhilfe!$A$9:$O$44,15,FALSE)","v":{"v":5,"d":"5.0"}},{"$f":"SUM(L9:Q9)","v":{"v":1544.5,"d":"1,544.5"}},{"$f":"W9/V9","v":{"v":308.6636363636364,"d":"308.7"}},{"$f":"VLOOKUP(A9,Formelhilfe!$A$9:$P$44,16,FALSE)","v":{"v":11,"d":"11.0"}},{"$f":"SUM(C9:H9,L9:Q9)","v":{"v":3395.3,"d":"3,395.3"}}]
["Reinelt, Michaela",{"$f":"VLOOKUP(A10,'Wettkampf 1'!$B$10:$C$45,2,FALSE)","v":"Lahn IV"},{"$f":"VLOOKUP(A10,'Wettkampf 1'!$B$10:$D$45,3,FALSE)","v":310.8},{"$f":"VLOOKUP($A10,'2'!$B$10:$D$45,3,FALSE)","v":303.6},{"$f":"VLOOKUP($A10,'3'!$B$10:$D$45,3,FALSE)","v":307.4},{"$f":"VLOOKUP($A10,'4'!$B$10:$D$45,3,FALSE)","v":309.1},{"$f":"VLOOKUP($A10,'5'!$B$10:$D$45,3,FALSE)","v":310.8},{"$f":"VLOOKUP($A10,'6'!$B$10:$D$45,3,FALSE)","v":310.3},{"$f":"K10/J10","v":{"v":308.6666666666667,"d":"308.7"}},{"$f":"VLOOKUP(A10,Formelhilfe!$A$9:$H$44,8,FALSE)","v":{"v":6,"d":"6.0"}},{"$f":"SUM(C10:H10)","v":{"v":1852,"d":"1,852.0"}},{"$f":"VLOOKUP($A10,'7'!$B$10:$D$45,3,FALSE)","v":308.2},{"$f":"VLOOKUP($A10,'8'!$B$10:$D$45,3,FALSE)","v":307.7},{"$f":"VLOOKUP($A10,'9'!$B$10:$D$45,3,FALSE)","v":310.2},{"$f":"VLOOKUP($A10,'10'!$B$10:$D$45,3,FALSE)","v":308.8},{"$f":"VLOOKUP($A10,'11'!$B$10:$D$45,3,FALSE)","v":308.2},{"$f":"VLOOKUP($A10,'12'!$B$10:$D$45,3,FALSE)","v":{"v":0,"d":"0.0"}},{"$f":"T10/S10","v":{"v":308.62,"d":"308.6"}},{"$f":"VLOOKUP(A10,Formelhilfe!$A$9:$O$44,15,FALSE)","v":{"v":5,"d":"5.0"}},{"$f":"SUM(L10:Q10)","v":{"v":1543.1,"d":"1,543.1"}},{"$f":"W10/V10","v":{"v":308.64545454545447,"d":"308.6"}},{"$f":"VLOOKUP(A10,Formelhilfe!$A$9:$P$44,16,FALSE)","v":{"v":11,"d":"11.0"}},{"$f":"SUM(C10:H10,L10:Q10)","v":{"v":3395.0999999999995,"d":"3,395.1"}}]
["Thyen, Christel",{"$f":"VLOOKUP(A11,'Wettkampf 1'!$B$10:$C$45,2,FALSE)","v":"Lahn III"},{"$f":"VLOOKUP(A11,'Wettkampf 1'!$B$10:$D$45,3,FALSE)","v":309.9},{"$f":"VLOOKUP($A11,'2'!$B$10:$D$45,3,FALSE)","v":{"v":299,"d":"299.0"}},{"$f":"VLOOKUP($A11,'3'!$B$10:$D$45,3,FALSE)","v":307.2},{"$f":"VLOOKUP($A11,'4'!$B$10:$D$45,3,FALSE)","v":{"v":313,"d":"313.0"}},{"$f":"VLOOKUP($A11,'5'!$B$10:$D$45,3,FALSE)","v":314.8},{"$f":"VLOOKUP($A11,'6'!$B$10:$D$45,3,FALSE)","v":308.1},{"$f":"K11/J11","v":{"v":308.6666666666667,"d":"308.7"}},{"$f":"VLOOKUP(A11,Formelhilfe!$A$9:$H$44,8,FALSE)","v":{"v":6,"d":"6.0"}},{"$f":"SUM(C11:H11)","v":{"v":1852,"d":"1,852.0"}},{"$f":"VLOOKUP($A11,'7'!$B$10:$D$45,3,FALSE)","v":313.4},{"$f":"VLOOKUP($A11,'8'!$B$10:$D$45,3,FALSE)","v":306.1},{"$f":"VLOOKUP($A11,'9'!$B$10:$D$45,3,FALSE)","v":305.7},{"$f":"VLOOKUP($A11,'10'!$B$10:$D$45,3,FALSE)","v":308.8},{"$f":"VLOOKUP($A11,'11'!$B$10:$D$45,3,FALSE)","v":305.8},{"$f":"VLOOKUP($A11,'12'!$B$10:$D$45,3,FALSE)","v":{"v":0,"d":"0.0"}},{"$f":"T11/S11","v":{"v":307.96,"d":"308.0"}},{"$f":"VLOOKUP(A11,Formelhilfe!$A$9:$O$44,15,FALSE)","v":{"v":5,"d":"5.0"}},{"$f":"SUM(L11:Q11)","v":{"v":1539.8,"d":"1,539.8"}},{"$f":"W11/V11","v":{"v":308.3454545454546,"d":"308.3"}},{"$f":"VLOOKUP(A11,Formelhilfe!$A$9:$P$44,16,FALSE)","v":{"v":11,"d":"11.0"}},{"$f":"SUM(C11:H11,L11:Q11)","v":{"v":3391.8,"d":"3,391.8"}}]
["Robben, Anja",{"$f":"VLOOKUP(A12,'Wettkampf 1'!$B$10:$C$45,2,FALSE)","v":"Lahn IV"},{"$f":"VLOOKUP(A12,'Wettkampf 1'!$B$10:$D$45,3,FALSE)","v":308.9},{"$f":"VLOOKUP($A12,'2'!$B$10:$D$45,3,FALSE)","v":307.7},{"$f":"VLOOKUP($A12,'3'!$B$10:$D$45,3,FALSE)","v":306.3},{"$f":"VLOOKUP($A12,'4'!$B$10:$D$45,3,FALSE)","v":307.3},{"$f":"VLOOKUP($A12,'5'!$B$10:$D$45,3,FALSE)","v":{"v":308,"d":"308.0"}},{"$f":"VLOOKUP($A12,'6'!$B$10:$D$45,3,FALSE)","v":{"v":309,"d":"309.0"}},{"$f":"K12/J12","v":{"v":307.8666666666666,"d":"307.9"}},{"$f":"VLOOKUP(A12,Formelhilfe!$A$9:$H$44,8,FALSE)","v":{"v":6,"d":"6.0"}},{"$f":"SUM(C12:H12)","v":{"v":1847.1999999999998,"d":"1,847.2"}},{"$f":"VLOOKUP($A12,'7'!$B$10:$D$45,3,FALSE)","v":306.2},{"$f":"VLOOKUP($A12,'8'!$B$10:$D$45,3,FALSE)","v":304.4},{"$f":"VLOOKUP($A12,'9'!$B$10:$D$45,3,FALSE)","v":307.9},{"$f":"VLOOKUP($A12,'10'!$B$10:$D$45,3,FALSE)","v":314.5},{"$f":"VLOOKUP($A12,'11'!$B$10:$D$45,3,FALSE)","v":304.8},{"$f":"VLOOKUP($A12,'12'!$B$10:$D$45,3,FALSE)","v":{"v":0,"d":"0.0"}},{"$f":"T12/S12","v":{"v":307.56,"d":"307.6"}},{"$f":"VLOOKUP(A12,Formelhilfe!$A$9:$O$44,15,FALSE)","v":{"v":5,"d":"5.0"}},{"$f":"SUM(L12:Q12)","v":{"v":1537.8,"d":"1,537.8"}},{"$f":"W12/V12","v":{"v":307.72727272727275,"d":"307.7"}},{"$f":"VLOOKUP(A12,Formelhilfe!$A$9:$P$44,16,FALSE)","v":{"v":11,"d":"11.0"}},{"$f":"SUM(C12:H12,L12:Q12)","v":{"v":3385,"d":"3,385.0"}}]
["Jansen, Elisabeth",{"$f":"VLOOKUP(A13,'Wettkampf 1'!$B$10:$C$45,2,FALSE)","v":"Börger II"},{"$f":"VLOOKUP(A13,'Wettkampf 1'!$B$10:$D$45,3,FALSE)","v":308.4},{"$f":"VLOOKUP($A13,'2'!$B$10:$D$45,3,FALSE)","v":303.7},{"$f":"VLOOKUP($A13,'3'!$B$10:$D$45,3,FALSE)","v":301.8},{"$f":"VLOOKUP($A13,'4'!$B$10:$D$45,3,FALSE)","v":307.5},{"$f":"VLOOKUP($A13,'5'!$B$10:$D$45,3,FALSE)","v":306.7},{"$f":"VLOOKUP($A13,'6'!$B$10:$D$45,3,FALSE)","v":311.6},{"$f":"K13/J13","v":{"v":306.6166666666666,"d":"306.6"}},{"$f":"VLOOKUP(A13,Formelhilfe!$A$9:$H$44,8,FALSE)","v":{"v":6,"d":"6.0"}},{"$f":"SUM(C13:H13)","v":{"v":1839.6999999999998,"d":"1,839.7"}},{"$f":"VLOOKUP($A13,'7'!$B$10:$D$45,3,FALSE)","v":306.6},{"$f":"VLOOKUP($A13,'8'!$B$10:$D$45,3,FALSE)","v":308.9},{"$f":"VLOOKUP($A13,'9'!$B$10:$D$45,3,FALSE)","v":307.3},{"$f":"VLOOKUP($A13,'10'!$B$10:$D$45,3,FALSE)","v":306.6},{"$f":"VLOOKUP($A13,'11'!$B$10:$D$45,3,FALSE)","v":306.7},{"$f":"VLOOKUP($A13,'12'!$B$10:$D$45,3,FALSE)","v":{"v":0,"d":"0.0"}},{"$f":"T13/S13","v":{"v":307.22,"d":"307.2"}},{"$f":"VLOOKUP(A13,Formelhilfe!$A$9:$O$44,15,FALSE)","v":{"v":5,"d":"5.0"}},{"$f":"SUM(L13:Q13)","v":{"v":1536.1000000000001,"d":"1,536.1"}},{"$f":"W13/V13","v":{"v":306.8909090909091,"d":"306.9"}},{"$f":"VLOOKUP(A13,Formelhilfe!$A$9:$P$44,16,FALSE)","v":{"v":11,"d":"11.0"}},{"$f":"SUM(C13:H13,L13:Q13)","v":{"v":3375.7999999999997,"d":"3,375.8"}}]
["Kuchta, Gertrud",{"$f":"VLOOKUP(A14,'Wettkampf 1'!$B$10:$C$45,2,FALSE)","v":"Börger III"},{"$f":"VLOOKUP(A14,'Wettkampf 1'!$B$10:$D$45,3,FALSE)","v":311.3},{"$f":"VLOOKUP($A14,'2'!$B$10:$D$45,3,FALSE)","v":308.9},{"$f":"VLOOKUP($A14,'3'!$B$10:$D$45,3,FALSE)","v":{"v":305,"d":"305.0"}},{"$f":"VLOOKUP($A14,'4'!$B$10:$D$45,3,FALSE)","v":299.6},{"$f":"VLOOKUP($A14,'5'!$B$10:$D$45,3,FALSE)","v":306.5},{"$f":"VLOOKUP($A14,'6'!$B$10:$D$45,3,FALSE)","v":304.3},{"$f":"K14/J14","v":{"v":305.93333333333334,"d":"305.9"}},{"$f":"VLOOKUP(A14,Formelhilfe!$A$9:$H$44,8,FALSE)","v":{"v":6,"d":"6.0"}},{"$f":"SUM(C14:H14)","v":{"v":1835.6000000000001,"d":"1,835.6"}},{"$f":"VLOOKUP($A14,'7'!$B$10:$D$45,3,FALSE)","v":306.7},{"$f":"VLOOKUP($A14,'8'!$B$10:$D$45,3,FALSE)","v":303.4},{"$f":"VLOOKUP($A14,'9'!$B$10:$D$45,3,FALSE)","v":311.1},{"$f":"VLOOKUP($A14,'10'!$B$10:$D$45,3,FALSE)","v":{"v":307,"d":"307.0"}},{"$f":"VLOOKUP($A14,'11'!$B$10:$D$45,3,FALSE)","v":308.4},{"$f":"VLOOKUP($A14,'12'!$B$10:$D$45,3,FALSE)","v":{"v":0,"d":"0.0"}},{"$f":"T14/S14","v":{"v":307.32,"d":"307.3"}},{"$f":"VLOOKUP(A14,Formelhilfe!$A$9:$O$44,15,FALSE)","v":{"v":5,"d":"5.0"}},{"$f":"SUM(L14:Q14)","v":{"v":1536.6,"d":"1,536.6"}},{"$f":"W14/V14","v":{"v":306.56363636363636,"d":"306.6"}},{"$f":"VLOOKUP(A14,Formelhilfe!$A$9:$P$44,16,FALSE)","v":{"v":11,"d":"11.0"}},{"$f":"SUM(C14:H14,L14:Q14)","v":{"v":3372.2000000000003,"d":"3,372.2"}}]
["Wilken, Elena",{"$f":"VLOOKUP(A15,'Wettkampf 1'!$B$10:$C$45,2,FALSE)","v":"Lahn III"},{"$f":"VLOOKUP(A15,'Wettkampf 1'!$B$10:$D$45,3,FALSE)","v":310.9},{"$f":"VLOOKUP($A15,'2'!$B$10:$D$45,3,FALSE)","v":304.6},{"$f":"VLOOKUP($A15,'3'!$B$10:$D$45,3,FALSE)","v":302.2},{"$f":"VLOOKUP($A15,'4'!$B$10:$D$45,3,FALSE)","v":309.7},{"$f":"VLOOKUP($A15,'5'!$B$10:$D$45,3,FALSE)","v":306.8},{"$f":"VLOOKUP($A15,'6'!$B$10:$D$45,3,FALSE)","v":304.1},{"$f":"K15/J15","v":{"v":306.3833333333334,"d":"306.4"}},{"$f":"VLOOKUP(A15,Formelhilfe!$A$9:$H$44,8,FALSE)","v":{"v":6,"d":"6.0"}},{"$f":"SUM(C15:H15)","v":{"v":1838.3000000000002,"d":"1,838.3"}},{"$f":"VLOOKUP($A15,'7'!$B$10:$D$45,3,FALSE)","v":311.7},{"$f":"VLOOKUP($A15,'8'!$B$10:$D$45,3,FALSE)","v":{"v":305,"d":"305.0"}},{"$f":"VLOOKUP($A15,'9'!$B$10:$D$45,3,FALSE)","v":308.5},{"$f":"VLOOKUP($A15,'10'!$B$10:$D$45,3,FALSE)","v":301.4},{"$f":"VLOOKUP($A15,'11'!$B$10:$D$45,3,FALSE)","v":{"v":307,"d":"307.0"}},{"$f":"VLOOKUP($A15,'12'!$B$10:$D$45,3,FALSE)","v":{"v":0,"d":"0.0"}},{"$f":"T15/S15","v":{"v":306.71999999999997,"d":"306.7"}},{"$f":"VLOOKUP(A15,Formelhilfe!$A$9:$O$44,15,FALSE)","v":{"v":5,"d":"5.0"}},{"$f":"SUM(L15:Q15)","v":{"v":1533.6,"d":"1,533.6"}},{"$f":"W15/V15","v":{"v":306.53636363636366,"d":"306.5"}},{"$f":"VLOOKUP(A15,Formelhilfe!$A$9:$P$44,16,FALSE)","v":{"v":11,"d":"11.0"}},{"$f":"SUM(C15:H15,L15:Q15)","v":{"v":3371.9,"d":"3,371.9"}}]
["Pohlgeers, Silvia",{"$f":"VLOOKUP(A16,'Wettkampf 1'!$B$10:$C$45,2,FALSE)","v":"Börger II"},{"$f":"VLOOKUP(A16,'Wettkampf 1'!$B$10:$D$45,3,FALSE)","v":302.3},{"$f":"VLOOKUP($A16,'2'!$B$10:$D$45,3,FALSE)","v":305.9},{"$f":"VLOOKUP($A16,'3'!$B$10:$D$45,3,FALSE)","v":302.6},{"$f":"VLOOKUP($A16,'4'!$B$10:$D$45,3,FALSE)","v":310.9},{"$f":"VLOOKUP($A16,'5'!$B$10:$D$45,3,FALSE)","v":308.4},{"$f":"VLOOKUP($A16,'6'!$B$10:$D$45,3,FALSE)","v":306.4},{"$f":"K16/J16","v":{"v":306.0833333333333,"d":"306.1"}},{"$f":"VLOOKUP(A16,Formelhilfe!$A$9:$H$44,8,FALSE)","v":{"v":6,"d":"6.0"}},{"$f":"SUM(C16:H16)","v":{"v":1836.5,"d":"1,836.5"}},{"$f":"VLOOKUP($A16,'7'!$B$10:$D$45,3,FALSE)","v":308.4},{"$f":"VLOOKUP($A16,'8'!$B$10:$D$45,3,FALSE)","v":305.6},{"$f":"VLOOKUP($A16,'9'!$B$10:$D$45,3,FALSE)","v":303.3},{"$f":"VLOOKUP($A16,'10'!$B$10:$D$45,3,FALSE)","v":306.3},{"$f":"VLOOKUP($A16,'11'!$B$10:$D$45,3,FALSE)","v":311.3},{"$f":"VLOOKUP($A16,'12'!$B$10:$D$45,3,FALSE)","v":{"v":0,"d":"0.0"}},{"$f":"T16/S16","v":{"v":306.97999999999996,"d":"307.0"}},{"$f":"VLOOKUP(A16,Formelhilfe!$A$9:$O$44,15,FALSE)","v":{"v":5,"d":"5.0"}},{"$f":"SUM(L16:Q16)","v":{"v":1534.8999999999999,"d":"1,534.9"}},{"$f":"W16/V16","v":{"v":306.49090909090916,"d":"306.5"}},{"$f":"VLOOKUP(A16,Formelhilfe!$A$9:$P$44,16,FALSE)","v":{"v":11,"d":"11.0"}},{"$f":"SUM(C16:H16,L16:Q16)","v":{"v":3371.4000000000005,"d":"3,371.4"}}]
["Hackstette, Lena",{"$f":"VLOOKUP(A17,'Wettkampf 1'!$B$10:$C$45,2,FALSE)","v":"Lahn III"},{"$f":"VLOOKUP(A17,'Wettkampf 1'!$B$10:$D$45,3,FALSE)","v":308.9},{"$f":"VLOOKUP($A17,'2'!$B$10:$D$45,3,FALSE)","v":303.8},{"$f":"VLOOKUP($A17,'3'!$B$10:$D$45,3,FALSE)","v":310.2},{"$f":"VLOOKUP($A17,'4'!$B$10:$D$45,3,FALSE)","v":301.9},{"$f":"VLOOKUP($A17,'5'!$B$10:$D$45,3,FALSE)","v":307.4},{"$f":"VLOOKUP($A17,'6'!$B$10:$D$45,3,FALSE)","v":{"v":306,"d":"306.0"}},{"$f":"K17/J17","v":{"v":306.36666666666673,"d":"306.4"}},{"$f":"VLOOKUP(A17,Formelhilfe!$A$9:$H$44,8,FALSE)","v":{"v":6,"d":"6.0"}},{"$f":"SUM(C17:H17)","v":{"v":1838.2000000000003,"d":"1,838.2"}},{"$f":"VLOOKUP($A17,'7'!$B$10:$D$45,3,FALSE)","v":301.9},{"$f":"VLOOKUP($A17,'8'!$B$10:$D$45,3,FALSE)","v":309.4},{"$f":"VLOOKUP($A17,'9'!$B$10:$D$45,3,FALSE)","v":305.6},{"$f":"VLOOKUP($A17,'10'!$B$10:$D$45,3,FALSE)","v":307.8},{"$f":"VLOOKUP($A17,'11'!$B$10:$D$45,3,FALSE)","v":304.6},{"$f":"VLOOKUP($A17,'12'!$B$10:$D$45,3,FALSE)","v":{"v":0,"d":"0.0"}},{"$f":"T17/S17","v":{"v":305.86,"d":"305.9"}},{"$f":"VLOOKUP(A17,Formelhilfe!$A$9:$O$44,15,FALSE)","v":{"v":5,"d":"5.0"}},{"$f":"SUM(L17:Q17)","v":{"v":1529.3000000000002,"d":"1,529.3"}},{"$f":"W17/V17","v":{"v":306.1363636363637,"d":"306.1"}},{"$f":"VLOOKUP(A17,Formelhilfe!$A$9:$P$44,16,FALSE)","v":{"v":11,"d":"11.0"}},{"$f":"SUM(C17:H17,L17:Q17)","v":{"v":3367.5000000000005,"d":"3,367.5"}}]
["Pohlmann, Margret",{"$f":"VLOOKUP(A18,'Wettkampf 1'!$B$10:$C$45,2,FALSE)","v":"Neuvrees II"},{"$f":"VLOOKUP(A18,'Wettkampf 1'!$B$10:$D$45,3,FALSE)","v":{"v":297,"d":"297.0"}},{"$f":"VLOOKUP($A18,'2'!$B$10:$D$45,3,FALSE)","v":305.5},{"$f":"VLOOKUP($A18,'3'!$B$10:$D$45,3,FALSE)","v":303.5},{"$f":"VLOOKUP($A18,'4'!$B$10:$D$45,3,FALSE)","v":307.8},{"$f":"VLOOKUP($A18,'5'!$B$10:$D$45,3,FALSE)","v":309.1},{"$f":"VLOOKUP($A18,'6'!$B$10:$D$45,3,FALSE)","v":{"v":303,"d":"303.0"}},{"$f":"K18/J18","v":{"v":304.31666666666666,"d":"304.3"}},{"$f":"VLOOKUP(A18,Formelhilfe!$A$9:$H$44,8,FALSE)","v":{"v":6,"d":"6.0"}},{"$f":"SUM(C18:H18)","v":{"v":1825.9,"d":"1,825.9"}},{"$f":"VLOOKUP($A18,'7'!$B$10:$D$45,3,FALSE)","v":309.9},{"$f":"VLOOKUP($A18,'8'!$B$10:$D$45,3,FALSE)","v":305.1},{"$f":"VLOOKUP($A18,'9'!$B$10:$D$45,3,FALSE)","v":308.4},{"$f":"VLOOKUP($A18,'10'!$B$10:$D$45,3,FALSE)","v":308.6},{"$f":"VLOOKUP($A18,'11'!$B$10:$D$45,3,FALSE)","v":306.4},{"$f":"VLOOKUP($A18,'12'!$B$10:$D$45,3,FALSE)","v":{"v":0,"d":"0.0"}},{"$f":"T18/S18","v":{"v":307.68,"d":"307.7"}},{"$f":"VLOOKUP(A18,Formelhilfe!$A$9:$O$44,15,FALSE)","v":{"v":5,"d":"5.0"}},{"$f":"SUM(L18:Q18)","v":{"v":1538.4,"d":"1,538.4"}},{"$f":"W18/V18","v":{"v":305.8454545454546,"d":"305.8"}},{"$f":"VLOOKUP(A18,Formelhilfe!$A$9:$P$44,16,FALSE)","v":{"v":11,"d":"11.0"}},{"$f":"SUM(C18:H18,L18:Q18)","v":{"v":3364.3,"d":"3,364.3"}}]
["Ostermann, Hildegard",{"$f":"VLOOKUP(A19,'Wettkampf 1'!$B$10:$C$45,2,FALSE)","v":"Lahn III"},{"$f":"VLOOKUP(A19,'Wettkampf 1'!$B$10:$D$45,3,FALSE)","v":309.3},{"$f":"VLOOKUP($A19,'2'!$B$10:$D$45,3,FALSE)","v":305.1},{"$f":"VLOOKUP($A19,'3'!$B$10:$D$45,3,FALSE)","v":307.4},{"$f":"VLOOKUP($A19,'4'!$B$10:$D$45,3,FALSE)","v":309.7},{"$f":"VLOOKUP($A19,'5'!$B$10:$D$45,3,FALSE)","v":312.1},{"$f":"VLOOKUP($A19,'6'!$B$10:$D$45,3,FALSE)","v":306.3},{"$f":"K19/J19","v":{"v":308.31666666666666,"d":"308.3"}},{"$f":"VLOOKUP(A19,Formelhilfe!$A$9:$H$44,8,FALSE)","v":{"v":6,"d":"6.0"}},{"$f":"SUM(C19:H19)","v":{"v":1849.8999999999999,"d":"1,849.9"}},{"$f":"VLOOKUP($A19,'7'!$B$10:$D$45,3,FALSE)","v":299.3},{"$f":"VLOOKUP($A19,'8'!$B$10:$D$45,3,FALSE)","v":306.1},{"$f":"VLOOKUP($A19,'9'!$B$10:$D$45,3,FALSE)","v":301.4},{"$f":"VLOOKUP($A19,'10'!$B$10:$D$45,3,FALSE)","v":302.8},{"$f":"VLOOKUP($A19,'11'!$B$10:$D$45,3,FALSE)","v":302.7},{"$f":"VLOOKUP($A19,'12'!$B$10:$D$45,3,FALSE)","v":{"v":0,"d":"0.0"}},{"$f":"T19/S19","v":{"v":302.46000000000004,"d":"302.5"}},{"$f":"VLOOKUP(A19,Formelhilfe!$A$9:$O$44,15,FALSE)","v":{"v":5,"d":"5.0"}},{"$f":"SUM(L19:Q19)","v":{"v":1512.3000000000002,"d":"1,512.3"}},{"$f":"W19/V19","v":{"v":305.6545454545454,"d":"305.7"}},{"$f":"VLOOKUP(A19,Formelhilfe!$A$9:$P$44,16,FALSE)","v":{"v":11,"d":"11.0"}},{"$f":"SUM(C19:H19,L19:Q19)","v":{"v":3362.2,"d":"3,362.2"}}]
["Hanneken, Doris",{"$f":"VLOOKUP(A20,'Wettkampf 1'!$B$10:$C$45,2,FALSE)","v":"Lahn IV"},{"$f":"VLOOKUP(A20,'Wettkampf 1'!$B$10:$D$45,3,FALSE)","v":305.2},{"$f":"VLOOKUP($A20,'2'!$B$10:$D$45,3,FALSE)","v":304.8},{"$f":"VLOOKUP($A20,'3'!$B$10:$D$45,3,FALSE)","v":305.7},{"$f":"VLOOKUP($A20,'4'!$B$10:$D$45,3,FALSE)","v":{"v":307,"d":"307.0"}},{"$f":"VLOOKUP($A20,'5'!$B$10:$D$45,3,FALSE)","v":307.5},{"$f":"VLOOKUP($A20,'6'!$B$10:$D$45,3,FALSE)","v":309.8},{"$f":"K20/J20","v":{"v":306.6666666666667,"d":"306.7"}},{"$f":"VLOOKUP(A20,Formelhilfe!$A$9:$H$44,8,FALSE)","v":{"v":6,"d":"6.0"}},{"$f":"SUM(C20:H20)","v":{"v":1840,"d":"1,840.0"}},{"$f":"VLOOKUP($A20,'7'!$B$10:$D$45,3,FALSE)","v":{"v":300,"d":"300.0"}},{"$f":"VLOOKUP($A20,'8'!$B$10:$D$45,3,FALSE)","v":302.8},{"$f":"VLOOKUP($A20,'9'!$B$10:$D$45,3,FALSE)","v":303.9},{"$f":"VLOOKUP($A20,'10'!$B$10:$D$45,3,FALSE)","v":296.9},{"$f":"VLOOKUP($A20,'11'!$B$10:$D$45,3,FALSE)","v":303.4},{"$f":"VLOOKUP($A20,'12'!$B$10:$D$45,3,FALSE)","v":{"v":0,"d":"0.0"}},{"$f":"T20/S20","v":301.4},{"$f":"VLOOKUP(A20,Formelhilfe!$A$9:$O$44,15,FALSE)","v":{"v":5,"d":"5.0"}},{"$f":"SUM(L20:Q20)","v":{"v":1507,"d":"1,507.0"}},{"$f":"W20/V20","v":{"v":304.2727272727273,"d":"304.3"}},{"$f":"VLOOKUP(A20,Formelhilfe!$A$9:$P$44,16,FALSE)","v":{"v":11,"d":"11.0"}},{"$f":"SUM(C20:H20,L20:Q20)","v":{"v":3347.0000000000005,"d":"3,347.0"}}]
["Müller, Anita",{"$f":"VLOOKUP(A21,'Wettkampf 1'!$B$10:$C$45,2,FALSE)","v":"Lahn III"},{"$f":"VLOOKUP(A21,'Wettkampf 1'!$B$10:$D$45,3,FALSE)","v":306.6},{"$f":"VLOOKUP($A21,'2'!$B$10:$D$45,3,FALSE)","v":298.5},{"$f":"VLOOKUP($A21,'3'!$B$10:$D$45,3,FALSE)","v":299.5},{"$f":"VLOOKUP($A21,'4'!$B$10:$D$45,3,FALSE)","v":305.3},{"$f":"VLOOKUP($A21,'5'!$B$10:$D$45,3,FALSE)","v":305.4},{"$f":"VLOOKUP($A21,'6'!$B$10:$D$45,3,FALSE)","v":{"v":304,"d":"304.0"}},{"$f":"K21/J21","v":{"v":303.2166666666667,"d":"303.2"}},{"$f":"VLOOKUP(A21,Formelhilfe!$A$9:$H$44,8,FALSE)","v":{"v":6,"d":"6.0"}},{"$f":"SUM(C21:H21)","v":{"v":1819.3000000000002,"d":"1,819.3"}},{"$f":"VLOOKUP($A21,'7'!$B$10:$D$45,3,FALSE)","v":301.3},{"$f":"VLOOKUP($A21,'8'!$B$10:$D$45,3,FALSE)","v":306.6},{"$f":"VLOOKUP($A21,'9'!$B$10:$D$45,3,FALSE)","v":{"v":304,"d":"304.0"}},{"$f":"VLOOKUP($A21,'10'!$B$10:$D$45,3,FALSE)","v":305.1},{"$f":"VLOOKUP($A21,'11'!$B$10:$D$45,3,FALSE)","v":305.7},{"$f":"VLOOKUP($A21,'12'!$B$10:$D$45,3,FALSE)","v":{"v":0,"d":"0.0"}},{"$f":"T21/S21","v":{"v":304.54,"d":"304.5"}},{"$f":"VLOOKUP(A21,Formelhilfe!$A$9:$O$44,15,FALSE)","v":{"v":5,"d":"5.0"}},{"$f":"SUM(L21:Q21)","v":{"v":1522.7,"d":"1,522.7"}},{"$f":"W21/V21","v":{"v":303.8181818181818,"d":"303.8"}},{"$f":"VLOOKUP(A21,Formelhilfe!$A$9:$P$44,16,FALSE)","v":{"v":11,"d":"11.0"}},{"$f":"SUM(C21:H21,L21:Q21)","v":{"v":3342,"d":"3,342.0"}}]
["Büter, Daniela",{"$f":"VLOOKUP(A22,'Wettkampf 1'!$B$10:$C$45,2,FALSE)","v":"Esterwegen V"},{"$f":"VLOOKUP(A22,'Wettkampf 1'!$B$10:$D$45,3,FALSE)","v":297.2},{"$f":"VLOOKUP($A22,'2'!$B$10:$D$45,3,FALSE)","v":302.8},{"$f":"VLOOKUP($A22,'3'!$B$10:$D$45,3,FALSE)","v":303.4},{"$f":"VLOOKUP($A22,'4'!$B$10:$D$45,3,FALSE)","v":309.3},{"$f":"VLOOKUP($A22,'5'!$B$10:$D$45,3,FALSE)","v":306.5},{"$f":"VLOOKUP($A22,'6'!$B$10:$D$45,3,FALSE)","v":300.6},{"$f":"K22/J22","v":303.3},{"$f":"VLOOKUP(A22,Formelhilfe!$A$9:$H$44,8,FALSE)","v":{"v":6,"d":"6.0"}},{"$f":"SUM(C22:H22)","v":{"v":1819.8000000000002,"d":"1,819.8"}},{"$f":"VLOOKUP($A22,'7'!$B$10:$D$45,3,FALSE)","v":303.6},{"$f":"VLOOKUP($A22,'8'!$B$10:$D$45,3,FALSE)","v":308.5},{"$f":"VLOOKUP($A22,'9'!$B$10:$D$45,3,FALSE)","v":295.8},{"$f":"VLOOKUP($A22,'10'!$B$10:$D$45,3,FALSE)","v":304.4},{"$f":"VLOOKUP($A22,'11'!$B$10:$D$45,3,FALSE)","v":308.2},{"$f":"VLOOKUP($A22,'12'!$B$10:$D$45,3,FALSE)","v":{"v":0,"d":"0.0"}},{"$f":"T22/S22","v":304.1},{"$f":"VLOOKUP(A22,Formelhilfe!$A$9:$O$44,15,FALSE)","v":{"v":5,"d":"5.0"}},{"$f":"SUM(L22:Q22)","v":{"v":1520.5000000000002,"d":"1,520.5"}},{"$f":"W22/V22","v":{"v":303.6636363636364,"d":"303.7"}},{"$f":"VLOOKUP(A22,Formelhilfe!$A$9:$P$44,16,FALSE)","v":{"v":11,"d":"11.0"}},{"$f":"SUM(C22:H22,L22:Q22)","v":{"v":3340.3,"d":"3,340.3"}}]
["Geers, Christa",{"$f":"VLOOKUP(A23,'Wettkampf 1'!$B$10:$C$45,2,FALSE)","v":"Börger III"},{"$f":"VLOOKUP(A23,'Wettkampf 1'!$B$10:$D$45,3,FALSE)","v":304.5},{"$f":"VLOOKUP($A23,'2'!$B$10:$D$45,3,FALSE)","v":297.1},{"$f":"VLOOKUP($A23,'3'!$B$10:$D$45,3,FALSE)","v":302.1},{"$f":"VLOOKUP($A23,'4'!$B$10:$D$45,3,FALSE)","v":{"v":311,"d":"311.0"}},{"$f":"VLOOKUP($A23,'5'!$B$10:$D$45,3,FALSE)","v":307.3},{"$f":"VLOOKUP($A23,'6'!$B$10:$D$45,3,FALSE)","v":303.7},{"$f":"K23/J23","v":{"v":304.28333333333336,"d":"304.3"}},{"$f":"VLOOKUP(A23,Formelhilfe!$A$9:$H$44,8,FALSE)","v":{"v":6,"d":"6.0"}},{"$f":"SUM(C23:H23)","v":{"v":1825.7,"d":"1,825.7"}},{"$f":"VLOOKUP($A23,'7'!$B$10:$D$45,3,FALSE)","v":306.2},{"$f":"VLOOKUP($A23,'8'!$B$10:$D$45,3,FALSE)","v":299.1},{"$f":"VLOOKUP($A23,'9'!$B$10:$D$45,3,FALSE)","v":305.2},{"$f":"VLOOKUP($A23,'10'!$B$10:$D$45,3,FALSE)","v":296.4},{"$f":"VLOOKUP($A23,'11'!$B$10:$D$45,3,FALSE)","v":301.9},{"$f":"VLOOKUP($A23,'12'!$B$10:$D$45,3,FALSE)","v":{"v":0,"d":"0.0"}},{"$f":"T23/S23","v":{"v":301.76000000000005,"d":"301.8"}},{"$f":"VLOOKUP(A23,Formelhilfe!$A$9:$O$44,15,FALSE)","v":{"v":5,"d":"5.0"}},{"$f":"SUM(L23:Q23)","v":{"v":1508.8000000000002,"d":"1,508.8"}},{"$f":"W23/V23","v":{"v":303.1363636363636,"d":"303.1"}},{"$f":"VLOOKUP(A23,Formelhilfe!$A$9:$P$44,16,FALSE)","v":{"v":11,"d":"11.0"}},{"$f":"SUM(C23:H23,L23:Q23)","v":{"v":3334.5,"d":"3,334.5"}}]
["Jungsthöfel, Sabine",{"$f":"VLOOKUP(A24,'Wettkampf 1'!$B$10:$C$45,2,FALSE)","v":"Börger III"},{"$f":"VLOOKUP(A24,'Wettkampf 1'!$B$10:$D$45,3,FALSE)","v":306.7},{"$f":"VLOOKUP($A24,'2'!$B$10:$D$45,3,FALSE)","v":306.3},{"$f":"VLOOKUP($A24,'3'!$B$10:$D$45,3,FALSE)","v":300.4},{"$f":"VLOOKUP($A24,'4'!$B$10:$D$45,3,FALSE)","v":299.9},{"$f":"VLOOKUP($A24,'5'!$B$10:$D$45,3,FALSE)","v":304.8},{"$f":"VLOOKUP($A24,'6'!$B$10:$D$45,3,FALSE)","v":299.2},{"$f":"K24/J24","v":{"v":302.8833333333333,"d":"302.9"}},{"$f":"VLOOKUP(A24,Formelhilfe!$A$9:$H$44,8,FALSE)","v":{"v":6,"d":"6.0"}},{"$f":"SUM(C24:H24)","v":{"v":1817.3,"d":"1,817.3"}},{"$f":"VLOOKUP($A24,'7'!$B$10:$D$45,3,FALSE)","v":307.4},{"$f":"VLOOKUP($A24,'8'!$B$10:$D$45,3,FALSE)","v":300.4},{"$f":"VLOOKUP($A24,'9'!$B$10:$D$45,3,FALSE)","v":298.1},{"$f":"VLOOKUP($A24,'10'!$B$10:$D$45,3,FALSE)","v":303.7},{"$f":"VLOOKUP($A24,'11'!$B$10:$D$45,3,FALSE)","v":296.4},{"$f":"VLOOKUP($A24,'12'!$B$10:$D$45,3,FALSE)","v":{"v":0,"d":"0.0"}},{"$f":"T24/S24","v":301.2},{"$f":"VLOOKUP(A24,Formelhilfe!$A$9:$O$44,15,FALSE)","v":{"v":5,"d":"5.0"}},{"$f":"SUM(L24:Q24)","v":{"v":1506,"d":"1,506.0"}},{"$f":"W24/V24","v":{"v":302.11818181818177,"d":"302.1"}},{"$f":"VLOOKUP(A24,Formelhilfe!$A$9:$P$44,16,FALSE)","v":{"v":11,"d":"11.0"}},{"$f":"SUM(C24:H24,L24:Q24)","v":{"v":3323.2999999999997,"d":"3,323.3"}}]
["Evers, Claudia",{"$f":"VLOOKUP(A25,'Wettkampf 1'!$B$10:$C$45,2,FALSE)","v":"Neuvrees II"},{"$f":"VLOOKUP(A25,'Wettkampf 1'!$B$10:$D$45,3,FALSE)","v":300.8},{"$f":"VLOOKUP($A25,'2'!$B$10:$D$45,3,FALSE)","v":306.3},{"$f":"VLOOKUP($A25,'3'!$B$10:$D$45,3,FALSE)","v":303.3},{"$f":"VLOOKUP($A25,'4'!$B$10:$D$45,3,FALSE)","v":299.9},{"$f":"VLOOKUP($A25,'5'!$B$10:$D$45,3,FALSE)","v":303.2},{"$f":"VLOOKUP($A25,'6'!$B$10:$D$45,3,FALSE)","v":300.9},{"$f":"K25/J25","v":{"v":302.40000000000003,"d":"302.4"}},{"$f":"VLOOKUP(A25,Formelhilfe!$A$9:$H$44,8,FALSE)","v":{"v":6,"d":"6.0"}},{"$f":"SUM(C25:H25)","v":{"v":1814.4,"d":"1,814.4"}},{"$f":"VLOOKUP($A25,'7'!$B$10:$D$45,3,FALSE)","v":301.3},{"$f":"VLOOKUP($A25,'8'!$B$10:$D$45,3,FALSE)","v":297.9},{"$f":"VLOOKUP($A25,'9'!$B$10:$D$45,3,FALSE)","v":302.6},{"$f":"VLOOKUP($A25,'10'!$B$10:$D$45,3,FALSE)","v":301.2},{"$f":"VLOOKUP($A25,'11'!$B$10:$D$45,3,FALSE)","v":303.7},{"$f":"VLOOKUP($A25,'12'!$B$10:$D$45,3,FALSE)","v":{"v":0,"d":"0.0"}},{"$f":"T25/S25","v":{"v":301.34000000000003,"d":"301.3"}},{"$f":"VLOOKUP(A25,Formelhilfe!$A$9:$O$44,15,FALSE)","v":{"v":5,"d":"5.0"}},{"$f":"SUM(L25:Q25)","v":{"v":1506.7,"d":"1,506.7"}},{"$f":"W25/V25","v":{"v":301.91818181818184,"d":"301.9"}},{"$f":"VLOOKUP(A25,Formelhilfe!$A$9:$P$44,16,FALSE)","v":{"v":11,"d":"11.0"}},{"$f":"SUM(C25:H25,L25:Q25)","v":{"v":3321.1,"d":"3,321.1"}}]
["Oldopp, Maria",{"$f":"VLOOKUP(A26,'Wettkampf 1'!$B$10:$C$45,2,FALSE)","v":"Lahn IV"},{"$f":"VLOOKUP(A26,'Wettkampf 1'!$B$10:$D$45,3,FALSE)","v":298.6},{"$f":"VLOOKUP($A26,'2'!$B$10:$D$45,3,FALSE)","v":{"v":301,"d":"301.0"}},{"$f":"VLOOKUP($A26,'3'!$B$10:$D$45,3,FALSE)","v":301.2},{"$f":"VLOOKUP($A26,'4'!$B$10:$D$45,3,FALSE)","v":299.6},{"$f":"VLOOKUP($A26,'5'!$B$10:$D$45,3,FALSE)","v":297.2},{"$f":"VLOOKUP($A26,'6'!$B$10:$D$45,3,FALSE)","v":{"v":299,"d":"299.0"}},{"$f":"K26/J26","v":{"v":299.43333333333334,"d":"299.4"}},{"$f":"VLOOKUP(A26,Formelhilfe!$A$9:$H$44,8,FALSE)","v":{"v":6,"d":"6.0"}},{"$f":"SUM(C26:H26)","v":{"v":1796.6000000000001,"d":"1,796.6"}},{"$f":"VLOOKUP($A26,'7'!$B$10:$D$45,3,FALSE)","v":300.2},{"$f":"VLOOKUP($A26,'8'!$B$10:$D$45,3,FALSE)","v":299.1},{"$f":"VLOOKUP($A26,'9'!$B$10:$D$45,3,FALSE)","v":{"v":302,"d":"302.0"}},{"$f":"VLOOKUP($A26,'10'!$B$10:$D$45,3,FALSE)","v":300.7},{"$f":"VLOOKUP($A26,'11'!$B$10:$D$45,3,FALSE)","v":298.2},{"$f":"VLOOKUP($A26,'12'!$B$10:$D$45,3,FALSE)","v":{"v":0,"d":"0.0"}},{"$f":"T26/S26","v":{"v":300.04,"d":"300.0"}},{"$f":"VLOOKUP(A26,Formelhilfe!$A$9:$O$44,15,FALSE)","v":{"v":5,"d":"5.0"}},{"$f":"SUM(L26:Q26)","v":{"v":1500.2,"d":"1,500.2"}},{"$f":"W26/V26","v":{"v":299.7090909090909,"d":"299.7"}},{"$f":"VLOOKUP(A26,Formelhilfe!$A$9:$P$44,16,FALSE)","v":{"v":11,"d":"11.0"}},{"$f":"SUM(C26:H26,L26:Q26)","v":{"v":3296.7999999999997,"d":"3,296.8"}}]
["Krömer, Monika",{"$f":"VLOOKUP(A27,'Wettkampf 1'!$B$10:$C$45,2,FALSE)","v":"Börger II"},{"$f":"VLOOKUP(A27,'Wettkampf 1'!$B$10:$D$45,3,FALSE)","v":302.4},{"$f":"VLOOKUP($A27,'2'!$B$10:$D$45,3,FALSE)","v":302.2},{"$f":"VLOOKUP($A27,'3'!$B$10:$D$45,3,FALSE)","v":301.8},{"$f":"VLOOKUP($A27,'4'!$B$10:$D$45,3,FALSE)","v":297.8},{"$f":"VLOOKUP($A27,'5'!$B$10:$D$45,3,FALSE)","v":294.7},{"$f":"VLOOKUP($A27,'6'!$B$10:$D$45,3,FALSE)","v":{"v":301,"d":"301.0"}},{"$f":"K27/J27","v":{"v":299.9833333333333,"d":"300.0"}},{"$f":"VLOOKUP(A27,Formelhilfe!$A$9:$H$44,8,FALSE)","v":{"v":6,"d":"6.0"}},{"$f":"SUM(C27:H27)","v":{"v":1799.8999999999999,"d":"1,799.9"}},{"$f":"VLOOKUP($A27,'7'!$B$10:$D$45,3,FALSE)","v":299.7},{"$f":"VLOOKUP($A27,'8'!$B$10:$D$45,3,FALSE)","v":292.8},{"$f":"VLOOKUP($A27,'9'!$B$10:$D$45,3,FALSE)","v":290.4},{"$f":"VLOOKUP($A27,'10'!$B$10:$D$45,3,FALSE)","v":292.8},{"$f":"VLOOKUP($A27,'11'!$B$10:$D$45,3,FALSE)","v":298.7},{"$f":"VLOOKUP($A27,'12'!$B$10:$D$45,3,FALSE)","v":{"v":0,"d":"0.0"}},{"$f":"T27/S27","v":{"v":294.88,"d":"294.9"}},{"$f":"VLOOKUP(A27,Formelhilfe!$A$9:$O$44,15,FALSE)","v":{"v":5,"d":"5.0"}},{"$f":"SUM(L27:Q27)","v":{"v":1474.4,"d":"1,474.4"}},{"$f":"W27/V27","v":{"v":297.6636363636364,"d":"297.7"}},{"$f":"VLOOKUP(A27,Formelhilfe!$A$9:$P$44,16,FALSE)","v":{"v":11,"d":"11.0"}},{"$f":"SUM(C27:H27,L27:Q27)","v":{"v":3274.3,"d":"3,274.3"}}]
["Junge, Silvia",{"$f":"VLOOKUP(A28,'Wettkampf 1'!$B$10:$C$45,2,FALSE)","v":"Neuvrees II"},{"$f":"VLOOKUP(A28,'Wettkampf 1'!$B$10:$D$45,3,FALSE)","v":290.6},{"$f":"VLOOKUP($A28,'2'!$B$10:$D$45,3,FALSE)","v":302.2},{"$f":"VLOOKUP($A28,'3'!$B$10:$D$45,3,FALSE)","v":295.7},{"$f":"VLOOKUP($A28,'4'!$B$10:$D$45,3,FALSE)","v":279.3},{"$f":"VLOOKUP($A28,'5'!$B$10:$D$45,3,FALSE)","v":295.1},{"$f":"VLOOKUP($A28,'6'!$B$10:$D$45,3,FALSE)","v":298.9},{"$f":"K28/J28","v":{"v":293.6333333333334,"d":"293.6"}},{"$f":"VLOOKUP(A28,Formelhilfe!$A$9:$H$44,8,FALSE)","v":{"v":6,"d":"6.0"}},{"$f":"SUM(C28:H28)","v":{"v":1761.8000000000002,"d":"1,761.8"}},{"$f":"VLOOKUP($A28,'7'!$B$10:$D$45,3,FALSE)","v":292.8},{"$f":"VLOOKUP($A28,'8'!$B$10:$D$45,3,FALSE)","v":287.4},{"$f":"VLOOKUP($A28,'9'!$B$10:$D$45,3,FALSE)","v":305.4},{"$f":"VLOOKUP($A28,'10'!$B$10:$D$45,3,FALSE)","v":287.2},{"$f":"VLOOKUP($A28,'11'!$B$10:$D$45,3,FALSE)","v":{"v":292,"d":"292.0"}},{"$f":"VLOOKUP($A28,'12'!$B$10:$D$45,3,FALSE)","v":{"v":0,"d":"0.0"}},{"$f":"T28/S28","v":{"v":292.96,"d":"293.0"}},{"$f":"VLOOKUP(A28,Formelhilfe!$A$9:$O$44,15,FALSE)","v":{"v":5,"d":"5.0"}},{"$f":"SUM(L28:Q28)","v":{"v":1464.8,"d":"1,464.8"}},{"$f":"W28/V28","v":{"v":293.32727272727277,"d":"293.3"}},{"$f":"VLOOKUP(A28,Formelhilfe!$A$9:$P$44,16,FALSE)","v":{"v":11,"d":"11.0"}},{"$f":"SUM(C28:H28,L28:Q28)","v":{"v":3226.6000000000004,"d":"3,226.6"}}]
["Lindemann, Stefanie",{"$f":"VLOOKUP(A29,'Wettkampf 1'!$B$10:$C$45,2,FALSE)","v":"Esterwegen V"},{"$f":"VLOOKUP(A29,'Wettkampf 1'!$B$10:$D$45,3,FALSE)","v":306.1},{"$f":"VLOOKUP($A29,'2'!$B$10:$D$45,3,FALSE)","v":305.3},{"$f":"VLOOKUP($A29,'3'!$B$10:$D$45,3,FALSE)","v":308.4},{"$f":"VLOOKUP($A29,'4'!$B$10:$D$45,3,FALSE)","v":298.4},{"$f":"VLOOKUP($A29,'5'!$B$10:$D$45,3,FALSE)","v":303.1},{"$f":"VLOOKUP($A29,'6'!$B$10:$D$45,3,FALSE)","v":306.8},{"$f":"K29/J29","v":{"v":304.68333333333334,"d":"304.7"}},{"$f":"VLOOKUP(A29,Formelhilfe!$A$9:$H$44,8,FALSE)","v":{"v":6,"d":"6.0"}},{"$f":"SUM(C29:H29)","v":{"v":1828.1000000000001,"d":"1,828.1"}},{"$f":"VLOOKUP($A29,'7'!$B$10:$D$45,3,FALSE)","v":306.6},{"$f":"VLOOKUP($A29,'8'!$B$10:$D$45,3,FALSE)","v":310.6},{"$f":"VLOOKUP($A29,'9'!$B$10:$D$45,3,FALSE)","v":307.7},{"$f":"VLOOKUP($A29,'10'!$B$10:$D$45,3,FALSE)","v":300.9},{"$f":"VLOOKUP($A29,'11'!$B$10:$D$45,3,FALSE)","v":{"v":0,"d":"0.0"}},{"$f":"VLOOKUP($A29,'12'!$B$10:$D$45,3,FALSE)","v":{"v":0,"d":"0.0"}},{"$f":"T29/S29","v":{"v":306.45000000000005,"d":"306.5"}},{"$f":"VLOOKUP(A29,Formelhilfe!$A$9:$O$44,15,FALSE)","v":{"v":4,"d":"4.0"}},{"$f":"SUM(L29:Q29)","v":{"v":1225.8000000000002,"d":"1,225.8"}},{"$f":"W29/V29","v":{"v":305.39,"d":"305.4"}},{"$f":"VLOOKUP(A29,Formelhilfe!$A$9:$P$44,16,FALSE)","v":{"v":10,"d":"10.0"}},{"$f":"SUM(C29:H29,L29:Q29)","v":{"v":3053.9,"d":"3,053.9"}}]
["Schwarte, Gundula",{"$f":"VLOOKUP(A30,'Wettkampf 1'!$B$10:$C$45,2,FALSE)","v":"Börger III"},{"$f":"VLOOKUP(A30,'Wettkampf 1'!$B$10:$D$45,3,FALSE)","v":306.8},{"$f":"VLOOKUP($A30,'2'!$B$10:$D$45,3,FALSE)","v":304.3},{"$f":"VLOOKUP($A30,'3'!$B$10:$D$45,3,FALSE)","v":299.7},{"$f":"VLOOKUP($A30,'4'!$B$10:$D$45,3,FALSE)","v":{"v":0,"d":"0.0"}},{"$f":"VLOOKUP($A30,'5'!$B$10:$D$45,3,FALSE)","v":300.8},{"$f":"VLOOKUP($A30,'6'!$B$10:$D$45,3,FALSE)","v":302.4},{"$f":"K30/J30","v":302.8},{"$f":"VLOOKUP(A30,Formelhilfe!$A$9:$H$44,8,FALSE)","v":{"v":5,"d":"5.0"}},{"$f":"SUM(C30:H30)","v":{"v":1514,"d":"1,514.0"}},{"$f":"VLOOKUP($A30,'7'!$B$10:$D$45,3,FALSE)","v":300.6},{"$f":"VLOOKUP($A30,'8'!$B$10:$D$45,3,FALSE)","v":306.5},{"$f":"VLOOKUP($A30,'9'!$B$10:$D$45,3,FALSE)","v":301.9},{"$f":"VLOOKUP($A30,'10'!$B$10:$D$45,3,FALSE)","v":299.4},{"$f":"VLOOKUP($A30,'11'!$B$10:$D$45,3,FALSE)","v":303.8},{"$f":"VLOOKUP($A30,'12'!$B$10:$D$45,3,FALSE)","v":{"v":0,"d":"0.0"}},{"$f":"T30/S30","v":{"v":302.44,"d":"302.4"}},{"$f":"VLOOKUP(A30,Formelhilfe!$A$9:$O$44,15,FALSE)","v":{"v":5,"d":"5.0"}},{"$f":"SUM(L30:Q30)","v":{"v":1512.2,"d":"1,512.2"}},{"$f":"W30/V30","v":{"v":302.62,"d":"302.6"}},{"$f":"VLOOKUP(A30,Formelhilfe!$A$9:$P$44,16,FALSE)","v":{"v":10,"d":"10.0"}},{"$f":"SUM(C30:H30,L30:Q30)","v":{"v":3026.2000000000003,"d":"3,026.2"}}]
["Remmers, Tanja",{"$f":"VLOOKUP(A31,'Wettkampf 1'!$B$10:$C$45,2,FALSE)","v":"Börger III"},{"$f":"VLOOKUP(A31,'Wettkampf 1'!$B$10:$D$45,3,FALSE)","v":292.9},{"$f":"VLOOKUP($A31,'2'!$B$10:$D$45,3,FALSE)","v":294.5},{"$f":"VLOOKUP($A31,'3'!$B$10:$D$45,3,FALSE)","v":275.8},{"$f":"VLOOKUP($A31,'4'!$B$10:$D$45,3,FALSE)","v":290.6},{"$f":"VLOOKUP($A31,'5'!$B$10:$D$45,3,FALSE)","v":289.2},{"$f":"VLOOKUP($A31,'6'!$B$10:$D$45,3,FALSE)","v":{"v":0,"d":"0.0"}},{"$f":"K31/J31","v":288.6},{"$f":"VLOOKUP(A31,Formelhilfe!$A$9:$H$44,8,FALSE)","v":{"v":5,"d":"5.0"}},{"$f":"SUM(C31:H31)","v":{"v":1443.0000000000002,"d":"1,443.0"}},{"$f":"VLOOKUP($A31,'7'!$B$10:$D$45,3,FALSE)","v":290.7},{"$f":"VLOOKUP($A31,'8'!$B$10:$D$45,3,FALSE)","v":{"v":286,"d":"286.0"}},{"$f":"VLOOKUP($A31,'9'!$B$10:$D$45,3,FALSE)","v":301.8},{"$f":"VLOOKUP($A31,'10'!$B$10:$D$45,3,FALSE)","v":{"v":297,"d":"297.0"}},{"$f":"VLOOKUP($A31,'11'!$B$10:$D$45,3,FALSE)","v":297.2},{"$f":"VLOOKUP($A31,'12'!$B$10:$D$45,3,FALSE)","v":{"v":0,"d":"0.0"}},{"$f":"T31/S31","v":{"v":294.54,"d":"294.5"}},{"$f":"VLOOKUP(A31,Formelhilfe!$A$9:$O$44,15,FALSE)","v":{"v":5,"d":"5.0"}},{"$f":"SUM(L31:Q31)","v":{"v":1472.7,"d":"1,472.7"}},{"$f":"W31/V31","v":{"v":291.57000000000005,"d":"291.6"}},{"$f":"VLOOKUP(A31,Formelhilfe!$A$9:$P$44,16,FALSE)","v":{"v":10,"d":"10.0"}},{"$f":"SUM(C31:H31,L31:Q31)","v":{"v":2915.7000000000003,"d":"2,915.7"}}]
["Preut, Susanne",{"$f":"VLOOKUP(A32,'Wettkampf 1'!$B$10:$C$45,2,FALSE)","v":"Neuvrees II"},{"$f":"VLOOKUP(A32,'Wettkampf 1'!$B$10:$D$45,3,FALSE)","v":299.3},{"$f":"VLOOKUP($A32,'2'!$B$10:$D$45,3,FALSE)","v":304.9},{"$f":"VLOOKUP($A32,'3'!$B$10:$D$45,3,FALSE)","v":304.5},{"$f":"VLOOKUP($A32,'4'!$B$10:$D$45,3,FALSE)","v":308.4},{"$f":"VLOOKUP($A32,'5'!$B$10:$D$45,3,FALSE)","v":{"v":0,"d":"0.0"}},{"$f":"VLOOKUP($A32,'6'!$B$10:$D$45,3,FALSE)","v":300.4},{"$f":"K32/J32","v":303.5},{"$f":"VLOOKUP(A32,Formelhilfe!$A$9:$H$44,8,FALSE)","v":{"v":5,"d":"5.0"}},{"$f":"SUM(C32:H32)","v":{"v":1517.5,"d":"1,517.5"}},{"$f":"VLOOKUP($A32,'7'!$B$10:$D$45,3,FALSE)","v":303.2},{"$f":"VLOOKUP($A32,'8'!$B$10:$D$45,3,FALSE)","v":304.6},{"$f":"VLOOKUP($A32,'9'!$B$10:$D$45,3,FALSE)","v":{"v":0,"d":"0.0"}},{"$f":"VLOOKUP($A32,'10'!$B$10:$D$45,3,FALSE)","v":307.9},{"$f":"VLOOKUP($A32,'11'!$B$10:$D$45,3,FALSE)","v":297.8},{"$f":"VLOOKUP($A32,'12'!$B$10:$D$45,3,FALSE)","v":{"v":0,"d":"0.0"}},{"$f":"T32/S32","v":{"v":303.375,"d":"303.4"}},{"$f":"VLOOKUP(A32,Formelhilfe!$A$9:$O$44,15,FALSE)","v":{"v":4,"d":"4.0"}},{"$f":"SUM(L32:Q32)","v":{"v":1213.5,"d":"1,213.5"}},{"$f":"W32/V32","v":{"v":303.4444444444445,"d":"303.4"}},{"$f":"VLOOKUP(A32,Formelhilfe!$A$9:$P$44,16,FALSE)","v":{"v":9,"d":"9.0"}},{"$f":"SUM(C32:H32,L32:Q32)","v":{"v":2731.0000000000005,"d":"2,731.0"}}]
["Eilermann, Saskia",{"$f":"VLOOKUP(A33,'Wettkampf 1'!$B$10:$C$45,2,FALSE)","v":"Neuvrees II"},{"$f":"VLOOKUP(A33,'Wettkampf 1'!$B$10:$D$45,3,FALSE)","v":309.2},{"$f":"VLOOKUP($A33,'2'!$B$10:$D$45,3,FALSE)","v":310.2},{"$f":"VLOOKUP($A33,'3'!$B$10:$D$45,3,FALSE)","v":309.7},{"$f":"VLOOKUP($A33,'4'!$B$10:$D$45,3,FALSE)","v":{"v":0,"d":"0.0"}},{"$f":"VLOOKUP($A33,'5'!$B$10:$D$45,3,FALSE)","v":{"v":0,"d":"0.0"}},{"$f":"VLOOKUP($A33,'6'!$B$10:$D$45,3,FALSE)","v":311.2},{"$f":"K33/J33","v":{"v":310.075,"d":"310.1"}},{"$f":"VLOOKUP(A33,Formelhilfe!$A$9:$H$44,8,FALSE)","v":{"v":4,"d":"4.0"}},{"$f":"SUM(C33:H33)","v":{"v":1240.3,"d":"1,240.3"}},{"$f":"VLOOKUP($A33,'7'!$B$10:$D$45,3,FALSE)","v":{"v":0,"d":"0.0"}},{"$f":"VLOOKUP($A33,'8'!$B$10:$D$45,3,FALSE)","v":{"v":0,"d":"0.0"}},{"$f":"VLOOKUP($A33,'9'!$B$10:$D$45,3,FALSE)","v":310.3},{"$f":"VLOOKUP($A33,'10'!$B$10:$D$45,3,FALSE)","v":{"v":0,"d":"0.0"}},{"$f":"VLOOKUP($A33,'11'!$B$10:$D$45,3,FALSE)","v":312.5},{"$f":"VLOOKUP($A33,'12'!$B$10:$D$45,3,FALSE)","v":{"v":0,"d":"0.0"}},{"$f":"T33/S33","v":311.4},{"$f":"VLOOKUP(A33,Formelhilfe!$A$9:$O$44,15,FALSE)","v":{"v":2,"d":"2.0"}},{"$f":"SUM(L33:Q33)","v":622.8},{"$f":"W33/V33","v":{"v":310.51666666666665,"d":"310.5"}},{"$f":"VLOOKUP(A33,Formelhilfe!$A$9:$P$44,16,FALSE)","v":{"v":6,"d":"6.0"}},{"$f":"SUM(C33:H33,L33:Q33)","v":{"v":1863.1,"d":"1,863.1"}}]
["Schulte, Christina",{"$f":"VLOOKUP(A34,'Wettkampf 1'!$B$10:$C$45,2,FALSE)","v":"Neuvrees II"},{"$f":"VLOOKUP(A34,'Wettkampf 1'!$B$10:$D$45,3,FALSE)","v":310.4},{"$f":"VLOOKUP($A34,'2'!$B$10:$D$45,3,FALSE)","v":305.7},{"$f":"VLOOKUP($A34,'3'!$B$10:$D$45,3,FALSE)","v":304.3},{"$f":"VLOOKUP($A34,'4'!$B$10:$D$45,3,FALSE)","v":308.4},{"$f":"VLOOKUP($A34,'5'!$B$10:$D$45,3,FALSE)","v":305.8},{"$f":"VLOOKUP($A34,'6'!$B$10:$D$45,3,FALSE)","v":{"v":0,"d":"0.0"}},{"$f":"K34/J34","v":{"v":306.91999999999996,"d":"306.9"}},{"$f":"VLOOKUP(A34,Formelhilfe!$A$9:$H$44,8,FALSE)","v":{"v":5,"d":"5.0"}},{"$f":"SUM(C34:H34)","v":{"v":1534.5999999999997,"d":"1,534.6"}},{"$f":"VLOOKUP($A34,'7'!$B$10:$D$45,3,FALSE)","v":303.1},{"$f":"VLOOKUP($A34,'8'!$B$10:$D$45,3,FALSE)","v":{"v":0,"d":"0.0"}},{"$f":"VLOOKUP($A34,'9'!$B$10:$D$45,3,FALSE)","v":{"v":0,"d":"0.0"}},{"$f":"VLOOKUP($A34,'10'!$B$10:$D$45,3,FALSE)","v":{"v":0,"d":"0.0"}},{"$f":"VLOOKUP($A34,'11'!$B$10:$D$45,3,FALSE)","v":{"v":0,"d":"0.0"}},{"$f":"VLOOKUP($A34,'12'!$B$10:$D$45,3,FALSE)","v":{"v":0,"d":"0.0"}},{"$f":"T34/S34","v":303.1},{"$f":"VLOOKUP(A34,Formelhilfe!$A$9:$O$44,15,FALSE)","v":{"v":1,"d":"1.0"}},{"$f":"SUM(L34:Q34)","v":303.1},{"$f":"W34/V34","v":{"v":306.2833333333333,"d":"306.3"}},{"$f":"VLOOKUP(A34,Formelhilfe!$A$9:$P$44,16,FALSE)","v":{"v":6,"d":"6.0"}},{"$f":"SUM(C34:H34,L34:Q34)","v":{"v":1837.6999999999998,"d":"1,837.7"}}]
["Kossenjans, Annegret",{"$f":"VLOOKUP(A35,'Wettkampf 1'!$B$10:$C$45,2,FALSE)","v":"Börger II"},{"$f":"VLOOKUP(A35,'Wettkampf 1'!$B$10:$D$45,3,FALSE)","v":310.2},{"$f":"VLOOKUP($A35,'2'!$B$10:$D$45,3,FALSE)","v":304.8},{"$f":"VLOOKUP($A35,'3'!$B$10:$D$45,3,FALSE)","v":298.6},{"$f":"VLOOKUP($A35,'4'!$B$10:$D$45,3,FALSE)","v":307.4},{"$f":"VLOOKUP($A35,'5'!$B$10:$D$45,3,FALSE)","v":307.8},{"$f":"VLOOKUP($A35,'6'!$B$10:$D$45,3,FALSE)","v":301.9},{"$f":"K35/J35","v":{"v":305.1166666666666,"d":"305.1"}},{"$f":"VLOOKUP(A35,Formelhilfe!$A$9:$H$44,8,FALSE)","v":{"v":6,"d":"6.0"}},{"$f":"SUM(C35:H35)","v":{"v":1830.6999999999998,"d":"1,830.7"}},{"$f":"VLOOKUP($A35,'7'!$B$10:$D$45,3,FALSE)","v":{"v":0,"d":"0.0"}},{"$f":"VLOOKUP($A35,'8'!$B$10:$D$45,3,FALSE)","v":{"v":0,"d":"0.0"}},{"$f":"VLOOKUP($A35,'9'!$B$10:$D$45,3,FALSE)","v":{"v":0,"d":"0.0"}},{"$f":"VLOOKUP($A35,'10'!$B$10:$D$45,3,FALSE)","v":{"v":0,"d":"0.0"}},{"$f":"VLOOKUP($A35,'11'!$B$10:$D$45,3,FALSE)","v":{"v":0,"d":"0.0"}},{"$f":"VLOOKUP($A35,'12'!$B$10:$D$45,3,FALSE)","v":{"v":0,"d":"0.0"}},{"$f":"T35/S35","v":{"$error":"#DIV/0!"}},{"$f":"VLOOKUP(A35,Formelhilfe!$A$9:$O$44,15,FALSE)","v":{"v":0,"d":"0.0"}},{"$f":"SUM(L35:Q35)","v":{"v":0,"d":"0.0"}},{"$f":"W35/V35","v":{"v":305.1166666666666,"d":"305.1"}},{"$f":"VLOOKUP(A35,Formelhilfe!$A$9:$P$44,16,FALSE)","v":{"v":6,"d":"6.0"}},{"$f":"SUM(C35:H35,L35:Q35)","v":{"v":1830.6999999999998,"d":"1,830.7"}}]
["Lindemann, Annemarie",{"$f":"VLOOKUP(A36,'Wettkampf 1'!$B$10:$C$45,2,FALSE)","v":"Esterwegen V"},{"$f":"VLOOKUP(A36,'Wettkampf 1'!$B$10:$D$45,3,FALSE)","v":297.9},{"$f":"VLOOKUP($A36,'2'!$B$10:$D$45,3,FALSE)","v":302.8},{"$f":"VLOOKUP($A36,'3'!$B$10:$D$45,3,FALSE)","v":302.7},{"$f":"VLOOKUP($A36,'4'!$B$10:$D$45,3,FALSE)","v":305.5},{"$f":"VLOOKUP($A36,'5'!$B$10:$D$45,3,FALSE)","v":306.3},{"$f":"VLOOKUP($A36,'6'!$B$10:$D$45,3,FALSE)","v":{"v":0,"d":"0.0"}},{"$f":"K36/J36","v":{"v":303.04,"d":"303.0"}},{"$f":"VLOOKUP(A36,Formelhilfe!$A$9:$H$44,8,FALSE)","v":{"v":5,"d":"5.0"}},{"$f":"SUM(C36:H36)","v":{"v":1515.2,"d":"1,515.2"}},{"$f":"VLOOKUP($A36,'7'!$B$10:$D$45,3,FALSE)","v":{"v":0,"d":"0.0"}},{"$f":"VLOOKUP($A36,'8'!$B$10:$D$45,3,FALSE)","v":{"v":0,"d":"0.0"}},{"$f":"VLOOKUP($A36,'9'!$B$10:$D$45,3,FALSE)","v":{"v":0,"d":"0.0"}},{"$f":"VLOOKUP($A36,'10'!$B$10:$D$45,3,FALSE)","v":{"v":0,"d":"0.0"}},{"$f":"VLOOKUP($A36,'11'!$B$10:$D$45,3,FALSE)","v":{"v":0,"d":"0.0"}},{"$f":"VLOOKUP($A36,'12'!$B$10:$D$45,3,FALSE)","v":{"v":0,"d":"0.0"}},{"$f":"T36/S36","v":{"$error":"#DIV/0!"}},{"$f":"VLOOKUP(A36,Formelhilfe!$A$9:$O$44,15,FALSE)","v":{"v":0,"d":"0.0"}},{"$f":"SUM(L36:Q36)","v":{"v":0,"d":"0.0"}},{"$f":"W36/V36","v":{"v":303.04,"d":"303.0"}},{"$f":"VLOOKUP(A36,Formelhilfe!$A$9:$P$44,16,FALSE)","v":{"v":5,"d":"5.0"}},{"$f":"SUM(C36:H36,L36:Q36)","v":{"v":1515.2,"d":"1,515.2"}}]
["Schwarte, Annette",{"$f":"VLOOKUP(A37,'Wettkampf 1'!$B$10:$C$45,2,FALSE)","v":"Börger II"},{"$f":"VLOOKUP(A37,'Wettkampf 1'!$B$10:$D$45,3,FALSE)","v":{"v":0,"d":"0.0"}},{"$f":"VLOOKUP($A37,'2'!$B$10:$D$45,3,FALSE)","v":{"v":0,"d":"0.0"}},{"$f":"VLOOKUP($A37,'3'!$B$10:$D$45,3,FALSE)","v":{"v":0,"d":"0.0"}},{"$f":"VLOOKUP($A37,'4'!$B$10:$D$45,3,FALSE)","v":{"v":0,"d":"0.0"}},{"$f":"VLOOKUP($A37,'5'!$B$10:$D$45,3,FALSE)","v":{"v":0,"d":"0.0"}},{"$f":"VLOOKUP($A37,'6'!$B$10:$D$45,3,FALSE)","v":{"v":0,"d":"0.0"}},{"$f":"K37/J37","v":{"$error":"#DIV/0!"}},{"$f":"VLOOKUP(A37,Formelhilfe!$A$9:$H$44,8,FALSE)","v":{"v":0,"d":"0.0"}},{"$f":"SUM(C37:H37)","v":{"v":0,"d":"0.0"}},{"$f":"VLOOKUP($A37,'7'!$B$10:$D$45,3,FALSE)","v":{"v":0,"d":"0.0"}},{"$f":"VLOOKUP($A37,'8'!$B$10:$D$45,3,FALSE)","v":{"v":0,"d":"0.0"}},{"$f":"VLOOKUP($A37,'9'!$B$10:$D$45,3,FALSE)","v":{"v":0,"d":"0.0"}},{"$f":"VLOOKUP($A37,'10'!$B$10:$D$45,3,FALSE)","v":{"v":0,"d":"0.0"}},{"$f":"VLOOKUP($A37,'11'!$B$10:$D$45,3,FALSE)","v":{"v":0,"d":"0.0"}},{"$f":"VLOOKUP($A37,'12'!$B$10:$D$45,3,FALSE)","v":{"v":0,"d":"0.0"}},{"$f":"T37/S37","v":{"$error":"#DIV/0!"}},{"$f":"VLOOKUP(A37,Formelhilfe!$A$9:$O$44,15,FALSE)","v":{"v":0,"d":"0.0"}},{"$f":"SUM(L37:Q37)","v":{"v":0,"d":"0.0"}},{"$f":"W37/V37","v":{"$error":"#DIV/0!"}},{"$f":"VLOOKUP(A37,Formelhilfe!$A$9:$P$44,16,FALSE)","v":{"v":0,"d":"0.0"}},{"$f":"SUM(C37:H37,L37:Q37)","v":{"v":0,"d":"0.0"}}]

{"sheet":"Formelhilfe","index":16,"n_rows":45,"n_cols":21,"rows_kept":45,"hidden":true}
[null,1,2,3,4,5,6,"Hinrunde Schnitt",7,8,9,10,11,12,"Rückrunde Schnitt","Gesamt Schnitt",null,null,"Kreisoberliga","Schützen","2019/2020"]
[{"$f":"'Wettkampf 1'!B2","v":"Börger II"},{"$f":"IF('Wettkampf 1'!D2>0,1,0)","v":1},{"$f":"IF('2'!$D2>0,1,0)","v":1},{"$f":"IF('3'!$D2>0,1,0)","v":1},{"$f":"IF('4'!$D2>0,1,0)","v":1},{"$f":"IF('5'!$D2>0,1,0)","v":1},{"$f":"IF('6'!$D2>0,1,0)","v":1},{"$f":"B2+C2+D2+E2+F2+G2","v":6},{"$f":"IF('7'!$D2>0,1,0)","v":1},{"$f":"IF('8'!$D2>0,1,0)","v":1},{"$f":"IF('9'!$D2>0,1,0)","v":1},{"$f":"IF('10'!$D2>0,1,0)","v":1},{"$f":"IF('11'!$D2>0,1,0)","v":1},{"$f":"IF('12'!$D2>0,1,0)","v":0},{"$f":"I2+J2+K2+L2+M2+N2","v":5},{"$f":"O2+H2","v":11},null,null,"1. Kreisliga","Damen","2020/2021"]
[{"$f":"'Wettkampf 1'!B3","v":"Esterwegen V"},{"$f":"IF('Wettkampf 1'!D3>0,1,0)","v":1},{"$f":"IF('2'!$D3>0,1,0)","v":1},{"$f":"IF('3'!$D3>0,1,0)","v":1},{"$f":"IF('4'!$D3>0,1,0)","v":1},{"$f":"IF('5'!$D3>0,1,0)","v":1},{"$f":"IF('6'!$D3>0,1,0)","v":1},6,{"$f":"IF('7'!$D3>0,1,0)","v":1},{"$f":"IF('8'!$D3>0,1,0)","v":1},{"$f":"IF('9'!$D3>0,1,0)","v":1},{"$f":"IF('10'!$D3>0,1,0)","v":1},{"$f":"IF('11'!$D3>0,1,0)","v":1},{"$f":"IF('12'!$D3>0,1,0)","v":0},5,11,null,null,"2. Kreisliga","Altersgruppe","2021/2022"]
[{"$f":"'Wettkampf 1'!B4","v":"Neuvrees II"},{"$f":"IF('Wettkampf 1'!D4>0,1,0)","v":1},{"$f":"IF('2'!$D4>0,1,0)","v":1},{"$f":"IF('3'!$D4>0,1,0)","v":1},{"$f":"IF('4'!$D4>0,1,0)","v":1},{"$f":"IF('5'!$D4>0,1,0)","v":1},{"$f":"IF('6'!$D4>0,1,0)","v":1},6,{"$f":"IF('7'!$D4>0,1,0)","v":1},{"$f":"IF('8'!$D4>0,1,0)","v":1},{"$f":"IF('9'!$D4>0,1,0)","v":1},{"$f":"IF('10'!$D4>0,1,0)","v":1},{"$f":"IF('11'!$D4>0,1,0)","v":1},{"$f":"IF('12'!$D4>0,1,0)","v":0},5,11,null,null,"1. Kreisklasse","Senioren","2022/2023"]
[{"$f":"'Wettkampf 1'!B5","v":"Lahn IV"},{"$f":"IF('Wettkampf 1'!D5>0,1,0)","v":1},{"$f":"IF('2'!$D5>0,1,0)","v":1},{"$f":"IF('3'!$D5>0,1,0)","v":1},{"$f":"IF('4'!$D5>0,1,0)","v":1},{"$f":"IF('5'!$D5>0,1,0)","v":1},{"$f":"IF('6'!$D5>0,1,0)","v":1},6,{"$f":"IF('7'!$D5>0,1,0)","v":1},{"$f":"IF('8'!$D5>0,1,0)","v":1},{"$f":"IF('9'!$D5>0,1,0)","v":1},{"$f":"IF('10'!$D5>0,1,0)","v":1},{"$f":"IF('11'!$D5>0,1,0)","v":1},{"$f":"IF('12'!$D5>0,1,0)","v":0},5,11,null,null,"2. Kreisklasse","   ","2023/2024"]
[{"$f":"'Wettkampf 1'!B6","v":"Börger III"},{"$f":"IF('Wettkampf 1'!D6>0,1,0)","v":1},{"$f":"IF('2'!$D6>0,1,0)","v":1},{"$f":"IF('3'!$D6>0,1,0)","v":1},{"$f":"IF('4'!$D6>0,1,0)","v":1},{"$f":"IF('5'!$D6>0,1,0)","v":1},{"$f":"IF('6'!$D6>0,1,0)","v":1},6,{"$f":"IF('7'!$D6>0,1,0)","v":1},{"$f":"IF('8'!$D6>0,1,0)","v":1},{"$f":"IF('9'!$D6>0,1,0)","v":1},{"$f":"IF('10'!$D6>0,1,0)","v":1},{"$f":"IF('11'!$D6>0,1,0)","v":1},{"$f":"IF('12'!$D6>0,1,0)","v":0},5,11,null,null,"3. Kreisklasse"]
[{"$f":"'Wettkampf 1'!B7","v":"Lahn III"},{"$f":"IF('Wettkampf 1'!D7>0,1,0)","v":1},{"$f":"IF('2'!$D7>0,1,0)","v":1},{"$f":"IF('3'!$D7>0,1,0)","v":1},{"$f":"IF('4'!$D7>0,1,0)","v":1},{"$f":"IF('5'!$D7>0,1,0)","v":1},{"$f":"IF('6'!$D7>0,1,0)","v":1},6,{"$f":"IF('7'!$D7>0,1,0)","v":1},{"$f":"IF('8'!$D7>0,1,0)","v":1},{"$f":"IF('9'!$D7>0,1,0)","v":1},{"$f":"IF('10'!$D7>0,1,0)","v":1},{"$f":"IF('11'!$D7>0,1,0)","v":1},{"$f":"IF('12'!$D7>0,1,0)","v":0},5,11,null,null,"4. Kreisklasse"]
[{"$nulls":18},"5. Kreisklasse"]
["Kossenjans, Annegret",{"$f":"IF('Wettkampf 1'!D10>0,1,0)","v":1},{"$f":"IF('2'!$D10>0,1,0)","v":1},{"$f":"IF('3'!$D10>0,1,0)","v":1},{"$f":"IF('4'!$D10>0,1,0)","v":1},{"$f":"IF('5'!$D10>0,1,0)","v":1},{"$f":"IF('6'!$D10>0,1,0)","v":1},{"$f":"B9+C9+D9+E9+F9+G9","v":6},{"$f":"IF('7'!$D10>0,1,0)","v":0},{"$f":"IF('8'!$D10>0,1,0)","v":0},{"$f":"IF('9'!$D10>0,1,0)","v":0},{"$f":"IF('10'!$D10>0,1,0)","v":0},{"$f":"IF('11'!$D10>0,1,0)","v":0},{"$f":"IF('12'!$D10>0,1,0)","v":0},{"$f":"I9+J9+K9+L9+M9+N9","v":0},{"$f":"O9+H9","v":6},null,null,"6. Kreisklasse"]
["Jansen, Elisabeth",{"$f":"IF('Wettkampf 1'!D11>0,1,0)","v":1},{"$f":"IF('2'!$D11>0,1,0)","v":1},{"$f":"IF('3'!$D11>0,1,0)","v":1},{"$f":"IF('4'!$D11>0,1,0)","v":1},{"$f":"IF('5'!$D11>0,1,0)","v":1},{"$f":"IF('6'!$D11>0,1,0)","v":1},{"$f":"B10+C10+D10+E10+F10+G10","v":6},{"$f":"IF('7'!$D11>0,1,0)","v":1},{"$f":"IF('8'!$D11>0,1,0)","v":1},{"$f":"IF('9'!$D11>0,1,0)","v":1},{"$f":"IF('10'!$D11>0,1,0)","v":1},{"$f":"IF('11'!$D11>0,1,0)","v":1},{"$f":"IF('12'!$D11>0,1,0)","v":0},{"$f":"I10+J10+K10+L10+M10+N10","v":5},{"$f":"O10+H10","v":11},null,null,"7. Kreisklasse"]
["Krömer, Monika",{"$f":"IF('Wettkampf 1'!D12>0,1,0)","v":1},{"$f":"IF('2'!$D12>0,1,0)","v":1},{"$f":"IF('3'!$D12>0,1,0)","v":1},{"$f":"IF('4'!$D12>0,1,0)","v":1},{"$f":"IF('5'!$D12>0,1,0)","v":1},{"$f":"IF('6'!$D12>0,1,0)","v":1},6,{"$f":"IF('7'!$D12>0,1,0)","v":1},{"$f":"IF('8'!$D12>0,1,0)","v":1},{"$f":"IF('9'!$D12>0,1,0)","v":1},{"$f":"IF('10'!$D12>0,1,0)","v":1},{"$f":"IF('11'!$D12>0,1,0)","v":1},{"$f":"IF('12'!$D12>0,1,0)","v":0},5,11]
["Pohlgeers, Margret",{"$f":"IF('Wettkampf 1'!D13>0,1,0)","v":1},{"$f":"IF('2'!$D13>0,1,0)","v":1},{"$f":"IF('3'!$D13>0,1,0)","v":1},{"$f":"IF('4'!$D13>0,1,0)","v":1},{"$f":"IF('5'!$D13>0,1,0)","v":1},{"$f":"IF('6'!$D13>0,1,0)","v":1},6,{"$f":"IF('7'!$D13>0,1,0)","v":1},{"$f":"IF('8'!$D13>0,1,0)","v":1},{"$f":"IF('9'!$D13>0,1,0)","v":1},{"$f":"IF('10'!$D13>0,1,0)","v":1},{"$f":"IF('11'!$D13>0,1,0)","v":1},{"$f":"IF('12'!$D13>0,1,0)","v":0},5,11]
["Pohlgeers, Silvia",{"$f":"IF('Wettkampf 1'!D14>0,1,0)","v":1},{"$f":"IF('2'!$D14>0,1,0)","v":1},{"$f":"IF('3'!$D14>0,1,0)","v":1},{"$f":"IF('4'!$D14>0,1,0)","v":1},{"$f":"IF('5'!$D14>0,1,0)","v":1},{"$f":"IF('6'!$D14>0,1,0)","v":1},6,{"$f":"IF('7'!$D14>0,1,0)","v":1},{"$f":"IF('8'!$D14>0,1,0)","v":1},{"$f":"IF('9'!$D14>0,1,0)","v":1},{"$f":"IF('10'!$D14>0,1,0)","v":1},{"$f":"IF('11'!$D14>0,1,0)","v":1},{"$f":"IF('12'!$D14>0,1,0)","v":0},5,11]
["Schwarte, Annette",{"$f":"IF('Wettkampf 1'!D15>0,1,0)","v":0},{"$f":"IF('2'!$D15>0,1,0)","v":0},{"$f":"IF('3'!$D15>0,1,0)","v":0},{"$f":"IF('4'!$D15>0,1,0)","v":0},{"$f":"IF('5'!$D15>0,1,0)","v":0},{"$f":"IF('6'!$D15>0,1,0)","v":0},0,{"$f":"IF('7'!$D15>0,1,0)","v":0},{"$f":"IF('8'!$D15>0,1,0)","v":0},{"$f":"IF('9'!$D15>0,1,0)","v":0},{"$f":"IF('10'!$D15>0,1,0)","v":0},{"$f":"IF('11'!$D15>0,1,0)","v":0},{"$f":"IF('12'!$D15>0,1,0)","v":0},0,0]
["Lindemann, Kerstin",{"$f":"IF('Wettkampf 1'!D16>0,1,0)","v":1},{"$f":"IF('2'!$D16>0,1,0)","v":1},{"$f":"IF('3'!$D16>0,1,0)","v":1},{"$f":"IF('4'!$D16>0,1,0)","v":1},{"$f":"IF('5'!$D16>0,1,0)","v":1},{"$f":"IF('6'!$D16>0,1,0)","v":1},6,{"$f":"IF('7'!$D16>0,1,0)","v":1},{"$f":"IF('8'!$D16>0,1,0)","v":1},{"$f":"IF('9'!$D16>0,1,0)","v":1},{"$f":"IF('10'!$D16>0,1,0)","v":1},{"$f":"IF('11'!$D16>0,1,0)","v":1},{"$f":"IF('12'!$D16>0,1,0)","v":0},5,11]
["Schlarmann, Lena",{"$f":"IF('Wettkampf 1'!D17>0,1,0)","v":1},{"$f":"IF('2'!$D17>0,1,0)","v":1},{"$f":"IF('3'!$D17>0,1,0)","v":1},{"$f":"IF('4'!$D17>0,1,0)","v":1},{"$f":"IF('5'!$D17>0,1,0)","v":1},{"$f":"IF('6'!$D17>0,1,0)","v":1},6,{"$f":"IF('7'!$D17>0,1,0)","v":1},{"$f":"IF('8'!$D17>0,1,0)","v":1},{"$f":"IF('9'!$D17>0,1,0)","v":1},{"$f":"IF('10'!$D17>0,1,0)","v":1},{"$f":"IF('11'!$D17>0,1,0)","v":1},{"$f":"IF('12'!$D17>0,1,0)","v":0},5,11]
["Lindemann, Stefanie",{"$f":"IF('Wettkampf 1'!D18>0,1,0)","v":1},{"$f":"IF('2'!$D18>0,1,0)","v":1},{"$f":"IF('3'!$D18>0,1,0)","v":1},{"$f":"IF('4'!$D18>0,1,0)","v":1},{"$f":"IF('5'!$D18>0,1,0)","v":1},{"$f":"IF('6'!$D18>0,1,0)","v":1},6,{"$f":"IF('7'!$D18>0,1,0)","v":1},{"$f":"IF('8'!$D18>0,1,0)","v":1},{"$f":"IF('9'!$D18>0,1,0)","v":1},{"$f":"IF('10'!$D18>0,1,0)","v":1},{"$f":"IF('11'!$D18>0,1,0)","v":0},{"$f":"IF('12'!$D18>0,1,0)","v":0},4,10]
["Lindemann, Rita",{"$f":"IF('Wettkampf 1'!D19>0,1,0)","v":1},{"$f":"IF('2'!$D19>0,1,0)","v":1},{"$f":"IF('3'!$D19>0,1,0)","v":1},{"$f":"IF('4'!$D19>0,1,0)","v":1},{"$f":"IF('5'!$D19>0,1,0)","v":1},{"$f":"IF('6'!$D19>0,1,0)","v":1},6,{"$f":"IF('7'!$D19>0,1,0)","v":1},{"$f":"IF('8'!$D19>0,1,0)","v":1},{"$f":"IF('9'!$D19>0,1,0)","v":1},{"$f":"IF('10'!$D19>0,1,0)","v":1},{"$f":"IF('11'!$D19>0,1,0)","v":1},{"$f":"IF('12'!$D19>0,1,0)","v":0},5,11]
["Büter, Daniela",{"$f":"IF('Wettkampf 1'!D20>0,1,0)","v":1},{"$f":"IF('2'!$D20>0,1,0)","v":1},{"$f":"IF('3'!$D20>0,1,0)","v":1},{"$f":"IF('4'!$D20>0,1,0)","v":1},{"$f":"IF('5'!$D20>0,1,0)","v":1},{"$f":"IF('6'!$D20>0,1,0)","v":1},6,{"$f":"IF('7'!$D20>0,1,0)","v":1},{"$f":"IF('8'!$D20>0,1,0)","v":1},{"$f":"IF('9'!$D20>0,1,0)","v":1},{"$f":"IF('10'!$D20>0,1,0)","v":1},{"$f":"IF('11'!$D20>0,1,0)","v":1},{"$f":"IF('12'!$D20>0,1,0)","v":0},5,11]
["Lindemann, Annemarie",{"$f":"IF('Wettkampf 1'!D21>0,1,0)","v":1},{"$f":"IF('2'!$D21>0,1,0)","v":1},{"$f":"IF('3'!$D21>0,1,0)","v":1},{"$f":"IF('4'!$D21>0,1,0)","v":1},{"$f":"IF('5'!$D21>0,1,0)","v":1},{"$f":"IF('6'!$D21>0,1,0)","v":0},5,{"$f":"IF('7'!$D21>0,1,0)","v":0},{"$f":"IF('8'!$D21>0,1,0)","v":0},{"$f":"IF('9'!$D21>0,1,0)","v":0},{"$f":"IF('10'!$D21>0,1,0)","v":0},{"$f":"IF('11'!$D21>0,1,0)","v":0},{"$f":"IF('12'!$D21>0,1,0)","v":0},0,5]
["Preut, Susanne",{"$f":"IF('Wettkampf 1'!D22>0,1,0)","v":1},{"$f":"IF('2'!$D22>0,1,0)","v":1},{"$f":"IF('3'!$D22>0,1,0)","v":1},{"$f":"IF('4'!$D22>0,1,0)","v":1},{"$f":"IF('5'!$D22>0,1,0)","v":0},{"$f":"IF('6'!$D22>0,1,0)","v":1},5,{"$f":"IF('7'!$D22>0,1,0)","v":1},{"$f":"IF('8'!$D22>0,1,0)","v":1},{"$f":"IF('9'!$D22>0,1,0)","v":0},{"$f":"IF('10'!$D22>0,1,0)","v":1},{"$f":"IF('11'!$D22>0,1,0)","v":1},{"$f":"IF('12'!$D22>0,1,0)","v":0},4,9]
["Thunert, Silvia",{"$f":"IF('Wettkampf 1'!D23>0,1,0)","v":1},{"$f":"IF('2'!$D23>0,1,0)","v":1},{"$f":"IF('3'!$D23>0,1,0)","v":1},{"$f":"IF('4'!$D23>0,1,0)","v":1},{"$f":"IF('5'!$D23>0,1,0)","v":1},{"$f":"IF('6'!$D23>0,1,0)","v":1},6,{"$f":"IF('7'!$D23>0,1,0)","v":1},{"$f":"IF('8'!$D23>0,1,0)","v":1},{"$f":"IF('9'!$D23>0,1,0)","v":1},{"$f":"IF('10'!$D23>0,1,0)","v":1},{"$f":"IF('11'!$D23>0,1,0)","v":1},{"$f":"IF('12'!$D23>0,1,0)","v":0},5,11]
["Pohlmann, Margret",{"$f":"IF('Wettkampf 1'!D24>0,1,0)","v":1},{"$f":"IF('2'!$D24>0,1,0)","v":1},{"$f":"IF('3'!$D24>0,1,0)","v":1},{"$f":"IF('4'!$D24>0,1,0)","v":1},{"$f":"IF('5'!$D24>0,1,0)","v":1},{"$f":"IF('6'!$D24>0,1,0)","v":1},6,{"$f":"IF('7'!$D24>0,1,0)","v":1},{"$f":"IF('8'!$D24>0,1,0)","v":1},{"$f":"IF('9'!$D24>0,1,0)","v":1},{"$f":"IF('10'!$D24>0,1,0)","v":1},{"$f":"IF('11'!$D24>0,1,0)","v":1},{"$f":"IF('12'!$D24>0,1,0)","v":0},5,11]
["Eilermann, Saskia",{"$f":"IF('Wettkampf 1'!D25>0,1,0)","v":1},{"$f":"IF('2'!$D25>0,1,0)","v":1},{"$f":"IF('3'!$D25>0,1,0)","v":1},{"$f":"IF('4'!$D25>0,1,0)","v":0},{"$f":"IF('5'!$D25>0,1,0)","v":0},{"$f":"IF('6'!$D25>0,1,0)","v":1},4,{"$f":"IF('7'!$D25>0,1,0)","v":0},{"$f":"IF('8'!$D25>0,1,0)","v":0},{"$f":"IF('9'!$D25>0,1,0)","v":1},{"$f":"IF('10'!$D25>0,1,0)","v":0},{"$f":"IF('11'!$D25>0,1,0)","v":1},{"$f":"IF('12'!$D25>0,1,0)","v":0},2,6]
["Junge, Silvia",{"$f":"IF('Wettkampf 1'!D26>0,1,0)","v":1},{"$f":"IF('2'!$D26>0,1,0)","v":1},{"$f":"IF('3'!$D26>0,1,0)","v":1},{"$f":"IF('4'!$D26>0,1,0)","v":1},{"$f":"IF('5'!$D26>0,1,0)","v":1},{"$f":"IF('6'!$D26>0,1,0)","v":1},6,{"$f":"IF('7'!$D26>0,1,0)","v":1},{"$f":"IF('8'!$D26>0,1,0)","v":1},{"$f":"IF('9'!$D26>0,1,0)","v":1},{"$f":"IF('10'!$D26>0,1,0)","v":1},{"$f":"IF('11'!$D26>0,1,0)","v":1},{"$f":"IF('12'!$D26>0,1,0)","v":0},5,11]
["Evers, Claudia",{"$f":"IF('Wettkampf 1'!D27>0,1,0)","v":1},{"$f":"IF('2'!$D27>0,1,0)","v":1},{"$f":"IF('3'!$D27>0,1,0)","v":1},{"$f":"IF('4'!$D27>0,1,0)","v":1},{"$f":"IF('5'!$D27>0,1,0)","v":1},{"$f":"IF('6'!$D27>0,1,0)","v":1},6,{"$f":"IF('7'!$D27>0,1,0)","v":1},{"$f":"IF('8'!$D27>0,1,0)","v":1},{"$f":"IF('9'!$D27>0,1,0)","v":1},{"$f":"IF('10'!$D27>0,1,0)","v":1},{"$f":"IF('11'!$D27>0,1,0)","v":1},{"$f":"IF('12'!$D27>0,1,0)","v":0},5,11]
["Schulte, Christina",{"$f":"IF('Wettkampf 1'!D28>0,1,0)","v":1},{"$f":"IF('2'!$D28>0,1,0)","v":1},{"$f":"IF('3'!$D28>0,1,0)","v":1},{"$f":"IF('4'!$D28>0,1,0)","v":1},{"$f":"IF('5'!$D28>0,1,0)","v":1},{"$f":"IF('6'!$D28>0,1,0)","v":0},5,{"$f":"IF('7'!$D28>0,1,0)","v":1},{"$f":"IF('8'!$D28>0,1,0)","v":0},{"$f":"IF('9'!$D28>0,1,0)","v":0},{"$f":"IF('10'!$D28>0,1,0)","v":0},{"$f":"IF('11'!$D28>0,1,0)","v":0},{"$f":"IF('12'!$D28>0,1,0)","v":0},1,6]
["Reinelt, Michaela",{"$f":"IF('Wettkampf 1'!D29>0,1,0)","v":1},{"$f":"IF('2'!$D29>0,1,0)","v":1},{"$f":"IF('3'!$D29>0,1,0)","v":1},{"$f":"IF('4'!$D29>0,1,0)","v":1},{"$f":"IF('5'!$D29>0,1,0)","v":1},{"$f":"IF('6'!$D29>0,1,0)","v":1},6,{"$f":"IF('7'!$D29>0,1,0)","v":1},{"$f":"IF('8'!$D29>0,1,0)","v":1},{"$f":"IF('9'!$D29>0,1,0)","v":1},{"$f":"IF('10'!$D29>0,1,0)","v":1},{"$f":"IF('11'!$D29>0,1,0)","v":1},{"$f":"IF('12'!$D29>0,1,0)","v":0},5,11]
["Thien, Marita",{"$f":"IF('Wettkampf 1'!D30>0,1,0)","v":1},{"$f":"IF('2'!$D30>0,1,0)","v":1},{"$f":"IF('3'!$D30>0,1,0)","v":1},{"$f":"IF('4'!$D30>0,1,0)","v":1},{"$f":"IF('5'!$D30>0,1,0)","v":1},{"$f":"IF('6'!$D30>0,1,0)","v":1},6,{"$f":"IF('7'!$D30>0,1,0)","v":1},{"$f":"IF('8'!$D30>0,1,0)","v":1},{"$f":"IF('9'!$D30>0,1,0)","v":1},{"$f":"IF('10'!$D30>0,1,0)","v":1},{"$f":"IF('11'!$D30>0,1,0)","v":1},{"$f":"IF('12'!$D30>0,1,0)","v":0},5,11]
["Robben, Anja",{"$f":"IF('Wettkampf 1'!D31>0,1,0)","v":1},{"$f":"IF('2'!$D31>0,1,0)","v":1},{"$f":"IF('3'!$D31>0,1,0)","v":1},{"$f":"IF('4'!$D31>0,1,0)","v":1},{"$f":"IF('5'!$D31>0,1,0)","v":1},{"$f":"IF('6'!$D31>0,1,0)","v":1},6,{"$f":"IF('7'!$D31>0,1,0)","v":1},{"$f":"IF('8'!$D31>0,1,0)","v":1},{"$f":"IF('9'!$D31>0,1,0)","v":1},{"$f":"IF('10'!$D31>0,1,0)","v":1},{"$f":"IF('11'!$D31>0,1,0)","v":1},{"$f":"IF('12'!$D31>0,1,0)","v":0},5,11]
["Oldopp, Maria",{"$f":"IF('Wettkampf 1'!D32>0,1,0)","v":1},{"$f":"IF('2'!$D32>0,1,0)","v":1},{"$f":"IF('3'!$D32>0,1,0)","v":1},{"$f":"IF('4'!$D32>0,1,0)","v":1},{"$f":"IF('5'!$D32>0,1,0)","v":1},{"$f":"IF('6'!$D32>0,1,0)","v":1},6,{"$f":"IF('7'!$D32>0,1,0)","v":1},{"$f":"IF('8'!$D32>0,1,0)","v":1},{"$f":"IF('9'!$D32>0,1,0)","v":1},{"$f":"IF('10'!$D32>0,1,0)","v":1},{"$f":"IF('11'!$D32>0,1,0)","v":1},{"$f":"IF('12'!$D32>0,1,0)","v":0},5,11]
["Hanneken, Doris",{"$f":"IF('Wettkampf 1'!D33>0,1,0)","v":1},{"$f":"IF('2'!$D33>0,1,0)","v":1},{"$f":"IF('3'!$D33>0,1,0)","v":1},{"$f":"IF('4'!$D33>0,1,0)","v":1},{"$f":"IF('5'!$D33>0,1,0)","v":1},{"$f":"IF('6'!$D33>0,1,0)","v":1},6,{"$f":"IF('7'!$D33>0,1,0)","v":1},{"$f":"IF('8'!$D33>0,1,0)","v":1},{"$f":"IF('9'!$D33>0,1,0)","v":1},{"$f":"IF('10'!$D33>0,1,0)","v":1},{"$f":"IF('11'!$D33>0,1,0)","v":1},{"$f":"IF('12'!$D33>0,1,0)","v":0},5,11]
["Kuchta, Gertrud",{"$f":"IF('Wettkampf 1'!D34>0,1,0)","v":1},{"$f":"IF('2'!$D34>0,1,0)","v":1},{"$f":"IF('3'!$D34>0,1,0)","v":1},{"$f":"IF('4'!$D34>0,1,0)","v":1},{"$f":"IF('5'!$D34>0,1,0)","v":1},{"$f":"IF('6'!$D34>0,1,0)","v":1},6,{"$f":"IF('7'!$D34>0,1,0)","v":1},{"$f":"IF('8'!$D34>0,1,0)","v":1},{"$f":"IF('9'!$D34>0,1,0)","v":1},{"$f":"IF('10'!$D34>0,1,0)","v":1},{"$f":"IF('11'!$D34>0,1,0)","v":1},{"$f":"IF('12'!$D34>0,1,0)","v":0},5,11]
["Jungsthöfel, Sabine",{"$f":"IF('Wettkampf 1'!D35>0,1,0)","v":1},{"$f":"IF('2'!$D35>0,1,0)","v":1},{"$f":"IF('3'!$D35>0,1,0)","v":1},{"$f":"IF('4'!$D35>0,1,0)","v":1},{"$f":"IF('5'!$D35>0,1,0)","v":1},{"$f":"IF('6'!$D35>0,1,0)","v":1},6,{"$f":"IF('7'!$D35>0,1,0)","v":1},{"$f":"IF('8'!$D35>0,1,0)","v":1},{"$f":"IF('9'!$D35>0,1,0)","v":1},{"$f":"IF('10'!$D35>0,1,0)","v":1},{"$f":"IF('11'!$D35>0,1,0)","v":1},{"$f":"IF('12'!$D35>0,1,0)","v":0},5,11]
["Schwarte, Gundula",{"$f":"IF('Wettkampf 1'!D36>0,1,0)","v":1},{"$f":"IF('2'!$D36>0,1,0)","v":1},{"$f":"IF('3'!$D36>0,1,0)","v":1},{"$f":"IF('4'!$D36>0,1,0)","v":0},{"$f":"IF('5'!$D36>0,1,0)","v":1},{"$f":"IF('6'!$D36>0,1,0)","v":1},5,{"$f":"IF('7'!$D36>0,1,0)","v":1},{"$f":"IF('8'!$D36>0,1,0)","v":1},{"$f":"IF('9'!$D36>0,1,0)","v":1},{"$f":"IF('10'!$D36>0,1,0)","v":1},{"$f":"IF('11'!$D36>0,1,0)","v":1},{"$f":"IF('12'!$D36>0,1,0)","v":0},5,10]
["Geers, Christa",{"$f":"IF('Wettkampf 1'!D37>0,1,0)","v":1},{"$f":"IF('2'!$D37>0,1,0)","v":1},{"$f":"IF('3'!$D37>0,1,0)","v":1},{"$f":"IF('4'!$D37>0,1,0)","v":1},{"$f":"IF('5'!$D37>0,1,0)","v":1},{"$f":"IF('6'!$D37>0,1,0)","v":1},6,{"$f":"IF('7'!$D37>0,1,0)","v":1},{"$f":"IF('8'!$D37>0,1,0)","v":1},{"$f":"IF('9'!$D37>0,1,0)","v":1},{"$f":"IF('10'!$D37>0,1,0)","v":1},{"$f":"IF('11'!$D37>0,1,0)","v":1},{"$f":"IF('12'!$D37>0,1,0)","v":0},5,11]
["Remmers, Tanja",{"$f":"IF('Wettkampf 1'!D38>0,1,0)","v":1},{"$f":"IF('2'!$D38>0,1,0)","v":1},{"$f":"IF('3'!$D38>0,1,0)","v":1},{"$f":"IF('4'!$D38>0,1,0)","v":1},{"$f":"IF('5'!$D38>0,1,0)","v":1},{"$f":"IF('6'!$D38>0,1,0)","v":0},5,{"$f":"IF('7'!$D38>0,1,0)","v":1},{"$f":"IF('8'!$D38>0,1,0)","v":1},{"$f":"IF('9'!$D38>0,1,0)","v":1},{"$f":"IF('10'!$D38>0,1,0)","v":1},{"$f":"IF('11'!$D38>0,1,0)","v":1},{"$f":"IF('12'!$D38>0,1,0)","v":0},5,10]
["Terhalle, Johanna",{"$f":"IF('Wettkampf 1'!D39>0,1,0)","v":1},{"$f":"IF('2'!$D39>0,1,0)","v":1},{"$f":"IF('3'!$D39>0,1,0)","v":1},{"$f":"IF('4'!$D39>0,1,0)","v":1},{"$f":"IF('5'!$D39>0,1,0)","v":1},{"$f":"IF('6'!$D39>0,1,0)","v":1},6,{"$f":"IF('7'!$D39>0,1,0)","v":1},{"$f":"IF('8'!$D39>0,1,0)","v":1},{"$f":"IF('9'!$D39>0,1,0)","v":1},{"$f":"IF('10'!$D39>0,1,0)","v":1},{"$f":"IF('11'!$D39>0,1,0)","v":1},{"$f":"IF('12'!$D39>0,1,0)","v":0},5,11]
["Hackstette, Lena",{"$f":"IF('Wettkampf 1'!D40>0,1,0)","v":1},{"$f":"IF('2'!$D40>0,1,0)","v":1},{"$f":"IF('3'!$D40>0,1,0)","v":1},{"$f":"IF('4'!$D40>0,1,0)","v":1},{"$f":"IF('5'!$D40>0,1,0)","v":1},{"$f":"IF('6'!$D40>0,1,0)","v":1},{"$f":"B39+C39+D39+E39+F39+G39","v":6},{"$f":"IF('7'!$D40>0,1,0)","v":1},{"$f":"IF('8'!$D40>0,1,0)","v":1},{"$f":"IF('9'!$D40>0,1,0)","v":1},{"$f":"IF('10'!$D40>0,1,0)","v":1},{"$f":"IF('11'!$D40>0,1,0)","v":1},{"$f":"IF('12'!$D40>0,1,0)","v":0},{"$f":"I39+J39+K39+L39+M39+N39","v":5},{"$f":"O39+H39","v":11}]
["Thyen, Christel",{"$f":"IF('Wettkampf 1'!D41>0,1,0)","v":1},{"$f":"IF('2'!$D41>0,1,0)","v":1},{"$f":"IF('3'!$D41>0,1,0)","v":1},{"$f":"IF('4'!$D41>0,1,0)","v":1},{"$f":"IF('5'!$D41>0,1,0)","v":1},{"$f":"IF('6'!$D41>0,1,0)","v":1},6,{"$f":"IF('7'!$D41>0,1,0)","v":1},{"$f":"IF('8'!$D41>0,1,0)","v":1},{"$f":"IF('9'!$D41>0,1,0)","v":1},{"$f":"IF('10'!$D41>0,1,0)","v":1},{"$f":"IF('11'!$D41>0,1,0)","v":1},{"$f":"IF('12'!$D41>0,1,0)","v":0},5,11]
["Ostermann, Hildegard",{"$f":"IF('Wettkampf 1'!D42>0,1,0)","v":1},{"$f":"IF('2'!$D42>0,1,0)","v":1},{"$f":"IF('3'!$D42>0,1,0)","v":1},{"$f":"IF('4'!$D42>0,1,0)","v":1},{"$f":"IF('5'!$D42>0,1,0)","v":1},{"$f":"IF('6'!$D42>0,1,0)","v":1},6,{"$f":"IF('7'!$D42>0,1,0)","v":1},{"$f":"IF('8'!$D42>0,1,0)","v":1},{"$f":"IF('9'!$D42>0,1,0)","v":1},{"$f":"IF('10'!$D42>0,1,0)","v":1},{"$f":"IF('11'!$D42>0,1,0)","v":1},{"$f":"IF('12'!$D42>0,1,0)","v":0},5,11]
["Willoh, Henrika",{"$f":"IF('Wettkampf 1'!D43>0,1,0)","v":1},{"$f":"IF('2'!$D43>0,1,0)","v":1},{"$f":"IF('3'!$D43>0,1,0)","v":1},{"$f":"IF('4'!$D43>0,1,0)","v":1},{"$f":"IF('5'!$D43>0,1,0)","v":1},{"$f":"IF('6'!$D43>0,1,0)","v":1},6,{"$f":"IF('7'!$D43>0,1,0)","v":1},{"$f":"IF('8'!$D43>0,1,0)","v":1},{"$f":"IF('9'!$D43>0,1,0)","v":1},{"$f":"IF('10'!$D43>0,1,0)","v":1},{"$f":"IF('11'!$D43>0,1,0)","v":1},{"$f":"IF('12'!$D43>0,1,0)","v":0},5,11]
["Müller, Anita",{"$f":"IF('Wettkampf 1'!D44>0,1,0)","v":1},{"$f":"IF('2'!$D44>0,1,0)","v":1},{"$f":"IF('3'!$D44>0,1,0)","v":1},{"$f":"IF('4'!$D44>0,1,0)","v":1},{"$f":"IF('5'!$D44>0,1,0)","v":1},{"$f":"IF('6'!$D44>0,1,0)","v":1},6,{"$f":"IF('7'!$D44>0,1,0)","v":1},{"$f":"IF('8'!$D44>0,1,0)","v":1},{"$f":"IF('9'!$D44>0,1,0)","v":1},{"$f":"IF('10'!$D44>0,1,0)","v":1},{"$f":"IF('11'!$D44>0,1,0)","v":1},{"$f":"IF('12'!$D44>0,1,0)","v":0},5,11]
["Wilken, Elena",{"$f":"IF('Wettkampf 1'!D45>0,1,0)","v":1},{"$f":"IF('2'!$D45>0,1,0)","v":1},{"$f":"IF('3'!$D45>0,1,0)","v":1},{"$f":"IF('4'!$D45>0,1,0)","v":1},{"$f":"IF('5'!$D45>0,1,0)","v":1},{"$f":"IF('6'!$D45>0,1,0)","v":1},6,{"$f":"IF('7'!$D45>0,1,0)","v":1},{"$f":"IF('8'!$D45>0,1,0)","v":1},{"$f":"IF('9'!$D45>0,1,0)","v":1},{"$f":"IF('10'!$D45>0,1,0)","v":1},{"$f":"IF('11'!$D45>0,1,0)","v":1},{"$f":"IF('12'!$D45>0,1,0)","v":0},5,11]
[null,{"$f":"SUM(B9:B44)","v":{"v":35,"d":"35.00"}},{"$f":"SUM(C9:C44)","v":{"v":35,"d":"35.00"}},{"v":35,"d":"35.00"},{"v":33,"d":"33.00"},{"v":33,"d":"33.00"},{"v":32,"d":"32.00"},{"$f":"SUM(H9:H38)","v":{"v":167,"d":"167.00"}},{"$f":"SUM(I9:I44)","v":{"v":32,"d":"32.00"}},{"$f":"SUM(J9:J44)","v":{"v":31,"d":"31.00"}},{"v":31,"d":"31.00"},{"v":31,"d":"31.00"},{"v":31,"d":"31.00"},{"v":0,"d":"0.00"},{"$f":"SUM(O9:O44)","v":{"v":156,"d":"156.00"}},{"$f":"SUM(P9:P44)","v":{"v":359,"d":"359.00"}}]

{"sheet":"Übersicht Gruppen","index":17,"n_rows":7,"n_cols":20,"rows_kept":7,"hidden":true}
[]
[null,"Esterwegen V",{"$f":"VLOOKUP($B$2:$B$7,'Wettkampf 1'!$B$2:$D$7,3,FALSE)","v":{"v":931.0999999999999,"d":"931.1"}},{"$f":"VLOOKUP($B$2:$B$7,'2'!$B$2:$D$7,3,FALSE)","v":940.1},{"$f":"VLOOKUP($B$2:$B$7,'3'!$B$2:$D$7,3,FALSE)","v":934.7},{"$f":"VLOOKUP($B$2:$B$7,'4'!$B$2:$D$7,3,FALSE)","v":{"v":934,"d":"934.0"}},{"$f":"VLOOKUP($B$2:$B$7,'5'!$B$2:$D$7,3,FALSE)","v":{"v":935.8000000000001,"d":"935.8"}},{"$f":"VLOOKUP($B$2:$B$7,'6'!$B$2:$D$7,3,FALSE)","v":933.2},{"$f":"J2/Formelhilfe!H6","v":{"v":934.8166666666666,"d":"934.8"}},{"$f":"SUM(C2:H2)","v":{"v":5608.9,"d":"5,608.9"}},{"$f":"VLOOKUP($B$2:$B$7,'7'!$B$2:$D$7,3,FALSE)","v":938.1},{"$f":"VLOOKUP($B$2:$B$7,'8'!$B$2:$D$7,3,FALSE)","v":938.2},{"$f":"VLOOKUP($B$2:$B$7,'9'!$B$2:$D$7,3,FALSE)","v":932.4},{"$f":"VLOOKUP($B$2:$B$7,'10'!$B$2:$D$7,3,FALSE)","v":937.8},{"$f":"VLOOKUP($B$2:$B$7,'11'!$B$2:$D$7,3,FALSE)","v":934.2},{"$f":"VLOOKUP($B$2:$B$7,'12'!$B$2:$D$7,3,FALSE)","v":{"v":0,"d":"0.0"}},{"$f":"R2/Formelhilfe!O6","v":{"v":936.14,"d":"936.1"}},{"$f":"SUM(K2:P2)","v":{"v":4680.7,"d":"4,680.7"}},{"$f":"T2/Formelhilfe!P6","v":{"v":935.4181818181819,"d":"935.4"}},{"$f":"SUM(C2:H2,K2:P2)","v":{"v":10289.6,"d":"10,289.6"}}]
[null,"Lahn III",{"$f":"VLOOKUP($B$2:$B$7,'Wettkampf 1'!$B$2:$D$7,3,FALSE)","v":928.5},{"$f":"VLOOKUP($B$2:$B$7,'2'!$B$2:$D$7,3,FALSE)","v":{"v":919.0000000000001,"d":"919.0"}},{"$f":"VLOOKUP($B$2:$B$7,'3'!$B$2:$D$7,3,FALSE)","v":922.7},{"$f":"VLOOKUP($B$2:$B$7,'4'!$B$2:$D$7,3,FALSE)","v":{"v":933.4000000000001,"d":"933.4"}},{"$f":"VLOOKUP($B$2:$B$7,'5'!$B$2:$D$7,3,FALSE)","v":937.2},{"$f":"VLOOKUP($B$2:$B$7,'6'!$B$2:$D$7,3,FALSE)","v":{"v":923.5999999999999,"d":"923.6"}},{"$f":"J3/Formelhilfe!H2","v":927.4},{"$f":"SUM(C3:H3)","v":{"v":5564.4,"d":"5,564.4"}},{"$f":"VLOOKUP($B$2:$B$7,'7'!$B$2:$D$7,3,FALSE)","v":{"v":931.4999999999999,"d":"931.5"}},{"$f":"VLOOKUP($B$2:$B$7,'8'!$B$2:$D$7,3,FALSE)","v":{"v":922.0000000000001,"d":"922.0"}},{"$f":"VLOOKUP($B$2:$B$7,'9'!$B$2:$D$7,3,FALSE)","v":{"v":921.6999999999999,"d":"921.7"}},{"$f":"VLOOKUP($B$2:$B$7,'10'!$B$2:$D$7,3,FALSE)","v":928.8},{"$f":"VLOOKUP($B$2:$B$7,'11'!$B$2:$D$7,3,FALSE)","v":{"v":923.9000000000001,"d":"923.9"}},{"$f":"VLOOKUP($B$2:$B$7,'12'!$B$2:$D$7,3,FALSE)","v":{"v":0,"d":"0.0"}},{"$f":"R3/Formelhilfe!O2","v":{"v":925.5799999999999,"d":"925.6"}},{"$f":"SUM(K3:P3)","v":{"v":4627.9,"d":"4,627.9"}},{"$f":"T3/Formelhilfe!P2","v":{"v":926.5727272727272,"d":"926.6"}},{"$f":"SUM(C3:H3,K3:P3)","v":{"v":10192.3,"d":"10,192.3"}}]
[null,"Lahn IV",{"$f":"VLOOKUP($B$2:$B$7,'Wettkampf 1'!$B$2:$D$7,3,FALSE)","v":922.7},{"$f":"VLOOKUP($B$2:$B$7,'2'!$B$2:$D$7,3,FALSE)","v":919.2},{"$f":"VLOOKUP($B$2:$B$7,'3'!$B$2:$D$7,3,FALSE)","v":{"v":920.0999999999999,"d":"920.1"}},{"$f":"VLOOKUP($B$2:$B$7,'4'!$B$2:$D$7,3,FALSE)","v":{"v":925.4000000000001,"d":"925.4"}},{"$f":"VLOOKUP($B$2:$B$7,'5'!$B$2:$D$7,3,FALSE)","v":930.5},{"$f":"VLOOKUP($B$2:$B$7,'6'!$B$2:$D$7,3,FALSE)","v":929.6},{"$f":"J4/Formelhilfe!H3","v":{"v":924.5833333333334,"d":"924.6"}},{"$f":"SUM(C4:H4)","v":{"v":5547.5,"d":"5,547.5"}},{"$f":"VLOOKUP($B$2:$B$7,'7'!$B$2:$D$7,3,FALSE)","v":{"v":925.5999999999999,"d":"925.6"}},{"$f":"VLOOKUP($B$2:$B$7,'8'!$B$2:$D$7,3,FALSE)","v":924.4},{"$f":"VLOOKUP($B$2:$B$7,'9'!$B$2:$D$7,3,FALSE)","v":928.4},{"$f":"VLOOKUP($B$2:$B$7,'10'!$B$2:$D$7,3,FALSE)","v":{"v":935,"d":"935.0"}},{"$f":"VLOOKUP($B$2:$B$7,'11'!$B$2:$D$7,3,FALSE)","v":{"v":925,"d":"925.0"}},{"$f":"VLOOKUP($B$2:$B$7,'12'!$B$2:$D$7,3,FALSE)","v":{"v":0,"d":"0.0"}},{"$f":"R4/Formelhilfe!O3","v":{"v":927.68,"d":"927.7"}},{"$f":"SUM(K4:P4)","v":{"v":4638.4,"d":"4,638.4"}},{"$f":"T4/Formelhilfe!P3","v":{"v":925.9909090909091,"d":"926.0"}},{"$f":"SUM(C4:H4,K4:P4)","v":{"v":10185.9,"d":"10,185.9"}}]
[null,"Neuvrees II",{"$f":"VLOOKUP($B$2:$B$7,'Wettkampf 1'!$B$2:$D$7,3,FALSE)","v":919.3},{"$f":"VLOOKUP($B$2:$B$7,'2'!$B$2:$D$7,3,FALSE)","v":923.3},{"$f":"VLOOKUP($B$2:$B$7,'3'!$B$2:$D$7,3,FALSE)","v":{"v":925.0999999999999,"d":"925.1"}},{"$f":"VLOOKUP($B$2:$B$7,'4'!$B$2:$D$7,3,FALSE)","v":{"v":925.1999999999999,"d":"925.2"}},{"$f":"VLOOKUP($B$2:$B$7,'5'!$B$2:$D$7,3,FALSE)","v":923.2},{"$f":"VLOOKUP($B$2:$B$7,'6'!$B$2:$D$7,3,FALSE)","v":920.9},{"$f":"J5/Formelhilfe!H4","v":{"v":922.8333333333331,"d":"922.8"}},{"$f":"SUM(C5:H5)","v":{"v":5536.999999999999,"d":"5,537.0"}},{"$f":"VLOOKUP($B$2:$B$7,'7'!$B$2:$D$7,3,FALSE)","v":{"v":922.5999999999999,"d":"922.6"}},{"$f":"VLOOKUP($B$2:$B$7,'8'!$B$2:$D$7,3,FALSE)","v":{"v":916.3000000000001,"d":"916.3"}},{"$f":"VLOOKUP($B$2:$B$7,'9'!$B$2:$D$7,3,FALSE)","v":925.6},{"$f":"VLOOKUP($B$2:$B$7,'10'!$B$2:$D$7,3,FALSE)","v":924.4},{"$f":"VLOOKUP($B$2:$B$7,'11'!$B$2:$D$7,3,FALSE)","v":932.8},{"$f":"VLOOKUP($B$2:$B$7,'12'!$B$2:$D$7,3,FALSE)","v":{"v":0,"d":"0.0"}},{"$f":"R5/Formelhilfe!O4","v":{"v":924.3399999999999,"d":"924.3"}},{"$f":"SUM(K5:P5)","v":{"v":4621.7,"d":"4,621.7"}},{"$f":"T5/Formelhilfe!P4","v":{"v":923.5181818181816,"d":"923.5"}},{"$f":"SUM(C5:H5,K5:P5)","v":{"v":10158.699999999997,"d":"10,158.7"}}]
[null,"Börger II",{"$f":"VLOOKUP($B$2:$B$7,'Wettkampf 1'!$B$2:$D$7,3,FALSE)","v":{"v":925.9999999999999,"d":"926.0"}},{"$f":"VLOOKUP($B$2:$B$7,'2'!$B$2:$D$7,3,FALSE)","v":916.2},{"$f":"VLOOKUP($B$2:$B$7,'3'!$B$2:$D$7,3,FALSE)","v":911.7},{"$f":"VLOOKUP($B$2:$B$7,'4'!$B$2:$D$7,3,FALSE)","v":922.4},{"$f":"VLOOKUP($B$2:$B$7,'5'!$B$2:$D$7,3,FALSE)","v":925.5},{"$f":"VLOOKUP($B$2:$B$7,'6'!$B$2:$D$7,3,FALSE)","v":930.4},{"$f":"J6/Formelhilfe!H5","v":{"v":922.0333333333332,"d":"922.0"}},{"$f":"SUM(C6:H6)","v":{"v":5532.199999999999,"d":"5,532.2"}},{"$f":"VLOOKUP($B$2:$B$7,'7'!$B$2:$D$7,3,FALSE)","v":923.6},{"$f":"VLOOKUP($B$2:$B$7,'8'!$B$2:$D$7,3,FALSE)","v":{"v":923.1999999999999,"d":"923.2"}},{"$f":"VLOOKUP($B$2:$B$7,'9'!$B$2:$D$7,3,FALSE)","v":{"v":919.5999999999999,"d":"919.6"}},{"$f":"VLOOKUP($B$2:$B$7,'10'!$B$2:$D$7,3,FALSE)","v":{"v":922.0999999999999,"d":"922.1"}},{"$f":"VLOOKUP($B$2:$B$7,'11'!$B$2:$D$7,3,FALSE)","v":{"v":929.4000000000001,"d":"929.4"}},{"$f":"VLOOKUP($B$2:$B$7,'12'!$B$2:$D$7,3,FALSE)","v":{"v":0,"d":"0.0"}},{"$f":"R6/Formelhilfe!O5","v":{"v":923.5799999999999,"d":"923.6"}},{"$f":"SUM(K6:P6)","v":{"v":4617.9,"d":"4,617.9"}},{"$f":"T6/Formelhilfe!P5","v":{"v":922.7363636363635,"d":"922.7"}},{"$f":"SUM(C6:H6,K6:P6)","v":{"v":10150.099999999999,"d":"10,150.1"}}]
[null,"Börger III",{"$f":"VLOOKUP($B$2:$B$7,'Wettkampf 1'!$B$2:$D$7,3,FALSE)","v":924.8},{"$f":"VLOOKUP($B$2:$B$7,'2'!$B$2:$D$7,3,FALSE)","v":{"v":924,"d":"924.0"}},{"$f":"VLOOKUP($B$2:$B$7,'3'!$B$2:$D$7,3,FALSE)","v":910.6},{"$f":"VLOOKUP($B$2:$B$7,'4'!$B$2:$D$7,3,FALSE)","v":920.3},{"$f":"VLOOKUP($B$2:$B$7,'5'!$B$2:$D$7,3,FALSE)","v":925.2},{"$f":"VLOOKUP($B$2:$B$7,'6'!$B$2:$D$7,3,FALSE)","v":{"v":917,"d":"917.0"}},{"$f":"J7/Formelhilfe!H7","v":{"v":920.3166666666666,"d":"920.3"}},{"$f":"SUM(C7:H7)","v":{"v":5521.9,"d":"5,521.9"}},{"$f":"VLOOKUP($B$2:$B$7,'7'!$B$2:$D$7,3,FALSE)","v":924.8},{"$f":"VLOOKUP($B$2:$B$7,'8'!$B$2:$D$7,3,FALSE)","v":913.1},{"$f":"VLOOKUP($B$2:$B$7,'9'!$B$2:$D$7,3,FALSE)","v":{"v":925.4000000000001,"d":"925.4"}},{"$f":"VLOOKUP($B$2:$B$7,'10'!$B$2:$D$7,3,FALSE)","v":915.2},{"$f":"VLOOKUP($B$2:$B$7,'11'!$B$2:$D$7,3,FALSE)","v":{"v":919.6999999999999,"d":"919.7"}},{"$f":"VLOOKUP($B$2:$B$7,'12'!$B$2:$D$7,3,FALSE)","v":{"v":0,"d":"0.0"}},{"$f":"R7/Formelhilfe!O7","v":{"v":919.64,"d":"919.6"}},{"$f":"SUM(K7:P7)","v":{"v":4598.2,"d":"4,598.2"}},{"$f":"T7/Formelhilfe!P7","v":{"v":920.0090909090911,"d":"920.0"}},{"$f":"SUM(C7:H7,K7:P7)","v":{"v":10120.100000000002,"d":"10,120.1"}}]